v119es,v119es2,v117es,v117es2,v116es,v116es2,Clave de la entidad,Clave del municipio,Clave de la localidad,loc,paste,folio,foliob,enti,cent,muni,cmun,nomloc,Clave de la localidad,Clave del centro de salud,Clave unica de establecimiento,Tipo de comunidad,Tipo de centro de salud,Grupo etnico cominante,traduc,Resultado,Observaciones,motcs,motcses,ini_hr,ini_min,fin_hr,fin_min,cvesup,fchasup,nomcod,cvecod,fchacod,nomcap,cvecap,fchacap,v009,v010,v011,v012a,v012b,v012c,v012ces,v012d,v013a,v013b,v013c,v014a,v014b,v014c,v015,v016,v017,v017es,v018,v018es,v019,v020,v020es,v021,v022a,v022b,v022c,v022d,v022e,v022f,v022g,v022h,v022i,v022j,v022k,v022l,v022m,v022n,v0220,v022p,v022pa,v023,v024a,v024b,v024es,v025,v026,v027,v028,v029,v029otr,v030mes,v030ano,v031,v032,v033,v034,v035,v036,v037mes,v037ano,v038,v039,v040,v041,v042,v043,v044mes,v044ano,v045,v045es,v046a,v046b,v047,v048,v049,v050,v051,v052,v052es,v053,v054,v055,v056,v056es,v057,v058a,v058b,v058c,v058d,v058r1,v058r2,v058r3,v058r4,v059a,v059b,v059c,v059d,v059e,v059f,v059es,v060,v061,v061es,v062,v062es,v063,v064,v065,v065es,v066a,v066b,v067hr,v067mi,v068hr,v068mi,v06768,v069a,v069b,v069c,v069es,v070,v071,v072a,v072b,v073,v073es,v074,v075,v076,v077,v078a,v078b,v079,v080,v081,v082,v083,v084a,v084b,v084c,v084d,v084e,v084es1,v084es2,v085a,v085b,v085c,v085d,v085e,v085f,v086a,v086b,v086c,v086d,v086e,v086f,v087a,v087aa,v087b,v087bb,v087c,v087cc,v087d,v087dd,v087e,v087ee,v087f,v087ff,v088,v089a,v089b,v089c,v089fam,v089otr,v090,v091a,v091b,v091c,v091d,v092a,v092aa,v092b,v092bb,v092c,v092cc,v092d,v092dd,v092es,v093,v094,v095,v096a,v096b,v097a,v097b,v097c,v097d,v097e,v097es,v098a,v098b,v098c,v098d,v098e,v098f,v098g,v098es,v099a,v099b,v099c,v099es,v100a,v100b,v100c,v100d,v100e,v100f,v100g,v100h,v100i,v100j,v100k,v100l,v100ll,v100m,v100n,v100nn,v100o,v100p,v100q,v100r,v100s,v100t,v100u,v100v,v100w,v100x,v100y,v100z,v100aa,v100bb,v100cc,v100dd,v100ee,v101a,v101b,v101c,v101es,v102a,v102b,v102c,v102eda,v103aa,v103ab,v103ac,v103ad,v103ae,v103af,v103ag,v103ba,v103bb,v103bc,v103bd,v103be,v103bf,v103bg,v103ca,v103cb,v103cc,v103cd,v103ce,v103cf,v103cg,v103da,v103db,v103dc,v103dd,v103de,v103df,v103dg,v103ea,v103eb,v103ec,v103ed,v103ee,v103ef,v103eg,v103fa,v103fb,v103fc,v103fd,v103fe,v103ff,v103fg,v103ga,v103gb,v103gc,v103gd,v103ge,v103gf,v103gg,v104a,v104aa,v104b,v104ab,v104c,v104ac,v104d,v104ad,v104e,v104ae,v104f,v104af,v104g,v104ag,v104h,v104ah,v104i,v104ai,v104j,v104aj,v104jes,v104jj,v104k,v104ak,v104kes,v104l,v104m,v104am,v105,v105dia,v106,v107,v108,v109a,v109b,v110a,v110b,v111a,v111b,v112,v113a,v113b,v114a,v114b,v115,v116,v117,v118,v119,v120,v121,v121es,v122,v123,v123es,v124,v124es,v125a,v125a2,v125b,v125b2,v125c,v125c2,v125d,v125d2,v125e,v125e2,v125f,v125f2,v125rb,v125rc,v125rd,v125re,v125rf,v125fes,v125rcu,v125res
.,,.,,.,,31,102,75,75,31-102-0075,1,01-ene,YUCATAN,31,VALLADOLID,102,PIXOY,75,516,YNSSA001516,2,1,MAYA,2,1,.,3,.,1,0,1,40,,04/09/2006,,,,.,,.,7,1,,1,1,2,.,1,720,88888,,1,,,1,1,1,.,2,.,2,6,.,1,2,1,2,2,2,2,2,2,2,2,2,2,1,1,2,2,,2,,,.,,,,,1,.,,,1,5,1,1,18,1,,19,1,1,1,1,2,,,,,.,,,,1,2,,,,.,2,2,2,,.,5,5,,,,1,,,,,,,,,,.,18,2,.,3,.,5,6,,.,,,6,0,22,0,16,4,,,.,1,2,4,300,4,.,1,4,2,2,2,2,,1,4,2,2,,,,,,.,.,2,2,2,2,2,2,,,,,,,,,,,,,,,,,,,2,,,,.,.,2,2,2,2,2,,,,,,,,,.,,,,,,,,,,,,,,,,,,,.,,,,.,4,4,4,4,4,4,4,4,4,4,4,4,4,4,4,4,4,4,4,4,4,4,4,4,4,4,4,4,4,4,4,4,4,,,,.,1,,,,,,,,,,,,,,,,,,,,,,,,,,,,,,,,,,,,,,,,,,,,,,,,,,,,,,,,,,,,,,,,,,,,,,,,,.,,,,,,,,,,,,,,,,,,,,,,,,,,,,,2,,.,2,,.,,.,0,0,0,0,0,0,0,0,0,0,0,0,,,98,98,,.,.,.
.,,.,,.,,31,102,75,75,31-102-0075,2,02-ene,YUCATAN,31,VALLADOLID,102,PIXOY,75,516,YNSSA001516,2,1,MAYA,2,1,.,3,.,4,24,5,0,,04/09/2006,,,,.,,.,5,1,,1,2,2,.,2,320,,,1,,,1,1,3,.,4,LADRILLO,2,6,.,1,2,1,2,2,2,2,2,2,2,2,1,1,2,2,2,2,,1,2,,.,13,1,500,1,1,.,,,1,5,1,1,14,2,,14,2,1,3,1,1,,,,,.,,,,1,2,,,,.,1,2,2,,.,3,3,,,,1,,,,,,,,,,.,15,2,.,3,.,5,6,,.,,,6,0,20,0,14,2,,,.,1,2,77,,1,.,2,,,,,,,1,4,2,2,,,,,,.,.,1,2,,,,,2,,,,,,1,,,,,,,,,,,,2,,,,.,.,2,2,2,1,2,,,,,1,,,,.,,,,,,,,,,,,,,,,,,,.,,,,.,4,4,4,4,4,4,4,4,4,4,4,4,4,4,4,4,4,4,4,4,4,4,4,4,4,4,1,3,4,4,4,4,4,2,,,.,1,,,,,,,,,,,,,,,,,,,,,,,,,,,,,,,,,,,,,,,,,,,,,,,,,,,,,,,,,,,,,,,,,,,,,,,,,.,,,,,,,,,,,,,,,,,,,,,,,,,,,,,1,1,.,2,,.,,.,0,0,0,0,0,0,0,0,0,0,0,0,,,98,98,,.,.,.
.,,.,,.,,31,102,75,75,31-102-0075,3,03-ene,YUCATAN,31,VALLADOLID,102,PIXOY,75,516,YNSSA001516,2,1,MAYA,2,1,.,4,"PESO, TALLA DE NIETO",8,50,9,40,,05/09/2006,,,,.,,.,11,1,,1,2,2,.,1,320,,,1,,,3,2,1,.,1,.,4,6,.,1,2,1,2,2,1,2,2,1,2,1,1,2,1,1,1,2,,2,,,.,,,,,1,.,,,1,5,1,1,14,1,,31,1,1,3,1,2,,,,,.,,,,1,2,,,,.,1,1,1,1,.,10,10,,,,1,,,,,,,,,,.,15,1,.,2,.,5,6,,.,,,5,0,21,0,16,4,,,.,2,4,1,0,4,.,1,4,2,2,2,2,,1,4,2,2,,,,,,.,.,2,2,2,2,2,2,,,,,,,,,,,,,,,,,,,2,,,,.,.,2,2,2,2,2,,,,,,,,,.,,,,,,,,,,,,,,,,,,,.,,,,.,4,4,4,4,4,4,4,4,4,4,4,4,4,4,4,4,4,4,4,4,4,4,4,4,4,4,4,4,4,4,4,4,4,,,,.,1,,,,,,,,,,,,,,,,,,,,,,,,,,,,,,,,,,,,,,,,,,,,,,,,,,,,,,,,,,,,,,,,,,,,,,,,,.,,,,,,,,,,,,,,,,,,,,,,,,,,,,,1,1,.,2,,.,,.,0,0,0,0,0,0,0,0,0,0,0,0,,,98,98,,.,.,.
.,,.,,.,,31,102,75,75,31-102-0075,4,04-ene,YUCATAN,31,VALLADOLID,102,PIXOY,75,516,YNSSA001516,2,1,MAYA,2,1,.,4,ASEO DE LA CLINICA,9,45,10,20,,05/09/2006,,,,.,,.,3,1,,1,2,2,.,1,330,,,1,,,1,1,1,.,1,.,4,3,.,1,2,1,2,2,2,2,2,2,2,2,2,2,2,2,2,2,,2,,,.,,,,,1,.,,,1,5,1,1,17,1,,38,1,1,3,1,2,,,,,.,,,,1,2,,,,.,1,2,1,4,.,8,2,,4,2,1,3,4,,3,,,,,,.,17,1,.,4,PARTICULAR,5,6,,.,,,4,0,20,0,16,4,,,.,2,4,1,0,5,.,2,,,,,,,2,,,2,,,,,,.,.,2,1,2,2,2,2,,1,,,,,,,1,,,,,,,,,,2,,,,.,.,2,2,2,2,2,,,,,,,,,.,,,,,,,,,,,,,,,,,,,.,,,,.,4,4,4,4,4,4,4,4,4,4,4,4,4,4,4,4,4,4,4,4,4,4,4,4,4,4,4,4,4,4,4,4,4,,,,.,1,,,,,,,,,,,,,,,,,,,,,,,,,,,,,,,,,,,,,,,,,,,,,,,,,,,,,,,,,,,,,,,,,,,,,,,,,.,,,,,,,,,,,,,,,,,,,,,,,,,,,,,1,2,.,2,,.,,.,0,0,0,0,0,0,0,0,0,0,0,0,,,98,98,,.,.,.
.,,.,,.,,31,102,75,75,31-102-0075,5,05-ene,YUCATAN,31,VALLADOLID,102,PIXOY,75,516,YNSSA001516,2,1,MAYA,2,1,.,4,"PESO, TALLA DE HIJA",10,45,11,15,,05/09/2006,,,,.,,.,4,1,,1,2,2,.,2,360,,,1,,,1,1,1,.,2,.,2,6,.,1,2,1,1,2,2,2,2,2,2,2,2,1,1,2,2,2,,1,2,,.,1,1,800,0,1,.,,,1,5,1,1,19,1,,7,1,1,1,1,2,,,,,.,,,,1,2,,,,.,1,2,1,3,.,2,2,,,,1,,,,,,,,,,.,19,1,.,2,.,5,6,,.,,,5,0,21,0,16,5,,,.,1,2,4,800,5,.,1,3,2,2,2,2,,1,4,2,2,,,,,,.,.,2,2,2,2,2,2,,,,,,,,,,,,,,,,,,,2,,,,.,.,2,2,2,2,2,,,,,,,,,.,,,,,,,,,,,,,,,,,,,.,,,,.,4,4,4,4,4,4,4,4,4,4,4,4,4,4,4,4,4,4,4,4,4,4,4,4,4,4,4,4,4,4,4,4,4,,,,.,1,,,,,,,,,,,,,,,,,,,,,,,,,,,,,,,,,,,,,,,,,,,,,,,,,,,,,,,,,,,,,,,,,,,,,,,,,.,,,,,,,,,,,,,,,,,,,,,,,,,,,,,2,,.,2,,.,,.,0,0,0,0,0,0,0,0,0,0,0,0,,,98,98,,.,.,.
.,,.,,.,,31,102,75,75,31-102-0075,6,06-ene,YUCATAN,31,VALLADOLID,102,PIXOY,75,516,YNSSA001516,2,1,MAYA,2,1,.,3,.,11,35,12,8,,05/09/2006,,,,.,,.,6,1,,1,2,2,.,1,360,,,1,,,1,1,1,.,2,.,2,6,.,1,2,2,2,2,2,2,2,2,2,2,2,2,2,2,2,2,,2,,,.,,,,,1,.,,,1,5,1,1,20,1,,8,1,1,3,1,2,,,,,.,,,,1,2,,,,.,1,2,1,1,.,5,4,,,1,1,4,,,4,,,,,,.,20,1,.,2,.,5,6,,.,,,5,0,21,0,16,4,,,.,2,4,1,0,4,.,1,4,2,2,2,2,,2,,,2,,,,,,.,.,2,2,2,2,2,2,,,,,,,,,,,,,,,,,,,1,8,,,.,DESCONOCIDO,2,2,2,2,2,,,,,,,,,.,,,,,,,,,,,,,,,,,,,.,,,,.,4,4,4,4,4,4,4,4,4,4,4,4,4,4,4,4,4,4,4,4,4,4,4,4,4,4,4,4,4,4,4,4,4,,,,.,10,,,15,,,,,,,,,,,,,,,,,,,,,,,,,,,,,,,,,,,,,,,,,,,,,,,,,,,,,,,,,,,,,,,,,,,,,,.,,,,,,,,,,,,,,,,,,,,,,,,,,,,,1,1,.,2,,.,,.,1,1,0,0,0,0,0,0,0,0,0,0,,,98,98,,.,.,.
.,,.,,.,,31,102,75,75,31-102-0075,7,07-ene,YUCATAN,31,VALLADOLID,102,PIXOY,75,516,YNSSA001516,2,1,MAYA,2,1,.,4,ACOMPA?O A SU ESPOSO,1,5,1,30,,05/09/2006,,,,.,,.,4,1,,1,1,2,.,2,360,1060,,1,3,,1,1,1,.,2,.,3,6,.,1,2,1,2,2,2,2,2,2,2,1,1,1,1,1,2,2,,1,2,,.,3,1,1500,1,1,.,,,1,5,1,1,17,1,,11,1,1,3,1,2,,,,,.,,,,1,2,,,,.,2,2,2,,.,2,2,,,,1,,,,,,,,,,.,19,1,.,2,.,5,4,4,.,1,0,5,0,22,0,17,5,,,.,1,2,4,500,5,.,1,4,2,2,2,2,,2,,,2,,,,,,.,.,2,1,2,2,2,2,,2,,,,,,,1,2,,,,,,,,,2,,,,.,.,2,2,2,2,2,,,,,,,,,.,,,,,,,,,,,,,,,,,,,.,,,,.,4,4,4,4,3,4,4,1,4,4,4,4,4,4,4,4,4,4,4,4,4,4,4,4,4,4,4,4,4,4,4,4,4,5,,,.,1,,,,,,,,,,,,,,,,,,,,,,,,,,,,,,,,,,,,,,,,,,,,,,,,,,,,,,,,,,,,,,,,,,,,,,,,,.,,,,,,,,,,,,,,,,,,,,,,,,,,,,,2,,.,2,,.,,.,1,1,0,0,0,0,0,0,0,0,0,0,,,98,98,,.,.,.
.,,.,,.,,31,102,75,75,31-102-0075,8,08-ene,YUCATAN,31,VALLADOLID,102,PIXOY,75,516,YNSSA001516,2,1,MAYA,2,1,.,4,PLATICAS OPORTUNIDAD,1,35,2,4,,05/09/2006,,,,.,,.,6,1,,1,1,2,.,1,500,2600,,1,3,,1,1,1,.,1,.,1,3,.,1,2,1,2,2,2,2,2,1,2,2,2,2,2,1,2,2,,,,,.,,,,,2,VALLADOLIT,,21,1,3,1,1,17,,,,,,,,,4,,16,,.,,5,,1,2,,,,.,,,,,.,5,5,,,,1,,,,,,,,,,.,17,1,.,2,.,1,,1,.,4,300,5,0,20,0,15,4,,,.,,,,,,.,,,,,,,,1,4,2,2,,,,,,.,.,1,2,,,,,2,,,,,,5,,,,,,,,,,,,2,,,,.,.,,2,2,2,2,,,,,,,,,.,,,,,,,,,,,,,,,,,,,.,,,,.,,,,,,,,,,,,,,,,,,,,,,,,,,,,,,,,,,,,,.,,,,,,,,,,,,,,,,,,,,,,,,,,,,,,,,,,,,,,,,,,,,,,,,,,,,,,,,,,,,,,,,,,,,,,,,,,.,,,,,,,,,,,,,,,,,,,,,,,,,,,,,2,,.,2,,.,,.,1,1,0,0,0,0,0,0,0,0,0,0,,,98,98,,.,.,.
.,,.,,.,,31,102,75,75,31-102-0075,9,09-ene,YUCATAN,31,VALLADOLID,102,PIXOY,75,516,YNSSA001516,2,1,MAYA,2,1,.,4,PLATICAS OPORTUNIDAD,2,6,2,36,,05/09/2006,,,,.,,.,7,1,,1,2,2,.,1,1385,,,1,,,1,1,1,.,4,LADRILLO,2,6,.,1,2,1,2,2,1,2,2,2,2,2,2,1,1,2,2,2,,2,,,.,,,,,1,.,,,1,5,1,1,16,1,,26,1,1,1,1,2,,,,,.,,,,1,2,,,,.,1,1,2,,.,6,6,,,,1,,,,,,,,,,.,17,1,.,2,.,5,3,3,.,3,50,5,0,21,0,16,4,,,.,1,2,4,600,4,.,1,4,1,2,2,2,,1,4,2,2,,,,,,.,.,2,2,2,2,2,2,,,,,,,,,,,,,,,,,,,2,,,,.,.,2,2,2,2,2,,,,,,,,,.,,,,,,,,,,,,,,,,,,,.,,,,.,4,4,4,4,4,4,4,4,4,4,4,4,4,4,4,4,4,4,4,4,4,4,4,4,4,4,4,4,4,4,4,4,4,,,,.,1,,,,,,,,,,,,,,,,,,,,,,,,,,,,,,,,,,,,,,,,,,,,,,,,,,,,,,,,,,,,,,,,,,,,,,,,,.,,,,,,,,,,,,,,,,,,,,,,,,,,,,,2,,.,2,,.,,.,1,1,0,0,0,0,0,0,0,0,0,0,,,98,98,,.,.,.
.,,.,,.,,31,102,75,75,31-102-0075,10,10-ene,YUCATAN,31,VALLADOLID,102,PIXOY,75,516,YNSSA001516,2,1,MAYA,2,1,.,4,PLATICAS OPORTUNIDAD,2,40,3,10,,05/09/2006,,,,.,,.,8,1,,1,1,2,.,1,2020,1250,,1,3,,2,1,1,.,2,.,2,6,.,1,2,1,2,2,2,2,1,2,2,2,2,2,1,2,2,2,,2,,,.,,,,,1,.,,,1,5,1,1,18,1,,18,1,1,3,1,2,,,,,.,,,,1,2,,,,.,2,2,2,,.,7,6,1,,,1,2,,,,,,,,,.,18,1,.,2,.,5,6,,.,,,5,0,21,0,16,4,,,.,1,1,4,1200,4,.,1,4,2,2,2,2,,2,,,2,,,,,,.,.,2,2,2,2,2,2,,,,,,,,,,,,,,,,,,,2,,,,.,.,2,2,2,2,2,,,,,,,,,.,,,,,,,,,,,,,,,,,,,.,,,,.,4,4,4,4,4,4,4,4,4,4,4,4,4,4,4,4,4,4,4,4,4,4,4,4,4,4,4,4,4,4,4,4,4,,,,.,1,,,,,,,,,,,,,,,,,,,,,,,,,,,,,,,,,,,,,,,,,,,,,,,,,,,,,,,,,,,,,,,,,,,,,,,,,.,,,,,,,,,,,,,,,,,,,,,,,,,,,,,2,,.,2,,.,,.,0,0,0,0,0,0,0,0,0,0,0,0,,,98,98,,.,.,.
.,,.,,.,,31,102,75,75,31-102-0075,11,11-ene,YUCATAN,31,VALLADOLID,102,PIXOY,75,516,YNSSA001516,2,1,MAYA,2,1,.,1,.,1,0,1,45,,04/09/2006,,,,.,,.,10,1,,1,1,2,.,1,340,500,,1,2,,1,1,4,DE SU MAMA,1,.,4,3,.,1,2,1,2,2,2,2,2,2,2,2,2,1,1,1,2,2,,2,,,.,,,,,1,.,,,1,4,1,6,16,1,,3,1,1,2,1,2,,,,,.,,,,1,1,4,1,1,.,,,,,.,2,2,,,,1,,,,,,,,,,.,16,2,.,3,.,5,6,,.,,,6,0,21,0,15,5,,,.,1,2,4,600,5,.,2,,,,,,,2,,,2,,,,,,.,.,2,2,2,2,2,2,,,,,,,,,,,,,,,,,,,2,,,,.,.,2,2,2,2,2,,,,,,,,,.,,,3,,,,,,,,,,,,,,,,.,,,,.,4,4,4,4,4,4,4,4,4,4,4,4,4,4,4,4,4,4,4,4,4,4,4,4,4,4,4,4,4,4,4,4,4,,,,.,1,,,,,,,,,,,,,,,,,,,,,,,,,,,,,,,,,,,,,,,,,,,,,,,,,,,,,,,,,,,,,,,,,,,,,,,,,.,,,,,,,,,,,,,,,,,,,,,,,,,,,,,1,1,.,2,,.,,.,0,0,0,0,0,0,0,0,0,0,0,0,,,98,98,,.,.,.
.,,.,,.,,31,102,75,75,31-102-0075,12,12-ene,YUCATAN,31,VALLADOLID,102,PIXOY,75,516,YNSSA001516,2,1,MAYA,2,1,.,3,.,2,0,2,35,,04/09/2006,,,,.,,.,4,1,,1,2,2,.,2,360,,,1,,,1,1,1,.,1,.,4,2,.,1,2,1,2,2,1,2,2,2,2,1,1,2,1,1,2,2,,2,,,.,,,,,1,.,,,1,5,1,1,21,1,,10,1,1,1,1,2,,,,,.,,,,1,2,,,,.,1,1,1,3,.,3,2,,,1,1,4,,,,,,,,,.,21,1,.,2,.,5,6,,.,,,6,0,21,0,15,4,,,.,2,4,5,50,5,.,1,3,2,2,2,2,,2,,,2,,,,,,.,.,2,2,2,2,2,2,,,,,,,,,,,,,,,,,,,2,,,,.,.,2,2,2,2,2,,,,,,,,,.,,,,,,,,,,,,,,,,,,,.,,,,.,4,4,4,4,3,4,4,4,4,4,4,4,4,4,4,4,3,4,3,4,4,4,4,4,4,4,4,4,4,4,4,4,4,5,,,.,1,,,,,,,,,,,,,,,,,,,,,,,,,,,,,,,,,,,,,,,,,,,,,,,,,,,,,,,,,,,,,,,,,,,,,,,,,.,,,,,,,,,,,,,,,,,,,,,,,,98,,,,,2,,.,2,,.,,.,1,1,0,0,0,0,0,0,0,0,0,0,,,98,98,,.,.,.
.,,.,,.,,31,102,75,75,31-102-0075,13,13-ene,YUCATAN,31,VALLADOLID,102,PIXOY,75,516,YNSSA001516,2,1,MAYA,2,1,.,3,.,8,55,9,25,,05/09/2006,,,,.,,.,3,1,,1,2,2,.,1,350,,,1,,,1,1,1,.,2,.,1,3,.,1,2,2,2,2,2,2,2,2,2,2,2,2,2,2,2,2,,2,,,.,,,,,1,.,,,1,5,1,1,39,1,,7,1,1,1,1,2,,,,,.,,,,1,2,,,,.,1,1,1,4,.,1,1,,,,1,,,,,,,,,,.,40,1,.,2,.,5,6,,.,,,6,0,19,0,13,4,,,.,1,2,4,400,5,.,2,,,,,,,2,,,2,,,,,,.,.,2,2,2,2,2,2,,,,,,,,,,,,,,,,,,,2,,,,.,.,2,2,2,2,2,,,,,,,,,.,,,,,,,,,,,,,,,,,,,.,,,,.,4,4,4,4,4,4,4,4,4,4,4,4,4,4,4,4,4,4,4,4,4,4,4,4,4,4,4,4,4,4,4,4,4,,,,.,1,,,,,,,,,,,,,,,,,,,,,,,,,,,,,,,,,,,,,,,,,,,,,,,,,,,,,,,,,,,,,,,,,,,,,,,,,.,,,,,,,,,,,,,,,,,,,,,,,,,,,,,2,,.,2,,.,,.,0,0,0,0,0,0,0,0,0,0,0,0,,,98,98,,.,.,.
.,,.,,.,,31,102,75,75,31-102-0075,14,14-ene,YUCATAN,31,VALLADOLID,102,PIXOY,75,516,YNSSA001516,2,1,MAYA,2,1,.,4,PLATICAS,9,30,9,55,,05/09/2006,,,,.,,.,6,1,,1,2,2,.,1,720,,,1,,,2,2,3,.,2,.,2,6,.,1,2,1,2,2,1,1,1,1,2,1,1,1,1,2,2,2,,2,,,.,,,,,1,.,,,1,5,1,1,17,1,,4,1,1,3,1,2,,,,,.,,,,1,2,,,,.,1,2,2,,.,1,1,,,,1,,,,,,,,,,.,17,1,.,2,.,5,6,,.,,,6,0,22,0,16,4,,,.,1,1,4,600,5,.,1,2,1,2,2,2,,2,,,2,,,,,,.,.,2,2,2,2,2,2,,,,,,,,,,,,,,,,,,,2,,,,.,.,2,2,2,2,2,,,,,,,,,.,,,,,,,,,,,,,,,,,,,.,,,,.,4,4,4,4,4,4,4,4,3,4,4,4,4,4,4,4,4,4,4,4,4,4,4,4,4,4,4,4,4,4,4,4,4,,,,.,1,,,,,,,,,,,,,,,,,,,,,,,,,,,,,,,,,,,,,,,,,,,,,,,,,,,,,,,,,,,,,,,,,,,,,,,,,.,,,,,,,,,,,,,,,,,,,,,,,,,,,,,2,,.,2,,.,,.,0,0,0,0,0,0,0,0,0,0,0,0,,,98,98,,.,.,.
.,,.,,.,,31,102,75,75,31-102-0075,15,15-ene,YUCATAN,31,VALLADOLID,102,PIXOY,75,516,YNSSA001516,2,1,MAYA,2,1,.,4,ASEO CLINICA,10,50,11,20,,05/09/2006,,,,.,,.,4,1,,1,2,2,.,2,360,,,1,,,1,1,1,.,2,.,2,6,.,1,2,1,,2,1,1,1,1,1,1,1,1,1,1,1,2,,2,,,.,,,,,1,.,,,1,5,1,1,17,1,,7,1,1,3,1,2,,,,,.,,,,1,2,,,,.,2,2,2,,.,3,2,,,1,1,4,,,3,,,,,,.,18,1,.,2,.,5,6,,.,,,6,30,22,0,16,6,,,PARTICULAR,1,1,5,90,1,.,1,2,2,2,2,2,,2,,,2,,,,,,.,.,2,2,2,2,2,2,,,,,,,,,,,,,,,,,,,2,,,,.,.,2,2,2,2,2,,,,,,,,,.,,,,,,,,,,,,,,,,,,,.,,,,.,4,4,4,4,4,4,4,4,4,4,4,4,4,4,4,4,4,4,4,4,4,4,4,4,4,4,4,4,4,4,4,4,4,,,,.,1,,,,,,,,,,,,,,,,,,,,,,,,,,,,,,,,,,,,,,,,,,,,,,,,,,,,,,,,,,,,,,,,,,,,,,,,,.,,,,,,,,,,,,,,,,,,,,,,,,,,,,,2,,.,2,,.,,.,0,0,0,0,0,0,0,0,0,0,0,0,,,98,98,,.,.,.
.,,.,,.,,31,102,75,75,31-102-0075,16,16-ene,YUCATAN,31,VALLADOLID,102,PIXOY,75,516,YNSSA001516,2,1,MAYA,2,1,.,4,PESO Y TALLA,11,20,11,40,,05/09/2006,,,,.,,.,4,1,,1,2,2,.,2,360,,,1,,,1,1,1,.,2,.,2,6,.,1,2,1,2,2,1,1,1,2,2,2,1,2,1,1,2,2,,1,2,,.,4,1,1000,4,1,.,,,1,5,1,1,20,2,,4,1,1,3,1,2,,,,,.,,,,1,2,,,,.,1,1,1,3,.,2,2,,,,1,,,,,,,,,,.,21,1,.,2,.,1,,7,VOLUNTARIA INEA,1,0,6,0,22,0,16,1,,,.,1,1,3,1200,1,.,2,,,,,,,2,,,2,,,,,,.,.,2,2,2,2,2,2,,,,,,,,,,,,,,,,,,,2,,,,.,.,2,2,2,2,2,,,,,,,,,.,,,,,,,,,,,,,,,,,,,.,,,,.,4,4,4,4,4,4,4,4,4,4,4,4,4,4,4,4,4,4,4,4,4,4,4,4,4,4,4,4,4,4,4,4,4,,,,.,1,,,,,,,,,,,,,,,,,,,,,,,,,,,,,,,,,,,,,,,,,,,,,,,,,,,,,,,,,,,,,,,,,,,,,,,,,.,,,,,,,,,,,,,,,,,,,,,,,,,,,,,2,,.,2,,.,,.,0,0,0,0,0,0,0,0,0,0,0,0,,,98,98,,.,.,.
.,,.,,.,,31,102,75,75,31-102-0075,17,17-ene,YUCATAN,31,VALLADOLID,102,PIXOY,75,516,YNSSA001516,2,1,MAYA,2,1,.,4,PLATICAS,12,35,12,55,,05/09/2006,,,,.,,.,5,1,,1,1,2,.,1,360,1100,,1,3,,1,1,1,.,2,.,3,6,.,1,2,1,2,2,1,2,2,2,2,1,2,1,1,1,2,2,,2,,,.,,,,,1,.,,,1,5,1,1,18,1,,32,2,1,1,1,1,,,,,.,,,,1,2,,,,.,2,1,2,,.,8,6,,,2,1,4,,,4,,,,,,.,18,1,.,2,.,5,6,,.,,,4,0,22,0,18,4,,,.,77,,,,4,.,2,,,,,,,2,,,2,,,,,,.,.,2,2,2,2,2,2,,,,,,,,,,,,,,,,,,,2,,,,.,.,2,2,2,2,2,,,,,,,,,.,,,,,,,,,,,,,,,,,,,.,,,,.,4,4,4,4,4,4,4,4,4,4,4,4,4,4,4,4,4,4,4,4,4,4,4,4,4,4,4,4,4,4,3,4,4,,,,.,1,,,,,,,,,,,,,,,,,,,,,,,,,,,,,,,,,,,,,,,,,,,,,,,,,,,,,,,,,,,,,,,,,,,,,,,,,.,,,,,,,,,,,,,,,,,,,,,,,,98,,,,,2,,.,2,,.,,.,0,0,0,0,0,0,0,0,0,0,0,0,,,98,98,,.,.,.
.,,.,,.,,31,102,75,75,31-102-0075,18,18-ene,YUCATAN,31,VALLADOLID,102,PIXOY,75,516,YNSSA001516,2,1,MAYA,2,1,.,4,PLATICAS,1,10,1,40,,05/09/2006,,,,.,,.,8,1,,1,1,2,.,1,360,600,,1,8,,3,3,1,.,1,.,1,2,.,1,2,1,2,2,1,1,2,2,2,2,2,1,2,2,2,2,,2,,,.,,,,,1,.,,,1,5,1,1,16,1,,38,1,1,2,1,2,,,,,.,,,,1,2,,,,.,1,1,1,4,.,9,7,,,2,1,4,,,1,,,,,,.,17,2,.,2,.,5,6,,.,,,5,0,21,0,16,4,,,.,1,2,5,60,5,.,1,4,2,2,2,2,,2,,,2,,,,,,.,.,2,2,2,2,2,2,,,,,,,,,,,,,,,,,,,2,,,,.,.,2,2,2,2,2,,,,,,,,,.,,,,,,,,,,,,,,,,,,,.,,,,.,4,4,4,4,4,4,4,4,4,4,4,4,4,4,4,4,4,4,4,4,4,4,4,4,4,4,4,4,4,4,4,4,4,,,,.,1,,,,,,,,,,,,,,,,,,,,,,,,,,,,,,,,,,,,,,,,,,,,,,,,,,,,,,,,,,,,,,,,,,,,,,,,,.,,,,,,,,,,,,,,,,,,,,,,,,,,,,,2,,.,2,,.,,.,0,0,0,0,0,0,0,0,0,0,0,0,,,98,98,,.,.,.
.,,.,,.,,31,102,75,75,31-102-0075,19,19-ene,YUCATAN,31,VALLADOLID,102,PIXOY,75,516,YNSSA001516,2,1,MAYA,2,1,.,4,PLATICAS,1,40,2,5,,05/09/2006,,,,.,,.,5,1,,1,2,2,.,1,360,,,1,,,2,2,1,.,2,.,1,6,.,1,2,1,2,2,2,2,1,2,2,2,1,1,1,1,2,2,,1,2,,.,1,1,700,0,1,.,,,1,5,1,1,16,2,,14,1,1,3,1,2,,,,,.,,,,1,2,,,,.,1,1,2,,.,3,3,,,,1,,,,,,,,,,.,17,1,.,2,.,5,6,,.,,,6,0,22,0,16,4,,,.,1,2,4,1000,5,.,1,3,2,2,2,2,,1,4,2,2,,,,,,.,.,2,2,2,2,2,2,,,,,,,,,,,,,,,,,,,2,,,,.,.,2,2,2,2,2,,,,,,,,,.,,,,,,,,,,,,,,,,,,,.,,,,.,4,4,4,4,4,4,4,4,4,4,4,4,4,4,4,4,4,4,4,4,4,4,4,4,4,4,4,4,4,4,4,4,4,,,,.,1,,,,,,,,,,,,,,,,,,,,,,,,,,,,,,,,,,,,,,,,,,,,,,,,,,,,,,,,,,,,,,,,,,,,,,,,,.,,,,,,,,,,,,,,,,,,,,,,,,,,,,,1,1,.,2,,.,,.,0,0,0,0,0,0,0,0,0,0,0,0,,,98,98,,.,.,.
.,,.,,.,,31,102,75,75,31-102-0075,20,20-ene,YUCATAN,31,VALLADOLID,102,PIXOY,75,516,YNSSA001516,2,1,MAYA,2,1,.,4,PLATICAS,2,10,2,35,,05/09/2006,,,,.,,.,6,1,,1,2,2,.,1,340,,,1,,,1,1,1,.,2,.,2,6,.,1,2,1,2,2,2,2,2,2,1,1,1,2,1,1,1,2,,2,,,.,,,,,1,.,,,1,5,1,1,16,1,,17,1,1,3,1,2,,,,,.,,,,1,2,,,,.,1,1,2,,.,4,4,,,,1,,,,,,,,,,.,17,1,.,2,.,5,3,4,.,3,70,4,30,22,0,17,4,,,.,1,2,4,800,5,.,1,4,2,2,2,2,,2,,,2,,,,,,.,.,2,2,2,2,2,2,,,,,,,,,,,,,,,,,,,2,,,,.,.,2,2,2,2,2,,,,,,,,,.,,,,,,,,,,,,,,,,,,,.,,,,.,4,4,4,4,4,4,4,4,4,4,4,4,4,4,4,4,4,4,4,4,4,4,4,4,4,4,4,4,4,4,4,4,4,,,,.,1,,,,,,,,,,,,,,,,,,,,,,,,,,,,,,,,,,,,,,,,,,,,,,,,,,,,,,,,,,,,,,,,,,,,,,,,,.,,,,,,,,,,,,,,,,,,,,,,,,,,,,,2,,.,2,,.,,.,0,0,0,0,0,0,0,0,0,0,0,0,,,98,98,,.,.,.
.,,.,,.,,31,102,75,75,31-102-0075,21,21-ene,YUCATAN,31,VALLADOLID,102,PIXOY,75,516,YNSSA001516,2,1,MAYA,2,1,.,3,.,1,2,1,46,,04/09/2006,,,,.,,.,8,1,,1,1,2,.,1,1400,1900,,1,3,,1,1,1,.,1,.,1,3,.,1,2,1,2,2,2,2,2,1,2,2,2,1,1,2,2,2,,2,,,.,,,,,1,.,,,1,5,1,1,19,1,,20,1,1,2,1,2,,,,,.,,,,1,2,,,,.,1,1,2,,.,10,7,1,,2,1,2,4,,4,,,,,,.,19,1,.,2,.,5,6,,.,,,6,0,20,0,14,4,,,.,1,3,4,400,5,.,1,4,2,2,2,2,,1,4,2,1,8,,,,,.,.,2,1,2,2,2,1,,2,,,,1,,,5,6,,,,,,,5,,2,,,,.,.,2,2,2,2,2,,,,,,,,,.,,,,,,,,,,,,,,,,,,,.,,,,.,4,4,4,4,4,4,4,4,4,4,4,4,4,4,4,4,4,4,4,4,4,4,4,4,4,4,4,4,4,4,4,4,4,,,,.,1,,,,,,,,,,,,,,,,,,,,,,,,,,,,,,,,,,,,,,,,,,,,,,,,,,,,,,,,,,,,,,,,,,,,,,,,,.,,,,,,,,,,,,,,,,,,,,,,,,,,,,,2,,.,2,,.,,.,1,1,0,0,0,0,0,0,0,0,0,0,,,98,98,,.,.,.
.,,.,,.,,31,102,75,75,31-102-0075,22,22-ene,YUCATAN,31,VALLADOLID,102,PIXOY,75,516,YNSSA001516,2,1,MAYA,2,1,.,3,.,3,5,3,32,,04/09/2006,,,,.,,.,4,1,,1,2,2,.,2,350,,,1,,,1,1,1,.,1,.,1,3,.,2,2,1,2,2,2,2,2,2,2,2,2,2,1,2,2,2,,2,,,.,,,,,1,.,,,1,5,1,1,19,1,,6,1,1,1,1,2,,,,,.,,,,1,2,,,,.,1,2,1,1,.,2,2,,,,1,,,,,,,,,,.,20,1,.,2,.,5,6,,.,,,6,0,22,0,16,4,,,.,1,3,4,150,4,.,1,4,2,2,2,2,,2,,,2,,,,,,.,.,2,2,2,2,2,2,,,,,,,,,,,,,,,,,,,2,,,,.,.,2,2,2,2,2,,,,,,,,,.,,,,,,,,,,,,,,,,,,,.,,,,.,4,4,4,4,4,4,4,4,4,4,4,4,4,4,4,4,4,4,4,4,4,4,4,4,4,4,4,4,4,4,4,4,4,,,,.,1,,,,,,,,,,,,,,,,,,,,,,,,,,,,,,,,,,,,,,,,,,,,,,,,,,,,,,,,,,,,,,,,,,,,,,,,,.,,,,,,,,,,,,,,,,,,,,,,,,,,,,,1,1,.,2,,.,,.,0,0,0,0,0,0,0,0,0,0,0,0,,,98,98,,.,.,.
.,,.,,.,,31,102,75,75,31-102-0075,23,23-ene,YUCATAN,31,VALLADOLID,102,PIXOY,75,516,YNSSA001516,2,1,MAYA,2,1,.,3,.,4,27,5,55,,04/09/2006,,,,.,,.,6,1,,1,1,2,.,1,700,2000,,1,3,,1,1,1,.,2,.,1,3,.,1,2,1,2,2,2,2,2,2,2,2,1,2,1,1,1,2,,2,,,.,,,,,1,.,,,1,5,1,1,19,1,,20,1,1,1,1,2,,,,,.,,,,1,2,,,,.,1,1,2,,.,6,4,1,,1,1,2,4,,2,,,,,,.,19,2,.,2,.,5,3,4,.,3,80,5,0,21,30,16,4,,,.,1,3,4,150,4,.,1,4,2,2,2,2,,1,4,2,2,,,,,,.,.,2,2,2,2,2,2,,,,,,,,,,,,,,,,,,,2,,,,.,.,2,2,2,2,2,,,,,,,,,.,,,,,,,,,,,,,,,,,,,.,,,,.,4,4,4,4,4,4,4,4,4,4,4,4,4,4,3,4,4,4,4,4,4,4,4,4,4,4,4,4,4,4,4,4,4,,,,.,1,,,,,,,,,,,,,,,,,,,,,,,,,,,,,,,,,,,,,,,,,,,,,,,,,,,,,,,,,,,,,,,,,,,,,,,,,.,,,,,,,,,,,,,,,,,,,,,,,,,,,,,2,,.,2,,.,,.,1,1,0,0,0,0,0,0,0,0,0,0,,,98,98,,.,.,.
.,,.,,.,,31,102,75,75,31-102-0075,24,24-ene,YUCATAN,31,VALLADOLID,102,PIXOY,75,516,YNSSA001516,2,1,MAYA,2,1,.,3,.,9,15,9,50,,05/09/2006,,,,.,,.,9,1,,1,2,2,.,1,2190,,,1,,,2,2,1,.,2,.,2,6,.,1,2,1,2,2,2,2,1,2,2,2,1,1,2,1,2,2,,2,,,.,,,,,1,.,,,1,5,1,1,15,1,,27,1,1,3,1,2,,,,,.,,,,1,2,,,,.,2,99,2,,.,11,9,1,1,,1,2,3,,,,,,,,.,16,2,.,3,.,5,3,3,.,3,65,5,0,21,0,16,4,,,.,1,2,4,450,4,.,1,2,1,1,2,2,,2,,,2,,,,,,.,.,2,2,2,2,2,2,,,,,,,,,,,,,,,,,,,2,,,,.,.,2,2,2,2,2,,,,,,,,,.,,,,,,,,,,,,,,,,,,,.,,,,.,4,4,4,4,4,4,4,4,4,4,4,4,4,4,4,4,4,4,4,4,4,4,4,4,4,4,4,4,4,4,4,4,4,,,,.,1,,,,,,,,,,,,,,,,,,,,,,,,,,,,,,,,,,,,,,,,,,,,,,,,,,,,,,,,,,,,,,,,,,,,,,,,,.,,,,,,,,,,,,,,,,,,,,,,,,,,,,,2,,.,2,,.,,.,0,0,0,0,0,0,0,0,0,0,0,0,,,98,98,,.,.,.
.,,.,,.,,31,102,75,75,31-102-0075,25,25-ene,YUCATAN,31,VALLADOLID,102,PIXOY,75,516,YNSSA001516,2,1,MAYA,2,1,.,3,.,10,34,11,0,,05/09/2006,,,,.,,.,8,1,,1,2,2,.,1,360,,,1,,,2,2,1,.,1,.,1,3,.,2,2,1,2,2,2,2,1,2,2,1,1,1,1,2,1,2,,2,,,.,,,,,1,.,,,1,5,1,1,19,1,,10,1,1,3,1,2,,,,,.,,,,1,2,,,,.,1,1,2,,.,5,5,,,,1,,,,,,,,,,.,20,1,.,2,.,5,6,,.,,,5,0,22,0,17,4,,,.,1,1,5,62,1,.,1,4,2,2,2,2,,1,4,2,2,,,,,,.,.,2,2,2,2,2,2,,,,,,,,,,,,,,,,,,,2,,,,.,.,2,2,2,2,2,,,,,,,,,.,,,,,,,,,,,,,,,,,,,.,,,,.,4,4,4,4,4,4,4,4,4,4,4,4,4,4,4,4,4,4,4,4,4,4,4,4,4,4,4,4,4,4,4,4,4,,,,.,1,,,,,,,,,,,,,,,,,,,,,,,,,,,,,,,,,,,,,,,,,,,,,,,,,,,,,,,,,,,,,,,,,,,,,,,,,.,,,,,,,,,,,,,,,,,,,,,,,,,,,,,2,,.,2,,.,,.,0,0,0,0,0,0,0,0,0,0,0,0,,,98,98,,.,.,.
.,,.,,.,,31,102,75,75,31-102-0075,26,26-ene,YUCATAN,31,VALLADOLID,102,PIXOY,75,516,YNSSA001516,2,1,MAYA,2,1,.,3,.,11,2,11,28,,05/09/2006,,,,.,,.,8,1,,1,1,2,.,1,340,1000,,1,3,,1,1,1,.,2,.,1,3,.,2,2,1,2,2,1,2,2,2,2,2,1,2,1,2,2,2,,2,,,.,,,,,1,.,,,1,5,1,1,17,1,,18,1,1,3,1,2,,,,,.,,,,1,2,,,,.,1,2,2,,.,7,6,,,1,1,4,,,3,,,,,,.,17,1,.,2,.,5,3,3,.,4,60,5,0,21,0,16,4,,,.,1,2,4,600,4,.,1,4,2,2,2,2,,2,,,1,1,,,,,.,.,1,1,2,2,2,2,3,3,,,,,1,,1,,,,,,,,,,2,,,,.,.,2,2,2,2,2,,,,,,,,,.,,,,,,,,,,,,,,,,,,,.,,,,.,4,4,4,4,4,4,4,4,4,4,4,4,4,4,4,4,4,4,4,4,4,4,4,4,4,4,4,4,4,4,4,4,4,,,,.,1,,,,,,,,,,,,,,,,,,,,,,,,,,,,,,,,,,,,,,,,,,,,,,,,,,,,,,,,,,,,,,,,,,,,,,,,,.,,,,,,,,,,,,,,,,,,,,,,,,,,,,,1,1,.,2,,.,,.,0,0,0,0,0,0,0,0,0,0,0,0,,,98,98,,.,.,.
.,,.,,.,,31,102,75,75,31-102-0075,27,27-ene,YUCATAN,31,VALLADOLID,102,PIXOY,75,516,YNSSA001516,2,1,MAYA,2,1,.,4,PLATICAS,11,50,12,13,,05/09/2006,,,,.,,.,4,1,,1,2,2,.,1,360,,,1,,,1,1,1,.,1,.,2,6,.,2,2,1,2,2,2,2,2,2,2,2,2,2,1,2,1,2,,2,,,.,,,,,1,.,,,1,5,1,1,16,1,,25,1,1,1,1,2,,,,,.,,,,1,2,,,,.,1,1,1,2,.,5,3,1,1,,1,2,3,,,,,,,,.,16,2,.,3,.,5,3,3,.,3,300,5,0,23,0,18,4,,,.,2,4,1,0,4,.,1,4,2,2,2,2,,1,4,2,1,1,3,,,,.,.,2,2,2,2,2,2,,,,,,,,,,,,,,,,,,,2,,,,.,.,2,2,2,2,2,,,,,,,,,.,,,,,,,,,,,,,,,,,,,.,,,,.,4,4,4,4,4,4,4,4,4,4,4,4,4,4,4,4,4,4,4,4,4,4,4,4,4,4,4,4,4,4,4,4,4,,,,.,1,,,,,,,,,,,,,,,,,,,,,,,,,,,,,,,,,,,,,,,,,,,,,,,,,,,,,,,,,,,,,,,,,,,,,,,,,.,,,,,,,,,,,,,,,,,,,,,,,,,,,,,2,,.,2,,.,,.,0,0,0,0,0,0,0,0,0,0,0,0,,,98,98,,.,.,.
.,,.,,.,,31,102,75,75,31-102-0075,28,28-ene,YUCATAN,31,VALLADOLID,102,PIXOY,75,516,YNSSA001516,2,1,MAYA,2,1,.,4,PLATICAS,12,32,12,56,,05/09/2006,,,,.,,.,9,1,,1,1,2,.,1,2000,2000,,1,3,,2,2,1,.,3,.,2,6,.,1,2,1,2,2,1,2,2,2,2,2,2,2,1,2,1,2,,2,,,.,,,,,1,.,,,1,5,1,1,19,1,,20,1,1,3,1,2,,,,,.,,,,1,2,,,,.,1,1,1,2,.,8,7,,1,,1,3,,,,,,,,,.,20,1,.,2,.,5,3,3,.,3,150,5,30,21,0,16,4,,,.,1,2,4,600,5,.,2,,,,,,,1,4,2,2,,,,,,.,.,2,2,2,2,2,2,,,,,,,,,,,,,,,,,,,2,,,,.,.,2,2,2,2,2,,,,,,,,,.,,,,,,,,,,,,,,,,,,,.,,,,.,4,4,4,4,4,4,4,4,4,4,4,4,4,4,4,4,4,4,4,4,4,4,4,4,4,4,4,4,4,4,4,4,4,,,,.,1,,,,,,,,,,,,,,,,,,,,,,,,,,,,,,,,,,,,,,,,,,,,,,,,,,,,,,,,,,,,,,,,,,,,,,,,,.,,,,,,,,,,,,,,,,,,,,,,,,,,,,,2,,.,2,,.,,.,0,0,0,0,0,0,0,0,0,0,0,0,,,98,98,,.,.,.
.,,.,,.,,31,102,75,75,31-102-0075,29,29-ene,YUCATAN,31,VALLADOLID,102,PIXOY,75,516,YNSSA001516,2,1,MAYA,2,1,.,4,PLATICAS,1,7,1,32,,05/09/2006,,,,.,,.,8,1,,1,2,2,.,1,360,,,1,,,1,1,1,.,1,.,4,3,.,2,2,1,2,2,2,2,2,2,2,2,2,2,2,2,2,2,,2,,,.,,,,,1,.,,,1,5,1,1,17,1,,26,1,1,3,1,2,,,,,.,,,,1,2,,,,.,1,2,2,,.,8,8,,,,1,,,,,,,,,,.,17,2,.,3,.,5,3,3,.,3,70,5,0,20,0,15,4,,,.,2,4,1,0,4,.,1,4,2,2,2,2,,1,4,2,2,,,,,,.,.,2,2,2,2,2,2,,,,,,,,,,,,,,,,,,,2,,,,.,.,2,2,2,2,2,,,,,,,,,.,,,,,,,,,,,,,,,,,,,.,,,,.,4,4,4,4,4,4,4,4,4,4,4,4,4,4,4,4,4,4,4,4,4,4,4,4,4,4,4,4,4,4,4,4,4,,,,.,1,,,,,,,,,,,,,,,,,,,,,,,,,,,,,,,,,,,,,,,,,,,,,,,,,,,,,,,,,,,,,,,,,,,,,,,,,.,,,,,,,,,,,,,,,,,,,,,,,,,,,,,2,,.,2,,.,,.,0,0,0,0,0,0,0,0,0,0,0,0,,,98,98,,.,.,.