clave,clave de la entidad,clave del municipio,numero de area geoestadistica,numero de vivienda,work,numero consecutivo unico,numero consecutivo unico,clave de la entidad,estrato de poblacion,pageb,wh,wi,w,rural,pviv2,numero unico,iupm,incong,numero de hogar encuestado,iusuario,numero clave,resultg,resulti,utiln,utilc,utilr,indin,pviv,pindi,�en las ultimas dos semanas cual fue el principal motivo por el que (usted/nombre) recibio atencion(la ultima vez)?,�desde cuando comenzo a estar enfermo (usted/nombre),�en donde se atendio (atendieron a )?,�me podria decir quien lo (la) atendio en esa ocasion (quien atendio a �),� a que institucion pertenece la persona que lo (la) atendio ?,�en que se fue (fueron) al lugar en donde lo (la) atendieron?,i062,i063,i064,i065,�cuanto pago para llegar hasta ese lugar?,"cuestionario las opciones son de 1 al 5 y 8,9 ",i091,i092,�el tiempo que tardo en llegar al lugar donde lo (la) atendieron le parecio �,�el lugar donde espero (usted/nombre) para que lo (la) atendieran .. estaba limpio?,�el lugar donde espero (usted/nombre) para que lo (la) atendieran .. habia sillas suficientes?,�el lugar donde espero (usted/nombre) para que lo (la) atendieran habia banos?,�el lugar donde espero (usted/nombre) para que lo (la) atendieran hbia ventilacion?,�el lugar donde espero (usted/nombre) para que lo (la) atendieran habia luz sificiente?,�el lugar donde espero (usted/nombre) para que lo (la) atendieran habia letreros de orientacion?,�aproximandamente cuanto tiempo tuvo que esperear para que lo (la) atendieran? horas,�aproximandamente cuanto tiempo tuvo que esperear para que lo (la) atendieran? minutos,�el tiempo que espero para que lo (la) atendieran le parecio,�cuanto tiempo duro la consulta? horas,�cuanto tiempo duro la consulta? minutos,"�el servicio que le dio la persona que lo atendio, le perecio �",�recomendaria usted a la persona que lo atendio con algun familiar o amigo?,�la persona que lo (la) atendio lo (la) peso?,�la persona que lo (la) atendio lo (la) midio la (estatura),�la persona que lo (la) atendio lo (la) reviso?,�la persona que lo (la) atendio lo (la) le dio una ezplicacion clara acerca de su salud?,�la persona que lo (la) atendio lo (la) le dio algun consejo de limpieza (higiene personal?,�la persona que lo (la) atendio lo (la) rle dijo algo sobre su alimentacion (o lo que acostumbra comer?,�la persona que lo (la) atendio lo (la) (para mayores de 3 anos) le tomo la presion?,�la persona que lo (la) atendio lo (la) le hizo alguna recomendacion?,�el lugar en donde lo atendieron estaba limpio?,�el lugar en donde lo atendieron habia sillas sificientes?,�el lugar en donde lo atendieron habia escritorio (mesa para escribir)?,�el lugar en donde lo atendieron habia mesa o cama para explorar?,�el lugar en donde lo atendieron habia luz suficiente?,�el lugar en donde lo atendieron habia ventilacion?,�el lugar en donde lo atendieron habia privacidad?,"�el lugar en donde lo atendieron habia todo lo necesario como medicamentos,instrumental o material de curacion?",�le cobraron por la atencion que recibio?,�cuanto le cobraron por la atencion?,�como le parecio lo que le cobraron?,�como pago por la atencion que recibio? en efectivo,�como pago por la atencion que recibio? a credito,�durante la consulta le recetaron medicinas?,sobre las medicinas que le receto �la persona que lo atendio�?,�consiguio las medicinas?,�por que no las consiguio?,�en donde las consiguio?,�cuanto pago por las medicinas?,"�en la consulta le pidieron a (usted/nombre) que se hiciera algun examen de laboratorio (sangre,orina) y/o gabinete (rayos x, ultrasonido, electrocardiograma,tomografia, etc)","�en la consulta le pidieron a (usted/nombre) que se hiciera algun examen de laboratorio (sangre,orina) y/o gabinete (rayos x, ultrasonido, electrocardiograma,tomografia, etc)",�se hizo(usted/nombre) los examenes ?,�en donde le hicieron los examenes de laboratorio �?,�en donde le hicieron los examenes de laboratorio �?,�cuanto pago  por los examenes de laboratorio � ?,�cual fue la principal razon por la que no se hizo expamenes de laboratorio �?,"�aparte de lo que ya me dijo, tuvo otros gastos por atenderse (por la atencion de usted/nombre)?",�en que y cuanto gasto?,�en que y cuanto gasto?,�en que y cuanto gasto?,�noto mejoria  en su salud despues de esta atencion?,�si usted tuviera oportunidad de escoger regresaria a ese mismo lugar para atenderse?,�por que no regresaria?,"�en general, la calidad de la atencion que recibio fue ..","�por que le parecio (muy buerna,buena o regular) la atencion que recibio?","�por que le parecio (muy buerna,buena o regular) la atencion que recibio?","�por que le parecio (regular,mala o muy mala) la atencion que recibio?","�por que le parecio (regular,mala o muy mala) la atencion que recibio?","�en relacion al motivo de la consulta, anteriormente se ha atendido en otro lugar?",�me puede decir en donde se ha atendido anteriormente?,�me puede decir en donde se ha atendido anteriormente?,�a que institucion pertenece este lugar?,�a que institucion pertenece este lugar?,�por que dejo de atenderse en ese lugar?,�por que dejo de atenderse en ese lugar?,�de (mes) de 1993 a (mes) de 1994 cuantas veces se atendio por este mismo motivo?,nombre del encuestado,nombre del hospital,domicilio del hospital,clave de la localidad,nombre de la localidad,nombre de la localidad,nombre del municipio,clave del estado,nombre del estado,referencia del domicilio,forma de llegar al hospital,i47form
2002,2,2,146,224,0,23,1,1,1,1,1878.24,1878.24,0,0,8,31,1,0,40,1,5,20141,1,1,1,1,1,5,42,438,1,1,7,6,2,4,0,0,0,0,7777.77,2,0,10,4,1,1,1,1,1,1,2,0,2,0,15,3,2,1,1,1,1,2,2,2,2,1,1,1,1,1,1,1,1,2,0,0,0,0,1,1,1,0,1,7777,2,2,0,0,0,0,0,2,0,0,0,1,2,10,3,45,0,12,0,2,0,0,0,0,0,0,0,DRA. BARRAZA,I.M.S.S. (CLINICA 31),CALLE LERDO Y CALLE G,0,COL. NUEVA,0,MEXICALI,0,BAJA CALIFORNIA N.,ENFRENTE ESTA UNIFORMES PROFECIONALES EN CONTRA ESQUINA HAY UNA PALETERIA (LA MI,CAMION FLORES MAGON CAMION CALLE G. TAXI FRANJA CAFE
2002,2,2,146,309,0,24,2,1,1,1,1878.24,1878.24,0,0,14,54,1,0,55,1,4,20146,1,1,1,1,1,5,48,461,5,0,6,6,2,1,6,0,0,0,2.5,4,1,0,2,1,1,1,1,1,1,1,0,3,0,3,2,1,1,2,1,2,2,1,1,2,1,1,1,1,1,1,1,1,2,0,0,0,0,1,1,1,0,2,7777,2,2,0,0,0,0,0,2,0,0,0,2,1,0,2,22,32,0,0,2,0,0,0,0,0,0,0,DR. HECTOR AGUILERA CONSULTORIO # 4,IMSS,AV LERDO Y CALLE G,0,COL. NUEVA,2,MEXICALI,2,BAJA CALIFORNIA,ENFRENTE DEL PARQUE DE RECTORIA,SE TOMA EL CAMION FLORES MAGON DE COLOR VERDE CON BLANCO Y SE BAJA EN EL PARQUE
2002,2,2,146,311,0,25,3,1,1,1,1878.24,1878.24,0,0,15,56,1,0,55,1,1,20147,1,1,2,2,2,7,49,463,1,1,6,6,4,4,0,0,0,0,7777.77,2,0,3,4,1,1,1,1,1,1,77,77,0,0,5,2,1,2,2,1,1,2,2,2,1,1,1,1,1,1,1,1,1,1,10,4,1,1,1,1,1,0,3,40,2,2,0,0,0,0,0,2,0,0,0,1,1,0,2,13,58,0,0,2,0,0,0,0,0,0,0,,DIF,,0,COL. FLORES MAGON,2,MEXICALI,2,BAJA CALIFORNIA NORT,ENFRENTE DE UNA LLANTERA Y CRUZANDO LA CALLE SE ENCUENTRA EL DIF,"TOMAR EL CAMION ""CARRANZA"" DE COLOR VERDE CON BLANCO Y CAMINA 3 CUADRAS."
2002,2,2,146,311,0,26,4,1,1,1,1878.24,1878.24,0,0,15,59,1,0,55,1,4,20147,1,1,2,2,2,7,49,466,1,1,5,6,4,4,0,0,0,0,7777.77,2,0,3,4,1,1,1,1,1,1,77,77,0,0,5,2,1,2,2,1,1,2,1,1,1,1,1,1,1,1,1,1,1,1,10,4,1,1,2,0,0,0,0,0,1,2,2,0,0,0,77,2,0,0,0,3,1,0,2,12,13,0,0,2,0,0,0,0,0,0,0,NO SE,DIF,,0,COL. FLORES MAGON,2,MEXICALI,2,BAJA CALIFORNIA,ENFRENTE DE UNA LLANTERA Y CRUZANDO LA CALLE SE ENCUENTRA EL DIF,"TOMAR EL CAMION ""CORREGIDORA"" DE COLOR VERDE CON BLANCO Y CAMINA 3 CUADRAS."
2002,2,2,146,313,0,27,5,1,1,1,1878.24,1878.24,0,0,17,72,1,0,55,1,7,20149,1,1,1,1,1,14,51,479,1,5,7,6,2,6,0,0,0,0,2.5,2,0,30,3,1,1,1,1,1,1,5,0,1,0,20,4,2,2,2,1,2,2,2,1,2,1,1,1,1,1,1,1,1,2,0,0,0,0,1,1,1,0,2,7777,2,2,0,0,0,0,0,2,0,0,0,2,2,5,4,0,0,12,45,2,0,0,0,0,0,0,0,CONSULTORIO # 7,IMSS,AV. LERDO Y CALLE G.,0,COL. NUEVA,2,MEXICALI,2,BAJA CALIFORNIA,ENFRENTE DEL PARQUE DE RECTORIA,TOMAR EL CAMION FLORES MAGON Y SE BAJA EN EL PARQUE Y CRUZANDO LA CALLE SE ENCUE
2002,2,2,146,314,0,28,6,1,1,1,1878.24,1878.24,0,0,18,80,1,0,55,1,1,20150,1,1,1,1,1,2,52,487,1,6,77,6,11,4,0,0,0,0,7777.77,2,0,7,4,1,1,1,1,1,1,0,10,4,0,40,1,1,1,2,1,1,2,2,1,2,1,1,1,1,1,1,1,1,1,150,4,1,0,1,1,1,0,3,8888,1,2,1,3,0,150,0,2,0,0,0,1,1,0,2,45,52,0,0,2,0,0,0,0,0,0,0,DR. ARTURO ROSAS,,,0,FRACCIONAMIENTO ANDALUCIA,2,MEXICALI,0,BAJA CALIFORNIA,"SE ENCUENTRA ENFRENTE DE LA FARMACIA ""JAZMIN"" Y A UN LADO DEL CENTRO COMERCIAL """,SE TOMA EL CAMION FLORES MAGON DE COLOR VERDE CON BLANCO Y SE BAJA EN LA FARMACI
2002,2,2,146,394,0,29,7,1,1,1,1878.24,1878.24,0,0,22,97,1,0,69,1,3,20155,1,1,1,1,1,3,56,504,1,1,6,7,11,4,0,0,0,0,7777.77,3,0,10,4,1,1,1,1,1,1,0,10,4,1,0,1,1,1,1,1,1,1,1,2,2,1,1,1,1,1,1,1,1,1,100,4,1,0,1,1,1,0,3,30,2,2,0,0,0,0,0,2,0,0,0,1,1,0,1,41,27,0,0,2,0,0,0,0,0,0,0,DR. ESPERANZA PEREZ HDEZ,CONSULTORIO PARTICULAR,AV. JUSTO SIERRA S/N,0,COL. CUAHUTEMOC.,2,MEXICALI,2,BAJA CALIFORNIA,AUN LADO DE LA PLAZITA,"CAMION CONSTITUCION BLANCO Y AMARILLO,TAXI FRANJA AMARILLA,CAMION PALACO ROJO-NA"
2002,2,2,146,545,0,30,8,1,1,1,1878.24,1878.24,0,0,28,118,1,0,96,1,4,20163,1,1,1,1,1,5,62,525,1,6,7,6,7,4,0,0,0,0,7777.77,2,0,12,4,1,1,1,1,1,1,0,3,4,0,15,4,2,2,2,1,2,2,2,2,2,1,1,1,1,1,1,1,2,2,0,0,0,0,1,4,2,8,0,0,1,8,2,0,0,0,77,2,0,0,0,2,2,3,4,0,0,33,41,1,77,0,11,0,1,0,7,DRA. OROZCO,ISSTECALI,,0,,2,MEXICALI,2,BAJA CALIFORNIA,SE ENCUENTRA UBICADO ATRAS DE LA CENTRAL CAMIONERA,"TOMA EL CAMION CALLE ""6"" DE COLOR BLANCO CON NEGRO Y SE BAJA EN UN AUTOPARTES Y"
2002,2,2,146,546,0,31,9,1,1,1,1878.24,1878.24,0,0,29,121,1,0,96,1,2,20164,1,1,1,1,1,4,63,528,1,1,7,6,2,4,0,0,0,0,7777.77,3,0,20,3,1,1,1,1,1,1,0,10,3,0,5,1,1,2,2,1,2,2,2,1,2,1,1,1,1,1,2,1,1,2,0,0,0,0,1,1,1,0,1,7777,1,8,2,0,0,0,5,1,100,0,0,1,1,0,2,51,0,0,0,2,0,0,0,0,0,0,0,,URGENCIAS HOSPITAL DEL IMSS,ZARAGOZA Y LERDO CALLE G.,0,NUEVA.CENTRO,2,MEXICALI,2,BAJA CALIFORNIA,RECTORIA FRENTE.,TAXI ME BAJO POR LA INMOBILIARIA DEL ESTADO Y CAMINO 3 BLOCA CALLES Y AHI ESTA
2002,2,2,146,663,0,32,10,1,1,1,1878.24,1878.24,0,0,35,141,1,0,116,1,2,20168,1,1,2,2,2,4,69,538,4,0,7,6,2,5,6,0,0,0,10,4,1,0,1,1,1,1,1,1,1,77,77,0,2,0,3,2,2,2,2,1,2,2,1,2,1,1,1,1,1,1,1,1,2,0,0,0,0,1,1,1,0,2,7777,2,2,0,0,0,0,0,2,0,0,0,1,1,0,2,58,0,0,0,2,0,0,0,0,0,0,0,NO SABE,IMSS UMF-16,CALLE 3,0,PUEBLO NUEVO,2,MEXICALI,2,BAJA CALIFORNIA,CONTRA ESQUINA RESTAURANT,TAXI FRANJA MORADA CAMION CALLE 3 BLANCO Y NEGRO
2002,2,2,146,663,0,33,11,1,1,1,1878.24,1878.24,0,0,35,142,1,0,116,1,3,20168,1,1,2,2,2,4,69,539,1,1,7,6,2,5,6,0,0,0,10,4,1,0,1,1,1,1,1,1,1,7,0,1,0,10,3,2,1,2,1,2,2,2,0,9,1,1,1,1,1,1,1,1,2,0,0,0,0,1,1,1,0,2,8888,2,2,0,0,0,0,0,2,0,0,0,1,1,0,3,13,0,33,58,2,0,0,0,0,0,0,0,FELIPE LARA MARTINEZ,IMSS UMF-16,CALLE 3,0,PUEBLO NUEVO,2,MEXICALI,2,BAJA CALIFORNIA,CONTRA ESQUINA RESTAURANT. PALETERIA MICHOACANA ENFRENTE,TAXI FRANJA MORADA CAMION CALLE 3 BLANCO Y NEGRO
2002,2,2,146,752,0,34,12,1,1,1,1878.24,1878.24,0,0,38,152,1,0,132,1,4,20174,1,1,1,1,1,5,72,559,10,0,6,7,4,5,0,0,0,0,2.5,3,0,10,4,1,1,1,1,1,1,77,77,0,0,30,2,1,2,2,1,1,1,1,2,1,1,2,1,1,1,1,1,1,1,55,2,1,0,2,0,0,0,0,0,2,2,0,0,0,0,0,2,0,0,0,1,1,0,2,31,21,0,0,2,0,0,0,0,0,0,0,DRA. LORENA ARRIAGA,CLINICA DENTAL INFANTIL,AV. CALZADA AVIACION # 384,0,,2,MEXICALI,2,BAJA CALIFORNIA,A UN LADO HAY UN TALLER DE CARROCERIA Y AL OTRO LADO HAY UN PARQUE,CAMION (CONSTITUCION) AMARILLO CON BLANCO TAXI FRANJA AZUL MARINO (CONSTITUCION)
2002,2,2,146,753,0,35,13,1,1,1,1878.24,1878.24,0,0,39,155,1,0,132,1,2,20175,1,1,1,1,1,2,73,562,6,0,5,6,11,4,0,0,0,0,7777.77,3,0,10,4,1,1,1,1,1,2,2,0,2,0,20,1,1,1,2,1,1,2,2,1,2,1,1,1,1,1,1,1,1,1,200,2,1,0,2,0,0,0,0,0,2,2,0,0,0,0,0,2,0,0,0,2,1,0,1,21,31,0,0,1,6,0,11,0,77,0,1,DR. ERNESTO URIAS,CONSULTORIO PARTICULAR,AV. MADERO S/N,0,CENTRO DE LA CIUDAD,2,MEXICALI,2,BAJA CALIFORNIA,EN LA ESQUINA ESTA EL RESTAURANTE DE COMIDA CHINA (CHINA TOWM),CONSTITUCION (CAMION) AMARILLO Y BLANCO
2002,2,2,146,843,0,36,14,1,1,1,1878.24,1878.24,0,0,48,189,1,0,148,1,3,20185,1,1,1,1,1,6,82,596,1,2,7,6,2,1,6,0,0,0,4,3,0,25,3,2,1,1,2,2,1,3,0,2,0,20,3,2,2,2,1,1,1,1,2,2,1,1,1,1,1,2,1,1,2,0,0,0,0,1,1,1,0,1,7777,2,2,0,0,0,0,0,2,0,0,0,2,2,5,4,0,0,12,51,2,0,0,0,0,0,0,0,NO SABE,IMSS CLINICA 31,CALLE LERDO,0,COL. NUEVA,2,MEXICALI,2,BAJA CALIFORNIA NORT,ENFRENTE ESTA UNIFORMES PROFECIONALES EN CONTRA ESQUINA ESTA UNA PALETERIA (MICH,CAMION FLORES MAGON TAXI ALAMEDA
2002,2,2,146,844,0,37,15,1,1,1,1878.24,1878.24,0,0,49,194,1,0,148,1,2,20186,1,1,1,1,1,5,83,601,1,6,7,6,2,4,0,0,0,0,7777.77,3,0,20,3,1,2,1,2,1,1,3,0,2,0,20,2,1,1,2,1,1,2,2,1,1,1,1,1,1,1,1,1,1,2,0,0,0,0,1,1,1,0,1,9999,2,2,0,0,0,0,0,1,15,0,0,1,1,0,2,41,58,0,0,1,77,0,77,0,1,0,24,DR. RAFAEL LEON,IMSS CLINICA 31,CALLE LERDO,0,COL. NUEVA,2,MEXICALI,2,BAJA CALIFORNIA,ENFRENTE ESTA UNIFORMES PROFECIONALES PARQUE DE RECTORIA CONTRA ESQUINA PALETERI,CAMION FLORES MAGON TAXI ALAMEDA
2002,2,2,146,845,0,38,16,1,1,1,1878.24,1878.24,0,0,50,199,1,0,148,1,2,20187,1,1,1,1,1,7,84,606,1,6,7,6,2,4,0,0,0,0,7777.77,4,0,30,2,1,1,1,1,1,1,77,77,0,24,0,2,1,2,2,1,2,2,2,1,1,1,2,1,1,1,1,1,2,2,0,0,0,0,1,1,1,0,3,55,2,2,0,0,0,0,0,2,0,0,0,1,1,0,2,21,31,0,0,1,77,0,4,0,1,0,3,DR. MORALES,I.M.S.S. CLINICA 31,CALLE LERDO,0,COL. NUEVA,2,MEXICALI,2,BAJA CALIFORNIA,ENFRENTE ESTA UNIFORMES PROFECIONALES EN CONTRA ESQUINA HAY UNA PALETERIA (MICHO,CAMION FLORES MAGON CORREGIDORA TAXI ALAMEDA.
2002,2,2,146,927,0,39,17,1,1,1,1878.24,1878.24,0,0,52,206,1,0,163,1,2,20188,1,1,1,1,1,4,86,613,1,2,77,6,11,4,0,0,0,0,7777.77,3,0,5,4,1,1,1,1,1,1,77,77,0,0,15,2,1,1,1,1,1,2,1,1,2,1,1,1,1,1,1,1,1,1,50,3,1,1,1,1,1,0,3,8888,1,9,1,0,3,150,0,2,0,0,0,1,1,0,1,41,12,0,0,2,0,0,0,0,0,0,0,DRA MARTINA GALLARDO URIAS,,AV. BOLIVIA Y MANAGUA # 500 COL. CUAUHTE,0,COL. CUAUHTEMOC,2,MEXICALI,2,BAJA CALIFORNIA,,
2002,2,2,146,929,0,40,18,1,1,1,1878.24,1878.24,0,0,54,215,1,0,163,1,2,20190,1,1,1,1,1,2,88,622,1,2,77,6,11,4,0,0,0,0,7777.77,3,0,15,3,1,1,1,1,1,1,1,0,2,0,40,1,1,1,2,1,1,2,1,2,1,1,1,1,1,1,1,1,1,1,100,3,1,1,1,1,1,0,3,150,2,2,0,0,0,0,0,2,0,0,0,8,1,0,1,44,58,0,0,2,0,0,0,0,0,0,0,DR. RAUL ARTURO GOMEZ MARISCAL,CONSULTORIO PARTICULAR,AV. BRAVO,0,CENTRO DE LA CIUDAD,2,MEXICALI,2,BAJA CALIFORNIA,A UN LADO DE SALON SOCILA DE LOS PETROLEROS COMO A 3 LOTES Y SE ENCUENTRA UBICAD,SE TOMA EL CAMION FLORES MAGON DE COLOR VERDE CON BLANCO Y SE BAJA EN UNA REFACC
2002,2,2,146,931,0,41,19,1,1,1,1878.24,1878.24,0,0,55,218,1,0,163,1,3,20192,1,1,1,1,1,4,89,625,1,3,7,6,2,4,0,0,0,0,7777.77,2,0,10,4,1,1,1,1,1,1,77,77,0,1,0,4,2,2,2,1,2,1,2,1,2,1,1,1,1,1,1,1,2,2,0,0,0,0,1,1,1,0,2,7777,2,1,1,0,2,7777,0,2,0,0,0,1,2,12,3,99,99,99,0,2,0,0,0,0,0,0,0,EN EL 2DO PISO DEL IMSS.,IMSS,,0,COL. NUEVA,2,MEXICALI,2,BAJA CALIFORNIA,ENFRENTE DEL PARQUE DE RECTORIA,SE TOMA EL CAMION FLORES MAGON Y SE BAJA EN EL PARQUE DE RECTORIA
2002,2,2,146,1015,0,42,20,1,1,1,1878.24,1878.24,0,0,58,232,1,0,178,1,5,20195,1,1,1,1,1,7,92,639,1,3,6,6,2,5,0,0,0,0,8,4,0,15,4,1,1,1,1,1,1,3,0,2,0,5,2,2,1,2,1,1,2,1,2,2,1,1,1,1,1,1,1,1,2,0,0,0,0,1,1,1,0,2,9999,1,1,1,2,0,7777,0,2,0,0,0,1,1,0,2,58,27,0,0,1,5,0,11,0,8,0,3,SERGIO AVELAR RODRIGUEZ MEDICO GENERAL,I.M.S.S. UMF 31,AV. LERDO,0,NUEVA,2,MEXICALI,2,BAJA CALIFORNIA,ENFRENTE ASADERO LA CHUZA,CAMION FLORES MAGON VERDE Y BLANCO
2002,2,2,146,1248,0,43,21,1,1,1,1878.24,1878.24,0,0,73,303,1,0,219,1,5,20211,1,1,1,1,1,5,107,710,1,1,6,6,2,4,0,0,0,0,7777.77,3,0,15,3,1,1,1,1,1,1,1,20,2,0,20,2,1,1,1,1,1,2,1,0,2,1,1,1,1,1,1,1,1,2,0,0,0,0,1,1,1,0,2,7777,2,2,0,0,0,0,0,2,0,0,0,1,1,0,2,22,27,0,0,2,0,0,0,0,0,0,0,HECTOR HURTADO,SEGURO SOCIAL,LERDO,0,COLONIA NUEVA,2,MEXICALI,0,BAJA CALIFORNIA,,
2002,2,2,146,1359,0,44,22,1,1,1,1878.24,1878.24,0,0,75,312,1,0,239,1,2,20213,1,1,3,3,3,4,109,719,1,1,6,6,2,4,0,0,0,0,7777.77,4,0,15,2,1,1,1,1,1,1,0,30,3,1,0,2,1,1,1,1,1,2,2,1,2,1,1,1,1,1,1,1,1,2,0,0,0,0,1,1,1,0,3,75,1,1,1,1,0,7777,0,2,0,0,0,1,2,4,2,42,31,0,0,2,0,0,0,0,0,0,0,DR. TELLES,IMSS,CALLE LERDO,0,COLONIA NUEVA,2,MEXICALI,2,,"ENFRENTE EXISTE UN AZADERO Y VARIOS COMERCIOS,TAMBIEN ESTA LA RECTORIA.",TOMANDO CUALQUIER CAMION QUE PASE POR EL SEGURO (LOS VERDES) POR TODA LA ZARAGOS
2002,2,2,146,1359,0,45,23,1,1,1,1878.24,1878.24,0,0,75,313,1,0,239,1,3,20213,1,1,3,3,3,4,109,720,1,1,5,5,11,4,0,0,0,0,7777.77,3,0,15,3,1,1,1,1,1,1,0,10,4,0,30,1,1,1,1,1,1,2,1,0,2,1,1,1,1,1,1,1,1,1,100,3,1,0,1,1,1,0,3,50,2,2,0,0,0,0,0,2,0,0,0,1,1,0,1,22,42,0,0,2,0,0,0,0,0,0,0,DR. FRANCISCO JAVIER CARBAJAL CADENA,LABORATORIO ARZAS,ZARAGOZA Y CALLE F,0,COLONIA NUEVA,2,MEXICALI,2,BAJA CALIFORNIA,"PUES ESTA POR TODA LA ZARAGOZA,NO RECUERDO OTRA REFERENCIA","POR TODA LA ZARAGOZA EN DONDE CRUZA LA ""F"" VUELTA A MANO DERECHA"
2002,2,2,146,1359,0,46,24,1,1,1,1878.24,1878.24,0,0,75,314,1,0,239,1,4,20213,1,1,3,3,3,4,109,721,1,1,77,77,9,99,0,0,0,0,9999.99,9,99,99,0,1,1,1,1,1,1,77,77,0,88,88,1,1,1,1,1,1,2,2,0,2,1,1,1,1,1,1,1,1,1,1000,4,1,0,2,0,0,0,0,0,1,1,1,1,0,200,0,2,0,0,0,1,1,0,1,21,42,0,0,2,0,0,0,0,0,0,0,DR.FRANCISCO JAVIER CARBAJAL CADENA,LABORATORIO ARZAC,"ZARAGOZA Y CALLE F""",0,COLONIA NUEVA.,2,MEXICALI,2,BAJA CALIFORNIA,POR TODA LA ZARAGOZA NO RECUERDA REFERENCIA,"POR TODA LA ZARAGOZA LLEGA A LA CALLE ""F"" Y EN ESE CUADRO ESTA EL CONSULTORIO."
2002,2,2,146,1361,0,47,25,1,1,1,1878.24,1878.24,0,0,77,319,1,0,239,1,2,20215,1,1,1,1,1,3,111,726,10,0,5,7,11,4,0,0,0,0,7777.77,2,0,10,4,1,1,1,1,1,1,77,77,0,0,30,2,1,2,2,1,1,1,2,2,2,1,1,1,1,1,1,1,1,1,1000,3,1,0,2,0,0,0,0,0,2,2,0,0,0,0,0,2,0,0,0,1,1,0,1,21,22,0,0,2,0,0,0,0,0,0,0,ROGELIO MILLANO,ES CONSULTORIO Y TIENE EL NOMBRE DEL DOC,"CALLE ""G""",0,COLONIA NUEVA,2,MEXICALI,2,BAJA CALIFORNIA,A 1/2 CUADRA DEL IMSS,"POR LA ZARAGOZA Y DONDE TOPA LA CALLE ""G"" AHI ESTA A 1/2 CUADRA"
2002,2,2,241A,2,0,48,26,1,1,2,1808.27,2044.13,0,0,81,330,1,0,1,1,2,20219,1,1,1,1,1,6,115,737,1,6,5,6,2,1,6,0,0,0,1,5,0,40,1,1,1,1,1,1,1,3,0,1,0,20,2,1,1,1,1,1,1,1,1,1,1,1,1,1,1,1,1,1,2,0,0,0,0,1,1,1,0,1,8888,1,2,1,1,0,7777,0,2,0,0,0,1,1,0,2,21,27,0,0,2,0,0,0,0,0,0,0,NO SABE,IMSS CLINICA 28,CALZADA INDEPENDENCIA,0,FRACCIONAMIENTO CALAFIA,0,MEXICALI,0,BAJA CALIFORNIA,ENFRENTE HAY UN ASADERO (LA CABANA),CAMION CALLE G TAXI PROHOGAR (VERDE)
2002,2,2,241A,3,0,49,27,1,1,2,1808.27,2044.13,0,0,82,338,1,0,1,1,4,20220,1,1,1,1,1,4,116,745,2,0,6,5,2,6,0,0,0,0,12,3,0,30,3,1,1,1,1,1,1,2,0,1,0,10,2,1,2,2,2,2,2,2,2,2,1,2,1,1,1,1,2,2,2,0,0,0,0,2,0,0,0,0,0,2,2,0,0,0,0,0,2,0,0,0,2,1,0,2,12,13,0,0,2,0,0,0,0,0,0,0,NO SE,CLINICA 28,CALZ. INDEP.,0,FRACC CALAFIA,2,MEXICALI,2,MEXICALI,ASADERO DE TACOS. ENFRENTE SE LLAMA LA CABANA,CAMION CALLE G. DONDE ESTA ASADERO LA CABANA
2002,2,2,241A,6,0,50,28,1,1,2,1808.27,2044.13,0,0,84,342,1,0,1,1,1,20222,1,1,1,1,1,2,118,749,9,0,77,5,88,1,0,0,0,0,0,1,99,99,0,1,2,2,1,1,2,77,77,0,0,3,2,9,9,9,9,9,9,9,9,9,1,2,1,1,1,1,1,2,2,0,0,0,0,2,0,0,0,0,0,2,2,0,0,0,0,0,2,0,0,0,9,2,99,1,77,0,0,0,2,0,0,0,0,0,0,0,,,,0,,0,,0,,,
2002,2,2,241A,86,0,51,29,1,1,2,1808.27,2044.13,0,0,87,353,1,0,15,1,2,20225,1,1,2,2,2,5,121,760,1,3,5,6,11,4,0,0,0,0,7777.77,3,0,15,3,1,1,1,1,1,2,77,77,0,0,15,2,1,1,2,1,1,2,1,1,1,1,1,1,1,1,2,1,1,1,50,3,1,0,1,1,1,0,3,30,9,9,0,0,0,0,0,2,0,0,0,3,1,0,2,27,31,0,0,2,0,0,0,0,0,0,0,DR. JOSE LUIS ROCHA GARCIA,CONSULTORIO PARTICULAR,RIO CULIACAN 901 Y FUENTE CALDERON,0,COL. INDEPENDENCIA,2,MEXICALI,2,BAJA CALIFORNIA,HAY UNA FARMACIA LLAMADA SAN DIEGO A UN LADO,PRO-HOGAR CAMION CAFE CON BLANCO
2002,2,2,241A,86,0,52,30,1,1,2,1808.27,2044.13,0,0,87,355,1,0,15,1,4,20225,1,1,2,2,2,5,121,762,1,3,7,6,11,4,0,0,0,0,7777.77,4,0,5,4,1,1,1,1,1,1,77,77,0,0,15,1,1,1,1,1,1,1,1,1,1,1,1,1,1,1,1,1,1,2,0,0,0,0,1,1,1,0,3,80,1,2,1,1,0,7777,0,2,0,0,0,1,1,0,1,21,44,0,0,2,0,0,0,0,0,0,0,MANUEL O. MEZA SANTANA,HOSPITAL LAS CALIFORNIA,NO SE,0,CENTRO,2,MEXICALI,2,BAJA CALIFORNIA,POR EL PARQUE DEL MARIACHI,PASANDO LA CANTINA DE RO PEPE LUEGO SE MIRA EL EDIFICIO GRIS DEL HOSPITAL.
2002,2,2,241A,88,0,53,31,1,1,2,1808.27,2044.13,0,0,88,358,1,0,15,1,2,20226,1,1,1,1,1,7,122,765,1,1,6,5,2,4,0,0,0,0,7777.77,4,0,30,3,1,1,1,2,1,1,2,0,2,0,10,2,1,1,1,1,1,1,1,1,1,1,1,1,1,1,1,1,1,2,0,0,0,0,2,0,0,0,0,0,2,2,0,0,0,0,0,2,0,0,0,1,1,0,2,41,58,0,0,2,0,0,0,0,0,0,0,NO SABE EL NOMBRE DEL PARAMEDICO,IMSS CLINICA 28,CALZ.INDEPENDENCIA S/N,0,FRACC.CALAFIA,2,MEXICALI,2,BAJA CALIFORNIA,"ENFRENTE ESTA EL ASADERO LA CABANA,Y BAJANDO EL PUENTE INDEPENDIENTE","TAXI CON FRANJA VERDE (PRO-HOGAR) CAMION CALLE ""G"" COLOR AZUL CON BLANCO"
2002,2,2,241A,170,0,54,32,1,1,2,1808.27,2044.13,0,0,92,374,1,0,29,1,2,20231,1,1,1,1,1,4,126,781,5,0,6,5,2,4,0,0,0,0,7777.77,5,0,20,3,1,1,1,1,1,1,1,0,2,0,15,2,1,1,2,1,1,1,1,1,1,1,1,1,1,1,1,1,1,2,0,0,0,0,2,0,0,0,0,0,2,2,0,0,0,0,0,2,0,0,0,9,1,0,2,31,41,0,0,2,0,0,0,0,0,0,0,DR.ELISEO CORRALES CONSULTORIO NO. 20,I.M.S.S.,,0,FRACC. CALAFIA,2,MEXICALI,2,BAJA CALIFORNIA,"ENFRENTE DEL ASADERO LA ""CABANA""","TOMA EL CAMION CALLE ""G"" DE COLOR BLANCO CON AZUL Y SE BAJA EN UNA PRIMARIA ENFR"
2002,2,2,241A,252,0,55,33,1,1,2,0,0,0,0,97,393,1,0,43,1,2,20236,1,3,2,2,0,4,131,800,0,0,0,0,0,0,0,0,0,0,0,0,0,0,0,0,0,0,0,0,0,0,0,0,0,0,0,0,0,0,0,0,0,0,0,0,0,0,0,0,0,0,0,0,0,0,0,0,0,0,0,0,0,0,0,0,0,0,0,0,0,0,0,0,0,0,0,0,0,0,0,0,0,0,0,0,0,0,0,0,0,0,,,,0,,0,,0,,,
2002,2,2,241A,252,0,56,34,1,1,2,0,0,0,0,97,395,1,0,43,1,4,20236,1,5,2,2,0,4,131,802,0,0,0,0,0,0,0,0,0,0,0,0,0,0,0,0,0,0,0,0,0,0,0,0,0,0,0,0,0,0,0,0,0,0,0,0,0,0,0,0,0,0,0,0,0,0,0,0,0,0,0,0,0,0,0,0,0,0,0,0,0,0,0,0,0,0,0,0,0,0,0,0,0,0,0,0,0,0,0,0,0,0,,,,0,,0,,0,,,
2002,2,2,241A,340,0,57,35,1,1,2,1808.27,2044.13,0,0,101,411,1,0,58,1,2,20241,1,1,1,1,1,5,135,818,1,1,6,6,7,1,6,0,0,0,5,4,0,40,1,1,1,1,1,1,1,0,30,4,0,20,1,1,1,2,1,1,2,2,1,1,1,1,1,1,1,1,1,1,2,0,0,0,0,1,1,1,0,2,7777,2,2,0,0,0,0,0,2,0,0,0,2,1,0,2,41,45,0,0,2,0,0,0,0,0,0,0,DR. PEREZ ENCINA CONSULTORIO # 3,ISSTECALI,,0,,2,MEXICALI,2,BAJA CALIFORNIA,ATRAS DE LA CENTRAL CAMIONERA Y FRACCIONAMIENTO LOS ARCOS,TOMAR EL CAMION V.CARRANZA DE COLOR BLANCO CON AMARILLO Y SE BAJA EN LA CENTRAL
2002,2,2,241A,341,0,58,36,1,1,2,1808.27,2044.13,0,0,102,419,1,0,58,1,5,20242,1,1,1,1,1,6,136,826,1,6,6,6,8,1,6,0,0,0,2,3,1,0,2,1,2,1,2,2,1,2,0,2,0,10,1,1,1,2,1,1,2,2,2,1,1,1,1,1,1,1,2,1,2,0,0,0,0,1,1,1,0,2,7777,2,2,0,0,0,0,0,2,0,0,0,1,1,0,3,31,0,12,33,2,0,0,0,0,0,0,0,DR. AGUILAR CONSULTORIO # 6,ISSTE,AV. DEL HOSPITAL,0,,2,MEXICALI,2,BAJA CALIFORNIA,SE ENCUENTRA ENFRENTE DEL COMERCIO DE TELAS Y A UN LADO DEL HOSPITAL GENERAL.,SE TOMA EL CAMION VENUSTIANO CARRANZA DE COLOR BLANCO CON AMARILLO Y SE BAJA EN
2002,2,2,241A,343,0,59,37,1,1,2,1808.27,2044.13,0,0,104,426,1,0,58,1,2,20244,1,1,1,1,1,3,138,833,1,6,8,6,2,6,0,0,0,0,1.25,4,1,0,1,1,1,2,2,1,2,3,0,1,0,10,3,2,1,2,1,1,2,1,2,2,1,2,1,1,1,2,2,1,2,0,0,0,0,1,4,1,0,2,7777,1,2,1,0,1,7777,0,2,0,0,0,1,8,0,3,99,0,77,12,2,0,0,0,0,0,0,0,NO LO CONOCE,CLINICA 28 IMSS,CALZADA INDEPENDENCIA,0,FRACC. CALAFIA.,2,MEXICALI,2,BAJA CALIFORNIA,BAJANDO PUENTE INDEPENDENCIA,CAMION CALLE G AZUL CON BLANCO.
2002,2,2,241A,344,0,60,38,1,1,2,1808.27,2044.13,0,0,105,428,1,0,58,1,1,20245,1,1,1,1,1,5,139,835,10,0,5,7,11,4,0,0,0,0,7777.77,2,0,10,4,1,1,1,1,1,1,77,77,0,0,15,2,1,2,2,1,1,1,1,2,1,1,1,1,1,1,1,1,1,1,70,2,1,0,1,1,1,0,3,40,2,2,0,0,0,0,0,2,0,0,0,1,1,0,2,31,12,0,0,2,0,0,0,0,0,0,0,DRA. REBECA CASTANEDA C. DENTISTA,CONSULTORIO PARTICULAR,AV. CASAS GRANDES # 2613,0,VALLE DEL SOL,0,MEXICALI,0,BAJA CALIFORNIA,HAY 4 TAQUERIAS EN CADA CASA,CONSTITUCION (CAMION) AMARILLO Y BLANCO TAXI FRANJA MORADA
2002,2,2,241A,429,0,61,39,1,1,2,1808.27,2044.13,0,0,106,434,1,0,73,1,2,20246,1,1,2,2,1,3,140,841,1,3,7,6,8,1,6,0,0,0,2.5,4,0,20,2,1,2,1,2,1,1,6,0,1,0,10,2,1,1,2,2,2,2,1,1,1,1,2,1,1,1,2,2,1,2,0,0,0,0,2,0,0,0,0,0,1,2,1,1,0,7777,0,2,0,0,0,1,1,0,2,41,51,0,0,2,0,0,0,0,0,0,0,NO SABE,ISSSTE,,0,CENTRO CIVICO,2,MEXICALI,2,BAJA CALIFORNIA,ENFRENTE ESTA C.F.E. A UN LADO ESTA EL HOSPITAL,CAMION VILLA VERDE CAMION PROHOGAR TAXI PROHOGAR.
2002,2,2,241A,429,0,62,40,1,1,2,0,0,0,0,106,435,1,0,73,1,3,20246,1,7,2,2,1,3,140,842,0,0,0,0,0,0,0,0,0,0,0,0,0,0,0,0,0,0,0,0,0,0,0,0,0,0,0,0,0,0,0,0,0,0,0,0,0,0,0,0,0,0,0,0,0,0,0,0,0,0,0,0,0,0,0,0,0,0,0,0,0,0,0,0,0,0,0,0,0,0,0,0,0,0,0,0,0,0,0,0,0,0,,,,0,,0,,0,,,