clave,clave de la entidad,clave del municipio,numero de area geoestadistica,numero de vivienda,work,numero consecutivo unico,numero consecutivo unico,clave de la entidad,estrato de poblacion,pageb,wh,wi,w,rural,pviv2,numero unico,iupm,incong,numero de hogar encuestado,iusuario,numero clave,resultg,resulti,utiln,utilc,utilr,indin,pviv,pindi,�en las ultimas dos semanas cual fue el principal motivo por el que (usted/nombre) recibio atencion(la ultima vez)?,�desde cuando comenzo a estar enfermo (usted/nombre),�en donde se atendio (atendieron a )?,�me podria decir quien lo (la) atendio en esa ocasion (quien atendio a �),� a que institucion pertenece la persona que lo (la) atendio ?,�en que se fue (fueron) al lugar en donde lo (la) atendieron?,i062,i063,i064,i065,�cuanto pago para llegar hasta ese lugar?,"cuestionario las opciones son de 1 al 5 y 8,9 ",i091,i092,�el tiempo que tardo en llegar al lugar donde lo (la) atendieron le parecio �,�el lugar donde espero (usted/nombre) para que lo (la) atendieran .. estaba limpio?,�el lugar donde espero (usted/nombre) para que lo (la) atendieran .. habia sillas suficientes?,�el lugar donde espero (usted/nombre) para que lo (la) atendieran habia banos?,�el lugar donde espero (usted/nombre) para que lo (la) atendieran hbia ventilacion?,�el lugar donde espero (usted/nombre) para que lo (la) atendieran habia luz sificiente?,�el lugar donde espero (usted/nombre) para que lo (la) atendieran habia letreros de orientacion?,�aproximandamente cuanto tiempo tuvo que esperear para que lo (la) atendieran? horas,�aproximandamente cuanto tiempo tuvo que esperear para que lo (la) atendieran? minutos,�el tiempo que espero para que lo (la) atendieran le parecio,�cuanto tiempo duro la consulta? horas,�cuanto tiempo duro la consulta? minutos,"�el servicio que le dio la persona que lo atendio, le perecio �",�recomendaria usted a la persona que lo atendio con algun familiar o amigo?,�la persona que lo (la) atendio lo (la) peso?,�la persona que lo (la) atendio lo (la) midio la (estatura),�la persona que lo (la) atendio lo (la) reviso?,�la persona que lo (la) atendio lo (la) le dio una ezplicacion clara acerca de su salud?,�la persona que lo (la) atendio lo (la) le dio algun consejo de limpieza (higiene personal?,�la persona que lo (la) atendio lo (la) rle dijo algo sobre su alimentacion (o lo que acostumbra comer?,�la persona que lo (la) atendio lo (la) (para mayores de 3 anos) le tomo la presion?,�la persona que lo (la) atendio lo (la) le hizo alguna recomendacion?,�el lugar en donde lo atendieron estaba limpio?,�el lugar en donde lo atendieron habia sillas sificientes?,�el lugar en donde lo atendieron habia escritorio (mesa para escribir)?,�el lugar en donde lo atendieron habia mesa o cama para explorar?,�el lugar en donde lo atendieron habia luz suficiente?,�el lugar en donde lo atendieron habia ventilacion?,�el lugar en donde lo atendieron habia privacidad?,"�el lugar en donde lo atendieron habia todo lo necesario como medicamentos,instrumental o material de curacion?",�le cobraron por la atencion que recibio?,�cuanto le cobraron por la atencion?,�como le parecio lo que le cobraron?,�como pago por la atencion que recibio? en efectivo,�como pago por la atencion que recibio? a credito,�durante la consulta le recetaron medicinas?,sobre las medicinas que le receto �la persona que lo atendio�?,�consiguio las medicinas?,�por que no las consiguio?,�en donde las consiguio?,�cuanto pago por las medicinas?,"�en la consulta le pidieron a (usted/nombre) que se hiciera algun examen de laboratorio (sangre,orina) y/o gabinete (rayos x, ultrasonido, electrocardiograma,tomografia, etc)","�en la consulta le pidieron a (usted/nombre) que se hiciera algun examen de laboratorio (sangre,orina) y/o gabinete (rayos x, ultrasonido, electrocardiograma,tomografia, etc)",�se hizo(usted/nombre) los examenes ?,�en donde le hicieron los examenes de laboratorio �?,�en donde le hicieron los examenes de laboratorio �?,�cuanto pago  por los examenes de laboratorio � ?,�cual fue la principal razon por la que no se hizo expamenes de laboratorio �?,"�aparte de lo que ya me dijo, tuvo otros gastos por atenderse (por la atencion de usted/nombre)?",�en que y cuanto gasto?,�en que y cuanto gasto?,�en que y cuanto gasto?,�noto mejoria  en su salud despues de esta atencion?,�si usted tuviera oportunidad de escoger regresaria a ese mismo lugar para atenderse?,�por que no regresaria?,"�en general, la calidad de la atencion que recibio fue ..","�por que le parecio (muy buerna,buena o regular) la atencion que recibio?","�por que le parecio (muy buerna,buena o regular) la atencion que recibio?","�por que le parecio (regular,mala o muy mala) la atencion que recibio?","�por que le parecio (regular,mala o muy mala) la atencion que recibio?","�en relacion al motivo de la consulta, anteriormente se ha atendido en otro lugar?",�me puede decir en donde se ha atendido anteriormente?,�me puede decir en donde se ha atendido anteriormente?,�a que institucion pertenece este lugar?,�a que institucion pertenece este lugar?,�por que dejo de atenderse en ese lugar?,�por que dejo de atenderse en ese lugar?,�de (mes) de 1993 a (mes) de 1994 cuantas veces se atendio por este mismo motivo?,nombre del encuestado,nombre del hospital,domicilio del hospital,clave de la localidad,nombre de la localidad,nombre de la localidad,nombre del municipio,clave del estado,nombre del estado,referencia del domicilio,forma de llegar al hospital
13048,13,48,158,366,0,375,1,1,1,1,0,0,0,0,33,125,0,51,1,1,130320,1,7,1,1,0,2,1661,8210,0,0,0,0,0,0,0,0,0,0,0,0,0,0,0,0,0,0,0,0,0,0,0,0,0,0,0,0,0,0,0,0,0,0,0,0,0,0,0,0,0,0,0,0,0,0,0,0,0,0,0,0,0,0,0,0,0,0,0,0,0,0,0,0,0,0,0,0,0,0,0,0,0,0,0,0,0,0,0,0,0,0,,,,0,,0,,0,,,
13048,13,48,158,369,0,376,2,1,1,1,1007.74,1108.51,0,0,34,127,0,51,1,1,130321,1,1,1,1,1,3,1662,8212,1,3,5,6,11,1,0,0,0,0,0,3,0,45,2,1,1,1,1,1,1,0,30,4,0,3,2,1,2,2,1,1,1,1,1,1,1,1,1,1,1,1,1,1,1,50,3,1,0,1,1,1,0,3,8888,2,2,0,0,0,0,0,2,0,0,0,1,1,0,2,32,51,0,0,2,0,0,0,0,0,0,0,DR ERNESTO,,LIRA 2 PEDRO ESCOBEDO,0,FERNANDO DE ELIZARDE,0,PACHUCA HGO,0,HIDALGO,UNA TIENDA AL LADO SE LLAMA (LA LIRA 2),DE SU DOMICILIO CAMINA A LA ESQUINA HOYO A LA DERECHA UNA A LA DERECHA UNA A LA
13048,13,48,158,668,0,377,3,1,1,1,1007.74,1108.51,0,0,31,118,0,42,1,1,130325,1,1,1,1,1,1,1659,8222,1,1,8,6,2,4,0,0,0,0,7777.77,2,88,88,0,1,1,1,1,1,1,0,0,5,88,88,1,1,2,2,2,2,2,2,2,2,8,8,8,1,1,1,1,1,8,0,0,0,0,1,1,1,0,1,7777,2,2,0,0,0,0,0,2,0,0,0,1,1,0,1,12,41,0,0,2,0,0,0,0,0,0,0,NO SABE,IMSS,NO SABE.,0,CESPEDES,0,,0,,NO SABE.,TAXI.
13048,13,48,158,253,0,378,4,1,1,1,1007.74,1108.51,0,0,23,86,0,35,1,3,130331,1,1,1,1,1,5,1651,8241,1,6,8,6,2,5,0,0,0,0,9999.99,3,0,15,4,1,1,1,1,1,1,0,30,2,0,15,3,1,1,1,1,1,1,1,1,1,1,1,1,1,1,1,1,1,2,0,0,0,0,1,1,1,0,1,7777,1,2,1,2,0,7777,0,2,0,0,0,1,1,0,3,52,58,99,99,2,0,0,0,0,0,0,0,DOMINGO DANIEL,IMSS,AV. MADERO S/N,0,NO SABE.,0,,0,HIDALGO,POR LA FEDERAL 1,TAXI-CAMION
13048,13,48,158,531,0,385,5,1,1,1,1007.74,1108.51,0,0,56,235,0,74,1,1,130356,1,1,1,1,1,6,1684,8347,1,3,6,6,8,6,0,0,0,0,9,4,0,45,3,1,1,1,1,1,1,2,0,2,0,5,3,1,2,2,2,2,2,2,2,2,1,1,1,1,1,2,1,1,2,0,0,0,0,1,1,1,0,1,7777,1,1,1,1,0,7777,0,2,0,0,0,1,1,0,3,99,99,12,22,2,0,0,0,0,0,0,0,DR. ACUNA ORTOPEDICO,ISSSTE,,0,CO ISSTE COLONIA ISSTE,0,PACHUCA HGO,0,HIDALGO,,TECNICA 31
13048,13,48,158,134,0,386,6,1,1,1,1007.74,1108.51,0,0,11,46,0,19,1,6,130357,1,1,1,1,1,6,1639,8358,1,6,8,6,2,4,0,0,0,0,0,3,0,10,4,1,2,1,2,1,1,77,77,0,0,10,2,1,2,2,1,1,1,1,1,1,1,2,1,1,1,2,1,1,2,0,0,0,0,1,2,1,0,2,7777,1,2,1,1,0,7777,0,2,0,0,0,2,1,0,2,14,45,0,0,2,0,0,0,0,0,0,0,DR ROBERTO GALVAN MED GENERAL,IMSS,AV. MADERO,0,AV. MADERO,1,PACHUCA,13,HIDALGO,JUNTO ESTA BOMBEROS LA IGLESIA DE SAN MARTIN,DE LA SURTIDORA HACIA LLEGAR AL SEGURO
13048,13,48,158,665,0,390,7,1,1,1,1007.74,1108.51,0,0,26,100,0,35,1,4,130380,1,1,1,1,1,7,1654,8456,1,1,5,6,10,1,0,0,0,0,0,2,0,10,4,1,1,1,1,1,1,0,3,4,0,20,2,1,1,1,1,1,1,1,1,1,1,1,1,1,1,1,1,1,1,25,4,4,4,1,1,3,7,3,20,2,2,0,0,0,0,0,2,0,0,0,1,1,0,2,31,0,0,0,2,0,0,0,0,0,0,0,NO SABE.,NO SABE,NO SABE.,0,SABINO,0,PACHUCA,0,HIDALGO,POR UNA CUCHILLITA.,CAMINANDO
13048,13,48,158,481,0,393,8,1,1,1,1007.74,1108.51,0,0,46,180,0,67,1,1,130387,1,1,1,1,1,5,1674,8492,8,0,7,6,8,6,0,0,0,0,8,3,0,15,2,1,1,1,9,1,1,1,0,2,0,15,3,1,1,1,1,1,1,1,1,9,1,1,1,1,1,8,1,1,2,0,0,0,0,1,1,1,0,1,7777,2,2,0,0,0,0,0,2,0,0,0,1,1,0,2,21,32,0,0,2,0,0,0,0,0,0,0,DR. CARLOS VARGAS,ISSTE,,0,ISSTE,0,,0,PACHUCA HGO,,FRENTE A TECNICA 1
13048,13,48,158,674,0,402,9,1,1,1,1007.74,1108.51,0,0,45,179,0,58,1,4,130462,1,1,1,1,1,4,1673,8700,1,6,7,6,2,77,0,0,0,0,10,5,2,0,3,1,2,1,1,1,1,0,30,3,0,20,2,9,1,1,1,2,1,1,1,1,1,1,1,1,1,1,1,1,2,0,0,0,0,2,0,0,0,0,0,1,1,1,2,2,7777,0,1,0,50,0,1,1,0,2,31,21,0,0,1,5,0,11,0,3,0,5,DR. MORENO OTOLARINGOLOGO,CENTRO MEDICO LA RAZA,LA RAZA,0,VALLEJO,7,GUSTAVO A MADERO,0,DISTRITO FEDERAL,ESTA EL MONUMENTO LA RAZA,TOMA UN AUTOBUS A LA CENTRAL CAMIONERA NORTE TOMA METRO A LA RAZA
13048,13,48,158,414,0,403,10,1,1,1,1007.74,1108.51,0,0,37,144,0,58,1,1,130463,1,1,1,1,1,6,1665,8701,1,1,5,6,11,1,0,0,0,0,0,1,0,5,4,1,1,8,1,1,8,0,5,4,0,10,2,1,1,1,1,1,1,1,1,1,1,1,1,1,1,1,1,1,1,25,3,2,0,1,1,1,0,3,20,2,2,0,0,0,0,0,2,0,0,0,1,1,0,2,31,51,0,0,2,0,0,0,0,0,0,0,DR. NESTOR DOMINGUEZ TELLEZ,,SABINO S/N,0,LA SURTIDORA,0,PACHUCA,0,HIDALGO,UNA TIENDA ESTA EN FRENTE,VALLARTA Y GUILLERMO PRIETO
13048,13,48,158,580,0,404,11,1,1,1,1007.74,1108.51,0,0,63,276,0,81,1,3,130466,1,1,1,1,1,3,1691,8720,3,0,8,5,2,5,0,0,0,0,4,3,0,15,4,1,1,1,1,1,1,0,5,4,0,10,2,1,2,2,2,2,2,2,2,2,1,1,1,1,1,1,1,1,2,0,0,0,0,2,0,0,0,0,0,2,2,0,0,0,0,0,2,0,0,0,8,1,0,2,12,33,0,0,2,0,0,0,0,0,0,0,NO SABE,IMSS,NO SABE,0,NO SABE,0,PACHUCA,0,,POR LA IGLESIA. SAN MARTIN,TAXI
13048,13,48,340,522,0,379,12,1,1,2,923.12,1031.72,0,0,113,509,0,51,1,3,130335,1,1,2,2,2,4,1741,8258,10,0,5,7,11,1,0,0,0,0,0,1,0,3,5,1,1,1,1,1,2,0,3,5,0,30,1,1,2,2,1,1,1,2,2,1,1,1,2,1,1,1,1,1,1,75,3,1,0,2,0,0,0,0,0,1,1,1,7,0,7777,0,2,0,0,0,1,1,0,1,12,21,0,0,2,0,0,0,0,0,0,0,DR AMERICA,,VICENTE GUERRERO,0,FELIPE ANGELES,0,PACHUCA HGO,13,HIDALGO,FRENTE A SUPER,CAMINANDO
13048,13,48,340,522,0,380,13,1,1,2,923.12,1031.72,0,0,113,510,0,51,1,4,130335,1,1,2,2,2,4,1741,8259,10,0,5,7,11,1,0,0,0,0,0,1,0,3,5,1,1,1,1,1,2,0,3,5,0,30,1,1,2,2,1,1,2,2,2,1,1,1,2,1,1,1,1,1,1,75,3,1,0,2,0,0,0,0,0,1,1,1,7,0,7777,0,2,0,0,0,1,1,0,1,12,21,0,0,2,0,0,0,0,0,0,0,DR AMERICA,,VICENTE GUERRERO,0,PACHUCA HGO FELIPE ANGELES,0,HIDALGO PACHUCA HGO,13,HIDALGO,FRENTE A UN SUPER,CAMINANDO
13048,13,48,340,255,0,381,14,1,1,2,0,0,0,0,101,445,0,36,1,1,130339,1,2,2,2,1,5,1729,8272,11,0,77,2,4,1,0,0,0,0,0,2,0,10,4,8,8,8,8,8,8,77,77,0,77,77,2,1,2,2,2,2,2,2,2,2,8,8,8,8,8,8,8,8,2,0,0,0,0,2,0,0,0,0,0,2,2,0,0,0,0,0,2,0,0,0,2,1,0,2,21,31,0,0,2,0,0,0,0,0,0,0,,D.I.F.,G. ALARCON.,0,SURTIDORA.,0,PACHUCA.,0,HIDALGO,PASAR POR LA AV. MADERO Y DESPUES TODO DERECHO,PASAR POR LA AV. MADERO Y DESPUES TODO DERECHO
13048,13,48,340,255,0,382,15,1,1,2,923.12,1031.72,0,0,101,446,0,36,1,2,130339,1,1,2,2,1,5,1729,8273,4,0,8,6,4,5,0,0,0,0,3.5,3,0,15,3,1,1,1,1,1,1,0,10,3,0,15,2,1,1,1,1,1,1,1,1,2,1,1,1,1,1,1,1,1,2,0,0,0,0,2,0,0,0,0,0,2,2,0,0,0,0,0,2,0,0,0,1,1,0,2,12,22,0,0,2,0,0,0,0,0,0,0,DR HECTOR CARRETO DIAZ,DIF.,G. ALARCON,0,SURTIDORA.,0,PACHUCA,0,HIDALGO.,PASAR POR LA AV. MADERO Y DESPUES TODO DERECHO,PASA POR LA AV. MADERO Y DESPUES TODO DERECHO.
13048,13,48,340,214,0,383,16,1,1,2,923.12,1031.72,0,0,94,421,0,30,1,8,130341,1,1,1,1,1,8,1722,8291,5,0,8,6,8,5,0,0,0,0,3.5,3,0,15,3,1,2,1,1,1,1,0,30,3,2,30,2,1,1,1,1,1,1,1,1,1,1,2,1,1,1,1,1,1,2,0,0,0,0,2,0,0,0,0,0,2,2,0,0,0,0,0,2,0,0,0,1,1,0,2,12,31,0,0,2,0,0,0,0,0,0,0,DR GINECOLOGO (NO SE ACUERDA).,ISSTE,CONOCIDO,0,COL. ISSTE.,0,PACHUCA,0,HIDALGO,CARR MEXICO - PACHUCA.,"NO RECUERDA PERO, PASAMOS POR LA CARR. MEXICO - PACHUCA (HIBA GRAVE)."
13048,13,48,340,298,0,384,17,1,1,2,923.12,1031.72,0,0,106,471,0,42,1,2,130347,1,1,1,1,1,6,1734,8313,1,6,8,6,2,5,0,0,0,0,3,3,0,10,3,1,1,1,1,1,1,0,10,3,0,10,3,1,1,1,1,1,1,1,1,1,1,1,1,1,1,1,1,1,2,0,0,0,0,1,1,1,0,1,7777,2,2,0,0,0,0,0,2,0,0,0,9,1,0,2,12,21,0,0,2,0,0,0,0,0,0,0,MEDICO FAMILIAR (NO RECUERDA EL NOMBRE),IMSS,AV. MADERO,0,AV. MADERO,1,PACHUCA,13,HIDALGO,ESTA LA ESTACION DE BOMBEROS LA IGLESIA DE SAN MARTIN ENFRENTE,TOMAR UN TAXI Y PASA POR EL BVLD FELIPE ANGELES Y PASA BANCOMER
13048,13,48,340,148,0,387,18,1,1,2,923.12,1031.72,0,0,90,398,0,21,1,1,130363,1,1,1,1,1,1,1718,8387,1,6,5,6,11,1,0,0,0,0,0,4,0,30,2,1,1,1,1,1,1,0,0,9,99,99,9,9,9,9,9,9,9,9,0,9,9,9,9,9,9,9,9,9,9,0,0,0,0,9,0,0,0,0,0,9,9,0,0,0,0,0,9,0,0,0,9,9,0,9,0,0,0,0,9,0,0,0,0,0,0,0,,,,0,,0,,0,,,
13048,13,48,340,104,0,388,19,1,1,2,923.12,1031.72,0,0,82,358,0,15,1,3,130368,1,1,1,1,1,3,1710,8406,3,0,8,6,8,5,0,0,0,0,5,4,88,88,0,1,1,1,1,1,1,0,15,3,88,88,2,1,1,2,1,1,2,2,2,2,1,1,1,1,1,1,1,1,2,0,0,0,0,1,1,1,0,1,7777,2,2,0,0,0,0,0,2,0,0,0,1,1,0,2,12,14,0,0,2,0,0,0,0,0,0,0,NO SABE.,ISSSTE.,NO SABE.,0,COLONIA ISSSTE,0,PACHUCA,0,HIDALGO,POR EL TEGNOLOGICO,TAXI O CAMION
13048,13,48,340,105,0,389,20,1,1,2,923.12,1031.72,0,0,84,366,0,15,1,3,130370,1,1,1,1,1,6,1712,8414,2,0,77,5,88,77,0,0,0,0,7777.77,8,77,77,0,8,8,8,8,8,8,0,0,9,0,2,2,1,2,2,2,2,2,2,2,2,8,8,8,8,8,8,8,8,2,0,0,0,0,2,0,0,0,0,0,2,2,0,0,0,0,0,2,0,0,0,8,1,0,2,31,0,0,0,2,0,0,0,0,0,0,0,NO SABE,NO SE SABE,EN SU ESCUELA LA VACUNARON,0,CESPEDES,0,PACHUCA,0,HIDALGO,POR EL ESTADIO ROSALES,TAXI
13048,13,48,340,461,0,391,21,1,1,2,923.12,1031.72,0,0,122,550,0,65,1,2,130381,1,1,1,1,1,5,1750,8461,1,3,5,6,11,4,0,0,0,0,7777.77,2,0,10,4,1,1,8,1,1,2,77,77,0,0,30,1,1,1,1,1,1,1,1,1,1,1,1,1,1,1,1,1,1,1,50,3,1,0,1,1,1,0,3,120,1,1,1,7,7,160,0,2,0,0,0,1,1,0,2,22,45,0,0,1,7,0,8,0,3,0,3,DR. MARIA DE LOS ANGELES LAZCANO,,BENEFICIO DEL PATIO,0,REAL DE MINA,0,PACHUCA,0,HIDALGO,NO SABE,CARRO
13048,13,48,340,459,0,392,22,1,1,2,923.12,1031.72,0,0,120,539,0,65,1,1,130383,1,1,1,1,1,6,1748,8469,1,6,7,5,2,5,0,0,0,0,7777.77,3,0,20,4,1,1,1,1,1,1,2,0,2,0,30,3,2,1,1,1,1,1,1,1,1,1,1,1,1,1,1,1,1,2,0,0,0,0,1,1,1,0,1,7777,2,2,0,0,0,0,0,2,0,0,0,3,1,0,2,31,51,0,0,2,0,0,0,0,0,0,0,DR MENDEZ,IMMS,,0,PACHUCA HGO,0,HIDALGO,0,,,TOMO UN TAXI AL SEGURO SOCIAL
13048,13,48,340,3,0,408,23,1,1,2,923.12,1031.72,0,0,70,303,0,1,1,1,130544,1,1,3,3,3,7,1698,8829,1,1,1,6,11,0,0,0,0,0,0,0,0,0,0,0,0,0,0,0,0,1,0,3,0,20,2,1,2,2,1,1,1,2,2,1,0,0,0,0,0,0,0,0,2,0,0,0,0,1,1,1,0,3,50,2,2,0,0,0,0,0,2,0,0,0,1,1,0,2,58,52,0,0,2,0,0,0,0,0,0,0,DR. LEONEL BARRON LOPEZ,,,0,,0,PACHUCA,0,HIDALGO,,
13048,13,48,340,3,0,409,24,1,1,2,923.12,1031.72,0,0,70,306,0,1,1,4,130544,1,1,3,3,3,7,1698,8832,1,1,1,6,11,0,0,0,0,0,0,0,0,0,0,0,0,0,0,0,0,1,0,3,0,20,2,1,2,2,1,1,1,2,2,1,0,0,0,0,0,0,0,0,2,0,0,0,0,1,1,1,0,3,50,2,2,0,0,0,0,0,2,0,0,0,1,1,0,2,58,52,0,0,2,0,0,0,0,0,0,0,LEONEL BARRON LOPEZ,CASA,,0,CUBITOS,0,PACHUCA,0,HIDALGO,,
13048,13,48,340,3,0,410,25,1,1,2,923.12,1031.72,0,0,70,309,0,1,1,7,130544,1,1,3,3,3,7,1698,8835,1,1,1,6,11,0,0,0,0,0,0,0,0,0,0,0,0,0,0,0,0,1,0,3,0,20,2,1,2,2,1,1,1,2,2,1,0,0,0,0,0,0,0,0,2,0,0,0,0,1,1,1,0,3,50,2,2,0,0,0,0,0,2,0,0,0,1,1,0,2,58,52,0,0,2,0,0,0,0,0,0,0,DR. LEONEL BARRON LOPEZ,CASA,NO SABE,0,NO SABE,0,PACHUCA,0,HIDALGO,NO SABE,NO SABE
13048,13,48,340,4,0,411,26,1,1,2,923.12,1031.72,0,0,71,310,0,1,1,1,130545,1,1,1,1,1,8,1699,8836,1,6,5,3,88,4,0,0,0,0,7777.77,3,0,5,4,1,1,1,1,1,2,1,30,3,0,40,1,1,1,1,1,1,2,1,1,1,1,1,1,1,1,1,1,1,1,60,4,1,0,1,1,1,0,1,7777,2,2,0,0,0,0,0,2,0,0,0,1,1,0,1,58,51,0,0,1,6,5,2,11,10,1,1,DR. VEGA 3-70-87,CONSULTORIO HOMEOPATA,ALLENDE # 616,0,CENTRO,0,PACHUCA,0,HIDALGO,,
13048,13,48,340,516,0,412,27,1,1,2,923.12,1031.72,0,0,96,427,0,30,1,2,130558,1,1,1,1,1,3,1724,8888,77,0,7,7,2,4,0,0,0,0,7777.77,2,0,10,4,1,2,1,1,1,1,77,77,0,77,77,2,1,1,1,1,1,1,1,1,1,1,2,1,1,1,1,1,1,2,0,0,0,0,2,0,0,0,0,0,2,2,0,0,0,0,0,2,0,0,0,1,1,0,2,21,31,0,0,2,0,0,0,0,0,0,0,EN GINECOLOGIA EN TOCOCIRUGIA,HOSPITAL DEL IMSS PACHUCA,AV MADERO,0,COLONIA MADERO,0,PACHUCA,0,HIDALGO,CERCA DE BOMBEROS POR DONDE ESTA EL HOSPITAL GENERAL,LLEGAR AV UNIVERSIDAD Y DERECHO HASTA LLEGAR A CALLE MADERO
13048,13,48,340,518,0,413,28,1,1,2,923.12,1031.72,0,0,98,432,0,30,1,1,130559,1,1,1,1,1,3,1726,8890,10,0,8,7,2,1,0,0,0,0,0,2,0,10,4,1,1,1,1,1,1,0,15,4,0,10,2,1,2,2,1,2,1,2,2,1,1,1,1,1,1,1,1,1,2,0,0,0,0,2,0,0,0,0,0,2,2,0,0,0,0,0,2,0,0,0,1,1,0,2,21,21,0,0,2,0,0,0,0,0,0,0,DRA DENTISTA.,IMSS,AV. MADERO,0,AV. MADERO,0,PACHUCA,0,HIDALGO,BOMBEROS ENFRE DE LA IGLESIA DE SAN MARTIN,LLEGAR AV. UNIVERSIDAD Y DERECHO HASTA LLEGAR A LA CALLE AV. MADERO
13048,13,48,340,252,0,414,29,1,1,2,0,0,0,0,99,435,0,36,1,1,130560,1,7,2,2,1,8,1727,8893,22,0,0,0,0,0,0,0,0,0,0,0,0,0,0,0,0,0,0,0,0,0,0,0,0,0,0,0,0,0,0,0,0,0,0,0,0,0,0,0,0,0,0,0,0,0,0,0,0,0,0,0,0,0,0,0,0,0,0,0,0,0,0,0,0,0,0,0,0,0,0,0,0,0,0,0,0,0,0,0,0,0,,,,0,,0,,0,,,
13048,13,48,340,252,0,415,30,1,1,2,923.12,1031.72,0,0,99,442,0,36,1,8,130560,1,1,2,2,1,8,1727,8900,1,9,4,6,4,5,0,0,0,0,3,3,0,10,3,1,1,1,1,1,1,0,15,4,88,88,1,1,1,1,1,2,1,1,0,2,1,1,1,1,1,1,1,1,1,70,3,2,6,1,1,1,0,3,8888,1,2,1,2,8,8888,0,1,9999,8888,8888,1,1,0,1,12,14,0,0,1,2,0,11,0,3,0,1,DR. MEDINA,DIF.,G. ALARCON,0,SURTIDORA.,0,PACHUCA,0,HIDALGO,ATRAS DEL ESCUELA PRESIDENTE ALEMAN.,SE VA POR LA AV. MADERO Y SUBE HACIA LA SURTIDORA
13050,13,50,33,566,0,347,31,1,2,1,1102.37,1102.37,0,0,144,670,0,101,1,1,130150,1,1,1,1,1,4,1772,7450,1,3,7,6,11,6,0,0,0,0,40,4,3,0,2,1,1,1,1,1,1,1,0,3,1,0,2,1,1,1,1,1,1,1,1,1,1,1,1,1,1,1,1,1,1,1500,4,1,0,1,1,1,0,1,7777,1,1,1,3,0,200,0,1,9999,50,9999,1,1,0,1,58,51,0,0,1,5,0,11,0,6,0,3,PATRICIA POMPO LOPEZ,HOSPITAL CONDE DE VALENCIA,CHIMALPOPOCA # 11,0,OBRERA,0,TLALPAN O CUAHUTEMOC,0,D F,,
13050,13,50,33,180,0,348,32,1,2,1,1102.37,1102.37,0,0,132,592,0,32,1,3,130156,1,1,1,1,1,6,1760,7488,1,1,7,6,2,1,0,0,0,0,0,2,0,30,3,1,1,2,2,1,1,3,0,1,0,30,3,1,1,1,1,1,1,1,1,2,1,2,1,1,1,2,1,1,2,0,0,0,0,1,1,1,0,3,60,2,2,0,0,0,0,0,2,0,0,0,1,1,0,2,21,0,0,0,1,5,0,77,0,8,0,1,,IMSS DE PROGRESO,,0,CENTRO,0,PROGRESO,0,,FRENTE A LA COMPANIA DE LUZ,CAMINANDO.
13050,13,50,33,175,0,349,33,1,2,1,1102.37,1102.37,0,0,128,574,0,32,1,1,130158,1,1,1,1,1,3,1756,7495,1,6,5,5,11,5,0,0,0,0,10,4,0,30,3,1,1,1,1,1,1,77,77,0,1,0,2,1,1,1,1,1,1,1,1,1,1,1,1,1,1,1,1,1,1,88888,3,2,0,1,1,1,0,1,8888,1,1,1,3,0,8888,0,1,150,100,9999,1,1,0,2,42,0,0,0,2,0,0,0,0,0,0,0,FIDEL ARTEAGA,IMSS DE MISQUIAGUALA,,0,,0,MISQUIAGUALA,0,,,POR CARRETERA
13050,13,50,33,778,0,350,34,1,2,1,1102.37,1102.37,0,0,133,596,0,32,1,1,130159,1,1,1,1,1,5,1761,7498,1,2,7,6,3,4,0,0,0,0,50,4,1,15,4,1,1,1,1,1,1,0,5,3,2,0,1,1,1,1,1,1,1,1,1,1,1,1,1,1,1,1,1,1,2,0,0,0,0,1,1,1,0,1,7777,1,1,1,3,0,185,0,1,200,50,9999,1,1,0,2,21,0,0,0,1,2,0,11,0,3,0,1,IVAN DORIAN,HOSPITAL GENERAL DE MEXICO,GUAUTEMOC (DELEGACION),0,DELEG. CUAUTEMOC,0,MEXICO D.F.,0,,FRENTE AL RESTAURANTE SAMBORS.,
13050,13,50,33,435,0,351,35,1,2,1,1102.37,1102.37,0,0,136,613,0,78,1,1,130177,1,1,1,1,1,5,1764,7571,1,6,7,6,3,1,0,0,0,0,0,2,0,10,4,1,1,1,1,1,1,0,30,3,0,15,2,1,1,1,1,1,1,1,1,1,1,1,1,1,1,1,1,1,1,13,3,1,0,1,1,1,0,3,100,1,2,1,1,0,21,0,2,0,0,0,1,1,0,1,21,14,0,0,2,0,0,0,0,0,0,0,DR PATRICIO HERNANDEZ CASTILLO,S.S.A.,AQUILES SERDAN,0,CENTRO,0,PROGRESO,13,HIDALGO,SOBRE AQUILES SERDAN Y EMILIANO SAPATA,A UN LADO DE LA IGLESIA DEL SAGRADO CORAZON DE JESUS.
13050,13,50,33,785,0,352,36,1,2,1,1102.37,1102.37,0,0,150,706,0,101,1,1,130181,1,1,1,1,1,6,1778,7580,1,2,77,6,11,5,6,0,0,0,5,2,0,10,3,1,1,1,1,1,1,1,0,3,1,0,2,1,1,1,1,1,1,1,1,2,1,1,1,1,1,1,1,1,1,30,3,1,0,1,1,1,0,3,30,1,1,1,3,0,155,0,2,0,0,0,1,1,0,2,21,31,0,0,2,0,0,0,0,0,0,0,SANTIAGO HDZ.,SANTIAGO HDZ,,0,,0,TLOXCOAPAN,0,HIDALGO,POR EL KINDER.,
13046,13,46,005A,52,0,330,37,1,2,2,840.28,840.28,0,0,153,719,0,10,1,1,130085,1,1,1,1,1,4,1781,7119,77,0,5,3,11,6,0,0,0,0,20,3,1,0,3,1,2,1,1,1,2,0,20,3,0,20,3,3,1,1,1,1,1,1,1,1,1,1,1,1,1,1,1,8,1,75,4,1,0,1,1,1,0,1,7777,1,2,1,3,0,50,0,2,0,0,0,1,1,0,2,31,41,0,0,1,2,6,11,11,5,6,3,(NO RECUERDA),NATURISTA,,0,CENTRO,28,HUEJUTLA,13,HIDALGO,POR EL MERCADO MPAL,TAXI
13046,13,46,005A,53,0,331,38,1,2,2,840.28,840.28,0,0,154,724,0,10,1,2,130086,1,1,1,1,1,5,1782,7124,1,6,5,6,11,6,0,0,0,0,20,3,1,0,3,1,1,1,1,1,1,0,20,3,0,20,9,1,1,1,1,1,1,1,1,1,1,1,1,1,1,1,1,8,1,40,2,1,0,1,1,1,0,1,90,1,2,0,3,0,110,0,2,0,0,0,1,1,0,2,22,45,0,0,1,5,5,11,3,77,11,3,FCO. BAUTISTA,,CONOCIDO,0,HUEJUTLA,0,HUEJUTLA,13,HIDALGO,(CONOCIDO COL. CENTRO),TAXI
13046,13,46,005A,56,0,332,39,1,2,2,840.28,840.28,0,0,157,734,0,10,1,2,130088,1,1,2,2,2,7,1785,7132,1,4,7,6,3,1,0,0,0,0,0,3,0,25,3,1,1,1,1,1,8,2,0,2,0,30,3,3,1,1,1,8,2,2,1,2,1,1,1,1,1,1,1,8,2,0,0,0,0,1,2,1,0,3,80,2,2,0,0,0,0,0,2,0,0,0,3,8,0,3,99,0,22,52,1,7,0,3,0,77,0,3,MEDICO DE SERVICIO SSA ORIZATLAN. HGO,SSA,CONOCIDO,0,,53,SAN FELIPE ORIZATLAN,13,HIDALGO,BARRIO ARRIBA,CAMINANDO
13046,13,46,005A,56,0,333,40,1,2,2,840.28,840.28,0,0,157,735,0,10,1,3,130088,1,1,2,2,2,7,1785,7133,1,4,7,6,3,4,0,0,0,0,7777.77,2,0,5,4,1,1,1,1,1,8,0,10,3,0,30,2,2,2,2,1,2,1,1,1,8,1,1,1,1,1,1,1,8,1,88888,4,1,0,1,1,1,0,3,300,2,2,0,0,0,0,0,2,0,0,0,1,2,3,3,99,0,42,58,2,0,0,0,0,0,0,0,DRA. MENDOZA (SERVICIO) SSA,HOSPITAL SSA,CONOCIDO,0,,53,ORIZATLAN,13,HIDALGO,,CAMINANDO
13046,13,46,005A,55,0,334,41,1,2,2,840.28,840.28,0,0,156,731,0,10,1,1,130089,1,1,1,1,1,2,1784,7138,1,3,5,6,11,1,0,0,0,0,0,3,0,15,3,1,1,1,1,1,2,0,15,3,0,20,2,1,1,1,1,1,1,1,1,1,1,1,1,1,1,1,1,8,1,20,4,1,0,1,2,1,0,1,200,2,2,0,0,0,0,0,2,0,0,0,1,8,0,2,51,42,0,0,2,0,0,0,0,0,0,0,DR. GASSY,CONSULT. PARTIC.,AV. FELIPE ANGELES S/N,0,,53,SAN FELIPE ORIZATLAN,13,HIDALGO,,CAMINANDO
13046,13,46,005A,231,0,335,42,1,2,2,840.28,840.28,0,0,163,767,0,45,1,3,130091,1,1,1,1,1,3,1791,7145,1,1,5,6,11,1,0,0,0,0,0,2,0,10,4,1,1,8,1,1,1,0,5,4,0,15,2,1,2,2,1,1,2,1,2,2,1,1,1,1,1,1,1,1,1,20,8,1,0,1,1,1,0,3,20,2,2,0,0,0,0,0,2,0,0,0,1,8,0,2,33,42,0,0,2,0,0,0,0,0,0,0,JUAN CARLOS OCADIZ,CONSULTORIO PARTICULAR,DOM. CONOCIDO,0,COL. CENTRO,53,ORIZATLAN,13,HIDALGO,,(CAMINANDO)
13046,13,46,005A,232,0,336,43,1,2,2,840.28,840.28,0,0,164,774,0,45,1,7,130092,1,1,1,1,1,7,1792,7152,1,6,1,6,11,0,0,0,0,0,0,0,0,0,0,0,0,0,0,0,0,0,15,3,0,10,2,1,2,2,1,1,1,1,1,2,0,0,0,0,0,0,0,0,1,40,3,1,0,1,1,1,0,3,20,1,2,1,3,0,50,0,2,0,0,0,2,2,3,3,12,14,99,0,1,77,0,2,0,9,0,4,DR. GASSI,CLINICA PARTICULAR,AV. FELIPE ANGELES S/N,0,CENTRO,53,SAN FELIPE ORIZATLAN,13,HIDALGO,,
13046,13,46,005A,233,0,337,44,1,2,2,840.28,840.28,0,0,165,780,0,45,1,6,130093,1,1,1,1,1,6,1793,7158,1,6,5,6,11,6,0,0,0,0,15,4,1,0,3,1,1,1,1,1,2,0,20,3,0,20,2,1,1,1,1,1,1,1,1,1,1,1,1,1,1,1,1,1,1,25,3,1,0,1,1,1,0,1,80,2,2,0,0,0,0,0,2,0,0,0,1,1,0,2,22,51,0,0,2,0,0,0,0,0,0,0,DR. FCO. BAUTISTA,CONSULTORIO PARTICULAR,CONOCIDO,0,HUEJUTLA,0,HUEJUTLA,13,HIDALGO,"A UN COSTADO DE LA ENTRADA DEL COLEGIO ""MANRIQUEZ""",TAXI O (CAMINANDO)
13046,13,46,005A,140,0,338,45,1,2,2,840.28,840.28,0,0,158,741,0,27,1,2,130099,1,1,1,1,1,5,1786,7180,77,0,6,6,11,4,0,0,0,0,7777.77,3,0,45,3,1,1,1,1,1,1,0,20,3,0,50,2,1,1,2,1,1,1,1,1,1,1,1,1,1,1,1,1,1,1,2000,3,1,0,1,1,1,0,1,7777,2,2,0,0,0,0,0,2,0,0,0,1,1,0,2,21,58,0,0,2,0,0,0,0,0,0,0,NO RECUERDA,CLINICA SAN ALFREDO,CONOCIDO,0,CENTRO,0,HUEJUTLA,0,HIDALGO,FRENTE AL HOTEL FAYAD,CAMINANDO (TAXI)
13046,13,46,005A,508,0,339,46,1,2,2,840.28,840.28,0,0,180,838,0,97,1,2,130105,1,1,1,1,1,3,1808,7199,77,0,7,6,8,4,0,0,0,0,7777.77,4,0,40,3,1,1,1,1,1,1,0,20,3,0,40,2,1,2,2,1,2,1,1,1,1,1,1,1,1,1,1,1,1,2,0,0,0,0,1,1,1,0,3,300,2,2,0,0,0,0,0,2,0,0,0,1,1,0,2,14,27,0,0,1,5,0,11,0,1,0,4,ISSSTE,ISSSTE,CONOCIDO,0,BARRIO TECOLUCO,28,HUEJUTLA,13,HIDALGO,A UN COSTADO DEL IMSS,TAXI
13046,13,46,005A,504,0,340,47,1,2,2,840.28,840.28,0,0,176,821,0,97,1,2,130108,1,1,2,2,2,7,1804,7212,1,6,7,6,8,4,0,0,0,0,150,4,8,0,2,1,1,1,1,1,1,0,15,4,0,30,1,1,1,1,1,1,1,1,1,1,1,1,1,1,1,1,1,1,2,0,0,0,0,1,1,1,0,3,80,1,1,1,2,7,145,0,1,400,1200,400,2,2,3,3,99,0,33,44,1,5,8,11,8,1,1,9,NO RECUERDA EL NOMBRE (ISSSTE),ISSSTE,"CONOCIDO HUEJUTLA, HGO",0,COL. TECOLUCO,0,HUEJUTLA,13,HIDALGO,A UN COSTADO DEL IMSS,TAXI
13046,13,46,005A,504,0,341,48,1,2,2,840.28,840.28,0,0,176,822,0,97,1,3,130108,1,1,2,2,2,7,1804,7213,1,6,5,6,8,1,0,0,0,0,0,4,0,10,3,1,1,1,2,1,2,0,30,3,0,10,2,1,1,2,1,1,1,1,1,1,1,1,1,1,1,1,1,1,2,0,0,0,0,1,1,1,0,1,7777,1,2,1,2,0,7777,0,2,0,0,0,1,1,0,2,31,41,0,0,1,7,0,3,0,3,0,10,ISSSTE (ORIZATLAN) MEDICO EN SERVICIO,ISSSTE,CONOCIDO,0,COL. CENTRO,0,ORIZATLAN,13,HIDALGO,A 2 CUADRAS DEL CENTRO.,CAMINANDO