﻿FOLIO_I,ID_INT,FOLIO_INT,estrato,region_cv,est_sel,Upm,ENTIDAD,DESC_ENT,MUNICIPIO,DESC_MUN,MAQUINA,HORA_INI_1,FECHA_INI_1,HORA_FIN_1,FECHA_FIN_1,TIEMPO1,RESULTADO_1,HORA_INI_2,FECHA_INI_2,HORA_FIN_2,FECHA_FIN_2,TIEMPO2,RESULTADO_2,HORA_INI_3,FECHA_INI_3,HORA_FIN_3,FECHA_FIN_3,TIEMPO3,RESULTADO_3,HORA_INI_4,FECHA_INI_4,HORA_FIN_4,FECHA_FIN_4,TIEMPO4,RESULTADO_4,HORA_INI,FECHA_INI,NOTA1,ADUL,H0302,H0303,H0304,MESES,LOCALIZADO,NOTA04,ADUL101,ADUL102,ADUL103,NOTA05,ADUL104,ADUL105,ADUL106,ADUL107,ADUL108,NOTA05A,ADUL1A01,ADUL1A02A,ADUL1A02B,ADUL1A03,ADUL1A04A,ADUL1A04B,ADUL1A04BT,ADUL1A05,ADUL1A06,ADUL1A06A,ADUL1A06B,NOTA06,ADUL201,ADUL202A,ADUL202B,ADUL202C,ADUL202D,ADUL202E,ADUL202F,ADUL202ES,ADUL203,ADUL203ES,ADUL204,ADUL204ES,ADUL205,ADUL205ES,ADUL206,ADUL206ES,ADUL20601,ADUL207,ADUL207ES,ADUL208,ADUL209,ADUL210A,ADUL210B,ADUL210C,ADUL210ES,ADUL211,NOTA07,ADUL301A,ADUL302A,ADUL301B,ADUL302B,ADUL301C,ADUL302C,ADUL301D,ADUL302D,COMENTARIO,TIEMPO,HORA_FIN,FECHA_FIN,COMPLETA,OTROENT,ADUL_COMP,ponde_g,rural_20,ponde_g20,area_20
01001002,1,01001002_01,3,4,13,0100108010001,01,01 AGUASCALIENTES,001,001 AGUASCALIENTES,MQ075,19:22:13,12/10/2020,19:25:43,12/10/2020,3,1, , , , ,0,0, , , , ,0,0, , , , ,0,0,19:22:13,12/10/2020,1,1,2,67,11011953,9,1, , , , ,1,2, ,1,1,2,1,3, , , ,3, , ,3,4, ,6,1,2, , , , , , , , , , , , , , , , , , ,5, , , , , , ,1,2, ,2, ,2, ,2, ,NINGUNO,3,19:25:43,12/10/2020,1, ,1,10864.6524275206,3,14033.8145448716,2
01001003,1,01001003_01,3,4,13,0100108010001,01,01 AGUASCALIENTES,001,001 AGUASCALIENTES,MQ075,14:25:40,12/10/2020,14:28:48,12/10/2020,3,1, , , , ,0,0, , , , ,0,0, , , , ,0,0,14:25:40,12/10/2020,1,1,2,92,16061928,3,1, , , , ,1,1,1,2,1,2,1,3, , , ,3, , ,3,5, , ,1,2, , , , , , , , , , , , , , , , , , ,5, , , , , , ,1,2, ,2, ,2, ,2, ,NINGUNO,3,14:28:48,12/10/2020,1, ,1,10864.6524275206,3,14033.8145448716,2
01001004,1,01001004_01,3,4,13,0100108010001,01,01 AGUASCALIENTES,001,001 AGUASCALIENTES,MQ075,17:46:22,13/10/2020,17:49:35,13/10/2020,3,1, , , , ,0,0, , , , ,0,0, , , , ,0,0,17:46:22,13/10/2020,1,1,2,71,5091949,1,1, , , , ,1,2, ,2,2,2,1,3, , , ,3, , ,3,5, , ,1,2, , , , , , , , , , , , , , , , , , ,5, , , , , , ,1,2, ,2, ,2, ,2, ,NINGUNO,3,17:49:35,13/10/2020,1, ,1,10864.6524275206,3,14033.8145448716,2
01001005,1,01001005_01,3,4,13,0100108010001,01,01 AGUASCALIENTES,001,001 AGUASCALIENTES,MQ075,12:16:19,12/10/2020,12:19:53,12/10/2020,3,1, , , , ,0,0, , , , ,0,0, , , , ,0,0,12:16:19,12/10/2020,1,1,1,57,20091963,0,1,1,2,1,2, , , , , , ,1,1,18,6, , , , ,3,5, , ,1,2, , , , , , , , , , , , , , , , , , ,5, , , , , , , , , , , , , , , ,NINGUNO,3,12:19:53,12/10/2020,1, ,1,10380.6231542784,3,9574.77441566693,2
01001007,1,01001007_01,3,4,13,0100108010001,01,01 AGUASCALIENTES,001,001 AGUASCALIENTES,MQ055,11:43:46,12/10/2020,11:49:40,12/10/2020,6,1, , , , ,0,0, , , , ,0,0, , , , ,0,0,11:43:46,12/10/2020,1,1,1,73,13061947,3,1, , , , ,1,2, ,2,1,1,1,3, , , ,3, , ,4,3,6, ,1,2, , , , , , , , , , , , , , , , , , ,5, , , , , , , , , , , , , , , ,Ninguno,6,11:49:40,12/10/2020,1, ,1,10455.58223133,3,9643.91441261211,2
01001008,1,01001008_01,3,4,13,0100108010001,01,01 AGUASCALIENTES,001,001 AGUASCALIENTES,MQ055,20:30:51,12/10/2020,20:53:01,12/10/2020,23,1, , , , ,0,0, , , , ,0,0, , , , ,0,0,20:30:51,12/10/2020,1,1,1,77,31011943,8,1, , , , ,1,1,2,2,1,1,1,3, , , ,3, , ,3,5, , ,1,2, , , , , , , , , , , , , , , , , , ,4,3, , , , , , , , , , , , , , ,NINGUNO,23,20:53:01,12/10/2020,1, ,1,20911.16446266,3,19287.8288252242,2
01001008,3,01001008_03,3,4,13,0100108010001,01,01 AGUASCALIENTES,001,001 AGUASCALIENTES,MQ055,17:55:41,12/10/2020,18:08:52,12/10/2020,13,1, , , , ,0,0, , , , ,0,0, , , , ,0,0,17:55:41,12/10/2020,1,1,1,39,14101980,11,1,1,2,9,1, , , , , , ,1,3, , , ,3, , ,3,3,6, ,1,2, , , , , , , , , , , , , , , , , , ,4,3, , , , , , , , , , , , , , ,NINGUNO,13,18:08:52,12/10/2020,1, ,1,22458.2813923079,3,28086.8316522046,2
01001009,2,01001009_02,3,4,13,0100108010001,01,01 AGUASCALIENTES,001,001 AGUASCALIENTES,MQ055,19:27:10,12/10/2020,19:38:04,12/10/2020,11,1, , , , ,0,0, , , , ,0,0, , , , ,0,0,19:27:10,12/10/2020,1,1,2,40,30091980,0,1,1,2,1,1, , , , , , ,1,3, , , ,3, , ,3,2, ,3,1,2, , , , , , , , , , , , , , , , , , ,5, , , , , , ,1,2, ,2, ,2, ,2, ,Ninguno,11,19:38:04,12/10/2020,1, ,1,33107.8647364017,3,28759.3824426272,2
01001010,2,01001010_02,3,4,13,0100108010001,01,01 AGUASCALIENTES,001,001 AGUASCALIENTES,MQ075,16:43:40,12/10/2020,16:46:58,12/10/2020,3,1, , , , ,0,0, , , , ,0,0, , , , ,0,0,16:43:40,12/10/2020,1,1,2,35,30111984,10,1,1,2,2,2, , , , , , ,1,3, , , ,1,1,13,3,3, ,3,1,2, , , , , , , , , , , , , , , , , , ,5, , , , , , ,1,2, ,2, ,2, ,2, ,NINGUNO,3,16:46:58,12/10/2020,1, ,1,38750.4256081327,3,33660.8331208249,2
01001011,1,01001011_01,3,4,13,0100108010001,01,01 AGUASCALIENTES,001,001 AGUASCALIENTES,MQ069,10:42:29,13/10/2020,10:45:46,13/10/2020,3,1, , , , ,0,0, , , , ,0,0, , , , ,0,0,10:42:29,13/10/2020,1,1,1,78,1081942,2,1, , , , ,1,9, ,2,1,1,1,3, , , ,1,1,42,4,5, , ,1,2, , , , , , , , , , , , , , , , , , ,5, , , , , , , , , , , , , , , , ,3,10:45:46,13/10/2020,1, ,1,24475.0463172818,3,22575.0462008043,2
01001013,1,01001013_01,3,4,13,0100108010001,01,01 AGUASCALIENTES,001,001 AGUASCALIENTES,MQ062,10:42:53,13/10/2020,10:44:55,13/10/2020,2,1, , , , ,0,0, , , , ,0,0, , , , ,0,0,10:42:53,13/10/2020,1,1,1,75,18121944,9,1, , , , ,1,2, ,2,1,1,1,3, , , ,2,1,20,4,2,6, ,1,2, , , , , , , , , , , , , , , , , , ,5, , , , , , , , , , , , , , , , ,2,10:44:55,13/10/2020,1, ,1,12237.5231586409,3,11287.5231004021,2
01001014,1,01001014_01,3,4,13,0100108010001,01,01 AGUASCALIENTES,001,001 AGUASCALIENTES,MQ062,08:27:33,14/10/2020,08:40:42,14/10/2020,13,1, , , , ,0,0, , , , ,0,0, , , , ,0,0,08:27:33,14/10/2020,1,1,1,58,28061962,3,1,1,1,1,2, , , , , , ,1,3, , , ,3, , ,3,2,4, ,1,2, , , , , , , , , , , , , , , , , , ,5, , , , , , , , , , , , , , , , ,13,08:40:42,14/10/2020,1, ,1,24475.0463172818,3,22575.0462008043,2
01001015,2,01001015_02,3,4,13,0100108010001,01,01 AGUASCALIENTES,001,001 AGUASCALIENTES,MQ062,11:37:05,12/10/2020,11:38:53,12/10/2020,1,1, , , , ,0,0, , , , ,0,0, , , , ,0,0,11:37:05,12/10/2020,1,1,2,56,26071964,2,1,1,1,1,2, , , , , , ,1,3, , , ,3, , ,4,5, , ,1,2, , , , , , , , , , , , , , , , , , ,5, , , , , , ,1,2, ,2, ,2, ,2, , ,1,11:38:53,12/10/2020,1, ,1,22022.1526293679,3,28445.8990235673,2
01001015,3,01001015_03,3,4,13,0100108010001,01,01 AGUASCALIENTES,001,001 AGUASCALIENTES,MQ062,21:16:04,12/10/2020,21:29:47,12/10/2020,13,1, , , , ,0,0, , , , ,0,0, , , , ,0,0,21:16:04,12/10/2020,1,1,2,26,21111993,10,1,1,2,1,1, , , , , , ,1,1,16,4, , , , ,4,2, ,5,1,2, , , , , , , , , , , , , , , , , , ,5, , , , , , ,1,2, ,2, ,2, ,2, , ,13,21:29:47,12/10/2020,1, ,1,19575.085122449,3,16748.785739753,2
01001016,2,01001016_02,3,4,13,0100108010001,01,01 AGUASCALIENTES,001,001 AGUASCALIENTES,MQ062,12:27:09,12/10/2020,12:28:52,12/10/2020,1,1, , , , ,0,0, , , , ,0,0, , , , ,0,0,12:27:09,12/10/2020,1,1,2,21,3021999,8,1,1,2,1,1, , , , , , ,1,3, , , ,3, , ,4,3, ,4,1,2, , , , , , , , , , , , , , , , , , ,5, , , , , , ,1,2, ,2, ,2, ,2, , ,1,12:28:52,12/10/2020,1, ,1,39150.170244898,3,33497.5714795059,2
01001019,2,01001019_02,3,4,13,0100108010001,01,01 AGUASCALIENTES,001,001 AGUASCALIENTES,MQ069,20:24:34,12/10/2020,20:34:07,12/10/2020,10,1, , , , ,0,0, , , , ,0,0, , , , ,0,0,20:24:34,12/10/2020,1,1,2,48,23051972,4,1,1,1,1,1, , , , , , ,1,3, , , ,2,1,24,3,4, ,6,1,2, , , , , , , , , , , , , , , , , , ,5, , , , , , ,1,1,1,2, ,2, ,2, , ,10,20:34:07,12/10/2020,1, ,1,32494.3191318782,3,28226.4216846028,2
01001019,4,01001019_04,3,4,13,0100108010001,01,01 AGUASCALIENTES,001,001 AGUASCALIENTES,MQ069,16:13:20,12/10/2020,16:20:56,12/10/2020,7,1, , , , ,0,0, , , , ,0,0, , , , ,0,0,16:13:20,12/10/2020,1,1,1,22,13101997,11,1,1,2,1,1, , , , , , ,1,3, , , ,1,2,8,3,2,3, ,1,2, , , , , , , , , , , , , , , , , , ,5, , , , , , , , , , , , , , , , ,7,16:20:56,12/10/2020,1, ,1,52669.2570548086,3,59098.6831867221,2
01001021,1,01001021_01,3,4,13,0100108010001,01,01 AGUASCALIENTES,001,001 AGUASCALIENTES,MQ069,12:21:35,13/10/2020,12:30:23,13/10/2020,9,1, , , , ,0,0, , , , ,0,0, , , , ,0,0,12:21:35,13/10/2020,1,1,2,42,7011978,9,1,1,2,1,1, , , , , , ,1,3, , , ,3, , ,3,5, , ,1,2, , , , , , , , , , , , , , , , , , ,5, , , , , , ,1,2, ,2, ,2, ,2, , ,9,12:30:23,13/10/2020,1, ,1,32494.3191318782,3,28226.4216846028,2
01001021,3,01001021_03,3,4,13,0100108010001,01,01 AGUASCALIENTES,001,001 AGUASCALIENTES,MQ069,12:30:59,13/10/2020,12:36:11,13/10/2020,6,1, , , , ,0,0, , , , ,0,0, , , , ,0,0,12:30:59,13/10/2020,1,1,2,29,27081991,1,1,1,2,1,2, , , , , , ,1,3, , , ,3, , ,3,3, ,5,1,2, , , , , , , , , , , , , , , , , , ,5, , , , , , ,1,2, ,2, ,2, ,2, , ,6,12:36:11,13/10/2020,1, ,1,19093.7305702576,3,16336.9303527099,2
01001022,1,01001022_01,3,4,13,0100108010001,01,01 AGUASCALIENTES,001,001 AGUASCALIENTES,MQ069,17:27:11,12/10/2020,17:27:33,12/10/2020,0,5,17:48:50,12/10/2020,17:51:38,12/10/2020,3,1, , , , ,0,0, , , , ,0,0,17:27:11,12/10/2020,1,1,2,47,1101973,0,1,1,1,2,2, , , , , , ,1,3, , , ,2,2,5,3,3, ,5,1,2, , , , , , , , , , , , , , , , , , ,5, , , , , , ,1,2, ,2, ,2, ,2, , ,3,17:51:38,12/10/2020,1, ,1,16247.1595659391,3,14113.2108423014,2
01001022,2,01001022_02,3,4,13,0100108010001,01,01 AGUASCALIENTES,001,001 AGUASCALIENTES,MQ069,17:23:26,12/10/2020,17:26:56,12/10/2020,3,1, , , , ,0,0, , , , ,0,0, , , , ,0,0,17:23:26,12/10/2020,1,1,2,24,26111995,10,1,1,1,1,1, , , , , , ,1,3, , , ,2,2,5,3,5, , ,1,2, , , , , , , , , , , , , , , , , , ,5, , , , , , ,1,2, ,2, ,2, ,2, , ,3,17:26:56,12/10/2020,1, ,1,19093.7305702576,3,16336.9303527099,2
01001023,1,01001023_01,3,4,13,0100108010001,01,01 AGUASCALIENTES,001,001 AGUASCALIENTES,MQ069,09:42:28,14/10/2020,10:53:46,14/10/2020,71,1, , , , ,0,0, , , , ,0,0, , , , ,0,0,09:42:28,14/10/2020,1,1,2,80,3061940,4,1, , , , ,1,9, ,1,1,1,1,3, , , ,3, , ,4,4, ,6,1,2, , , , , , , , , , , , , , , , , , ,5, , , , , , ,1,1,1,2, ,2, ,2, , ,71,10:53:46,14/10/2020,1, ,1,10740.3121430114,3,13873.2048516578,2
01009001,1,01009001_01,1,4,11,0100900340000,01,01 AGUASCALIENTES,009,009 TEPEZALÁ,MQ069,14:39:49,14/10/2020,14:43:48,14/10/2020,4,1, , , , ,0,0, , , , ,0,0, , , , ,0,0,14:39:49,14/10/2020,1,1,1,54,13021966,8,1,1,1,1,1, , , , , , ,1,3, , , ,3, , ,3,3,3, ,1,2, , , , , , , , , , , , , , , , , , ,5, , , , , , , , , , , , , , , , ,4,14:43:48,14/10/2020,1, ,1,3603.54842915301,1,4046.86023350053,1
01009001,2,01009001_02,1,4,11,0100900340000,01,01 AGUASCALIENTES,009,009 TEPEZALÁ,MQ069,14:31:45,14/10/2020,14:34:05,14/10/2020,3,1, , , , ,0,0, , , , ,0,0, , , , ,0,0,14:31:45,14/10/2020,1,1,2,49,16121970,9,1,1,2,1,1, , , , , , ,1,3, , , ,3, , ,4,5, , ,1,2, , , , , , , , , , , , , , , , , , ,5, , , , , , ,1,2, ,2, ,2, ,2, , ,3,14:34:05,14/10/2020,1, ,1,5705.36347588434,1,5559.14445404506,1
01009001,3,01009001_03,1,4,11,0100900340000,01,01 AGUASCALIENTES,009,009 TEPEZALÁ,MQ069,14:43:51,14/10/2020,14:47:11,14/10/2020,4,1, , , , ,0,0, , , , ,0,0, , , , ,0,0,14:43:51,14/10/2020,1,1,1,20,28022000,7,1,1,2,1,1, , , , , , ,1,3, , , ,3, , ,4,3,6, ,1,2, , , , , , , , , , , , , , , , , , ,5, , , , , , , , , , , , , , , , ,4,14:47:11,14/10/2020,1, ,1,8982.75189622678,1,8155.25808642107,1
01009002,1,01009002_01,1,4,11,0100900340000,01,01 AGUASCALIENTES,009,009 TEPEZALÁ,MQ069,15:46:27,14/10/2020,15:46:50,14/10/2020,0,5,20:57:44,14/10/2020,20:58:03,14/10/2020,1,5,13:58:31,15/10/2020,14:04:31,15/10/2020,6,1, , , , ,0,0,15:46:27,14/10/2020,1,1,1,59,17081961,1,1,1,2,1,1, , , , , , ,1,3, , , ,2,1,10,4,2,6, ,1,2, , , , , , , , , , , , , , , , , , ,5, , , , , , , , , , , , , , , , ,7,14:04:31,15/10/2020,1, ,1,7207.09685830602,1,8093.72046700106,1
01009005,2,01009005_02,1,4,11,0100900340000,01,01 AGUASCALIENTES,009,009 TEPEZALÁ,MQ055,21:04:35,14/10/2020,21:11:03,14/10/2020,7,1, , , , ,0,0, , , , ,0,0, , , , ,0,0,21:04:35,14/10/2020,1,1,2,74,10121945,10,1, , , , ,1,2, ,1,1,1,1,3, , , ,3, , ,4,5, , ,1,2, , , , , , , , , , , , , , , , , , ,5, , , , , , ,1,2, ,2, ,2, ,2, ,NINGUNO,7,21:11:03,14/10/2020,1, ,1,7543.15046536471,1,6006.96758310734,1
01009007,1,01009007_01,1,4,11,0100900340000,01,01 AGUASCALIENTES,009,009 TEPEZALÁ,MQ075,20:27:51,14/10/2020,20:30:39,14/10/2020,3,1, , , , ,0,0, , , , ,0,0, , , , ,0,0,20:27:51,14/10/2020,1,1,2,35,28091985,0,1,1,1,1,1, , , , , , ,1,3, , , ,3, , ,3,5, , ,1,2, , , , , , , , , , , , , , , , , , ,5, , , , , , ,1,2, ,2, ,2, ,2, ,NINGUNO,3,20:30:39,14/10/2020,1, ,1,5705.36347588434,1,5559.14445404506,1
01009007,5,01009007_05,1,4,11,0100900340000,01,01 AGUASCALIENTES,009,009 TEPEZALÁ,MQ075,20:30:56,14/10/2020,20:33:38,14/10/2020,3,1, , , , ,0,0, , , , ,0,0, , , , ,0,0,20:30:56,14/10/2020,1,1,2,77,9071943,3,1, , , , ,1,1,2,1,1,1,1,3, , , ,3, , ,3,5, , ,1,2, , , , , , , , , , , , , , , , , , ,5, , , , , , ,1,2, ,2, ,2, ,2, ,NINGUNO,3,20:33:38,14/10/2020,1, ,1,3771.57523268236,1,3003.48379155367,1
01009008,1,01009008_01,1,4,11,0100900340000,01,01 AGUASCALIENTES,009,009 TEPEZALÁ,MQ075,14:55:11,14/10/2020,14:57:35,14/10/2020,2,1, , , , ,0,0, , , , ,0,0, , , , ,0,0,14:55:11,14/10/2020,1,1,2,36,7051984,5,1,1,2,2,1, , , , , , ,1,3, , , ,3, , ,3,5, , ,1,2, , , , , , , , , , , , , , , , , , ,5, , , , , , ,1,2, ,2, ,2, ,2, ,NINGUNO,2,14:57:35,14/10/2020,1, ,1,5705.36347588434,1,5559.14445404506,1
01009009,1,01009009_01,1,4,11,0100900340000,01,01 AGUASCALIENTES,009,009 TEPEZALÁ,MQ075,18:59:51,14/10/2020,19:02:05,14/10/2020,3,1, , , , ,0,0, , , , ,0,0, , , , ,0,0,18:59:51,14/10/2020,1,1,1,32,8121987,10,1,1,2,2,1, , , , , , ,1,3, , , ,1,1,15,3,3,3, ,1,2, , , , , , , , , , , , , , , , , , ,5, , , , , , , , , , , , , , , ,NINGUNO,3,19:02:05,14/10/2020,1, ,1,17965.5037924536,1,16310.5161728421,1
01009010,1,01009010_01,1,4,11,0100900340000,01,01 AGUASCALIENTES,009,009 TEPEZALÁ,MQ062,18:43:58,14/10/2020,18:49:41,14/10/2020,6,1, , , , ,0,0, , , , ,0,0, , , , ,0,0,18:43:58,14/10/2020,1,1,1,48,10051972,5,1,1,2,1,1, , , , , , ,1,1,18,20, , , , ,3,5, , ,1,2, , , , , , , , , , , , , , , , , , ,5, , , , , , , , , , , , , , , , ,6,18:49:41,14/10/2020,1, ,1,15480.6308902098,1,14436.2222572115,1
01009010,3,01009010_03,1,4,11,0100900340000,01,01 AGUASCALIENTES,009,009 TEPEZALÁ,MQ062,19:07:07,14/10/2020,19:12:23,14/10/2020,5,1, , , , ,0,0, , , , ,0,0, , , , ,0,0,19:07:07,14/10/2020,1,1,2,65,30101954,11,1, , , , ,1,1,1,2,1,1,1,3, , , ,1,1,12,4,5, , ,1,2, , , , , , , , , , , , , , , , , , ,5, , , , , , ,1,2, ,2, ,2, ,2, , ,5,19:12:23,14/10/2020,1, ,1,3771.57523268236,1,3003.48379155367,1
01009010,4,01009010_04,1,4,11,0100900340000,01,01 AGUASCALIENTES,009,009 TEPEZALÁ,MQ062,19:12:30,14/10/2020,19:17:48,14/10/2020,5,1, , , , ,0,0, , , , ,0,0, , , , ,0,0,19:12:30,14/10/2020,1,1,2,20,18111999,10,1,1,1,1,1, , , , , , ,1,3, , , ,3, , ,3,4, ,6,1,2, , , , , , , , , , , , , , , , , , ,5, , , , , , ,1,2, ,2, ,2, ,2, , ,5,19:17:48,14/10/2020,1, ,1,6704.96726346563,1,7143.42101793931,1
01009012,2,01009012_02,1,4,11,0100900340000,01,01 AGUASCALIENTES,009,009 TEPEZALÁ,MQ069,12:25:25,15/10/2020,12:38:08,15/10/2020,13,1, , , , ,0,0, , , , ,0,0, , , , ,0,0,12:25:25,15/10/2020,1,1,2,74,24061946,3,1, , , , ,1,2, ,2,2,1,1,3, , , ,3, , ,4,5, , ,1,2, , , , , , , , , , , , , , , , , , ,2,3, , , , , ,1,1,4,2, ,2, ,2, , ,13,12:38:08,15/10/2020,1, ,1,7542.36048850568,1,6006.33848716058,1
01009014,1,01009014_01,1,4,11,0100900340000,01,01 AGUASCALIENTES,009,009 TEPEZALÁ,MQ069,10:35:29,15/10/2020,10:37:51,15/10/2020,2,1, , , , ,0,0, , , , ,0,0, , , , ,0,0,10:35:29,15/10/2020,1,1,2,53,15071967,3,1,1,2,1,1, , , , , , ,1,3, , , ,3, , ,4,5, , ,1,2, , , , , , , , , , , , , , , , , , ,5, , , , , , ,1,2, ,2, ,2, ,2, , ,2,10:37:51,15/10/2020,1, ,1,3771.18024425284,1,3003.16924358029,1
01009021,3,01009021_03,1,4,11,0100900340000,01,01 AGUASCALIENTES,009,009 TEPEZALÁ,MQ055,19:24:30,15/10/2020,19:38:46,15/10/2020,14,1, , , , ,0,0, , , , ,0,0, , , , ,0,0,19:24:30,15/10/2020,1,1,2,23,17111996,10,1,1,1,1,1, , , , , , ,1,3, , , ,3, , ,3,4, ,6,1,2, , , , , , , , , , , , , , , , , , ,5, , , , , , ,1,2, ,2, ,2, ,2, ,Ninguno,14,19:38:46,15/10/2020,1, ,1,20112.7952028365,1,21428.0187114873,1
01009023,2,01009023_02,1,4,11,0100900340000,01,01 AGUASCALIENTES,009,009 TEPEZALÁ,MQ075,11:04:55,15/10/2020,11:07:02,15/10/2020,3,1, , , , ,0,0, , , , ,0,0, , , , ,0,0,11:04:55,15/10/2020,1,1,2,50,24071970,2,1,1,2,1,1, , , , , , ,1,3, , , ,3, , ,3,5, , ,1,2, , , , , , , , , , , , , , , , , , ,5, , , , , , ,1,2, ,2, ,2, ,2, ,NINGUNO,3,11:07:02,15/10/2020,1, ,1,3771.18024425284,1,3003.16924358029,1
01009023,4,01009023_04,1,4,11,0100900340000,01,01 AGUASCALIENTES,009,009 TEPEZALÁ,MQ075,19:20:05,15/10/2020,19:25:31,15/10/2020,5,1, , , , ,0,0, , , , ,0,0, , , , ,0,0,19:20:05,15/10/2020,1,1,1,20,18072000,2,1,1,9,1,1, , , , , , ,1,3, , , ,3, , ,3,5, , ,1,2, , , , , , , , , , , , , , , , , , ,5, , , , , , , , , , , , , , , ,NINGUNO,5,19:25:31,15/10/2020,1, ,1,17963.622306419,1,16308.8080098677,1
01010003,2,01010003_02,2,4,12,0101001580001,01,01 AGUASCALIENTES,010,010 EL LLANO,MQ055,12:10:45,08/10/2020,12:17:17,08/10/2020,7,1, , , , ,0,0, , , , ,0,0, , , , ,0,0,12:10:45,08/10/2020,1,1,2,51,4061969,4,1,1,1,1,9, , , , , , ,1,3, , , ,3, , ,3,5, , ,1,2, , , , , , , , , , , , , , , , , , ,5, , , , , , ,1,1,3,2, ,2, ,1,3,Ninguno,7,12:17:17,08/10/2020,1, ,1,3066.74039221236,2,3267.73793595761,2
01010004,2,01010004_02,2,4,12,0101001580001,01,01 AGUASCALIENTES,010,010 EL LLANO,MQ055,14:35:03,08/10/2020,14:38:25,08/10/2020,3,1, , , , ,0,0, , , , ,0,0, , , , ,0,0,14:35:03,08/10/2020,1,1,2,47,17061973,3,1,1,2,2,2, , , , , , ,1,3, , , ,3, , ,3,5, , ,1,2, , , , , , , , , , , , , , , , , , ,5, , , , , , ,1,2, ,2, ,2, ,2, ,Ninguno,3,14:38:25,08/10/2020,1, ,1,9278.28164323997,2,13269.0691207605,2
01010005,1,01010005_01,2,4,12,0101001580001,01,01 AGUASCALIENTES,010,010 EL LLANO,MQ055,17:42:47,08/10/2020,17:48:06,08/10/2020,6,1, , , , ,0,0, , , , ,0,0, , , , ,0,0,17:42:47,08/10/2020,1,1,1,76,15031944,6,1, , , , ,1,2, ,1,1,9,1,3, , , ,2,1,20,4,3,6, ,1,2, , , , , , , , , , , , , , , , , , ,5, , , , , , , , , , , , , , , ,Ninguno,6,17:48:06,08/10/2020,1, ,1,2930.11456518589,2,3348.91088834704,2
01010006,1,01010006_01,2,4,12,0101001580001,01,01 AGUASCALIENTES,010,010 EL LLANO,MQ055,12:58:36,10/10/2020,13:20:46,10/10/2020,22,1, , , , ,0,0, , , , ,0,0, , , , ,0,0,12:58:36,10/10/2020,1,1,2,79,23031941,6,1, , , , ,1,9, ,2,1,9,1,3, , , ,3, , ,4,4, ,6,1,2, , , , , , , , , , , , , , , , , , ,5, , , , , , ,1,2, ,2, ,2, ,2, ,Ninguno,22,13:20:46,10/10/2020,1, ,1,3066.74039221236,2,3267.73793595761,2
01010007,1,01010007_01,2,4,12,0101001580001,01,01 AGUASCALIENTES,010,010 EL LLANO,MQ055,19:32:22,09/10/2020,19:39:24,09/10/2020,7,1, , , , ,0,0, , , , ,0,0, , , , ,0,0,19:32:22,09/10/2020,1,1,1,46,16071974,2,1,1,2,1,1, , , , , , ,1,3, , , ,3, , ,3,1,5, ,1,2, , , , , , , , , , , , , , , , , , ,5, , , , , , , , , , , , , , , ,Ninguno,7,19:39:24,09/10/2020,1, ,1,12587.598846377,2,10978.3381731638,2
01010008,1,01010008_01,2,4,12,0101001580001,01,01 AGUASCALIENTES,010,010 EL LLANO,MQ069,11:23:30,09/10/2020,11:28:43,09/10/2020,5,1, , , , ,0,0, , , , ,0,0, , , , ,0,0,11:23:30,09/10/2020,1,1,2,73,18081947,1,1, , , , ,1,2, ,2,2,9,1,3, , , ,1,1,5,3,5, , ,1,2, , , , , , , , , , , , , , , , , , ,5, , , , , , ,1,2, ,2, ,2, ,2, , ,5,11:28:43,09/10/2020,1, ,1,4483.65209241174,2,4777.51558991271,2
01010009,2,01010009_02,2,4,12,0101001580001,01,01 AGUASCALIENTES,010,010 EL LLANO,MQ069,15:59:07,08/10/2020,16:01:21,08/10/2020,2,1, , , , ,0,0, , , , ,0,0, , , , ,0,0,15:59:07,08/10/2020,1,1,2,53,4111966,11,1,1,1,1,9, , , , , , ,1,3, , , ,3, , ,4,5, , ,1,2, , , , , , , , , , , , , , , , , , ,5, , , , , , ,1,2, ,2, ,2, ,2, , ,2,16:01:21,08/10/2020,1, ,1,8967.30418482348,2,9555.03117982543,2
01010009,3,01010009_03,2,4,12,0101001580001,01,01 AGUASCALIENTES,010,010 EL LLANO,MQ069,16:01:27,08/10/2020,16:33:39,08/10/2020,32,1, , , , ,0,0, , , , ,0,0, , , , ,0,0,16:01:27,08/10/2020,1,1,1,25,25101994,11,1,1,1,1,1, , , , , , ,1,3, , , ,3, , ,3,3,2, ,1,2, , , , , , , , , , , , , , , , , , ,5, , , , , , , , , , , , , , , , ,32,16:33:39,08/10/2020,1, ,1,21357.4073698054,2,14465.9762790609,2
01010011,1,01010011_01,2,4,12,0101001580001,01,01 AGUASCALIENTES,010,010 EL LLANO,MQ069,13:54:33,08/10/2020,13:56:45,08/10/2020,2,1, , , , ,0,0, , , , ,0,0, , , , ,0,0,13:54:33,08/10/2020,1,1,2,69,26081951,1,1, , , , ,1,1,3,1,1,1,1,2, , ,8, , , ,4,5, , ,1,2, , , , , , , , , , , , , , , , , , ,3,3, , , , , ,1,1,2,2, ,2, ,2, , ,2,13:56:45,08/10/2020,1, ,1,4483.65209241174,2,4777.51558991271,2
01010012,2,01010012_02,2,4,12,0101001580001,01,01 AGUASCALIENTES,010,010 EL LLANO,MQ069,12:35:22,08/10/2020,12:37:29,08/10/2020,2,1, , , , ,0,0, , , , ,0,0, , , , ,0,0,12:35:22,08/10/2020,1,1,2,40,16111979,10,1,1,2,2,1, , , , , , ,1,3, , , ,3, , ,3,5, , ,1,2, , , , , , , , , , , , , , , , , , ,5, , , , , , ,1,2, ,2, ,2, ,2, , ,2,12:37:29,08/10/2020,1, ,1,13565.082655623,2,19399.7149803523,2
01010014,2,01010014_02,2,4,12,0101001580001,01,01 AGUASCALIENTES,010,010 EL LLANO,MQ075,16:52:49,08/10/2020,16:56:53,08/10/2020,4,1, , , , ,0,0, , , , ,0,0, , , , ,0,0,16:52:49,08/10/2020,1,1,2,59,8031961,7,1,1,1,1,2, , , , , , ,1,3, , , ,3, , ,3,5, , ,1,2, , , , , , , , , , , , , , , , , , ,3,3, , , , , ,1,2, ,2, ,2, ,2, ,NINGUNO,4,16:56:53,08/10/2020,1, ,1,5779.62612378483,2,6158.42918699704,2
01010018,2,01010018_02,2,4,12,0101001580001,01,01 AGUASCALIENTES,010,010 EL LLANO,MQ075,14:57:44,09/10/2020,15:02:21,09/10/2020,5,1, , , , ,0,0, , , , ,0,0, , , , ,0,0,14:57:44,09/10/2020,1,1,2,57,8051963,5,1,1,1,1,2, , , , , , ,1,3, , , ,3, , ,3,5, , ,1,2, , , , , , , , , , , , , , , , , , ,5, , , , , , ,1,2, ,2, ,2, ,2, ,NINGUNO,5,15:02:21,09/10/2020,1, ,1,5779.62612378483,2,6158.42918699704,2
01010018,4,01010018_04,2,4,12,0101001580001,01,01 AGUASCALIENTES,010,010 EL LLANO,MQ075,14:05:05,09/10/2020,14:10:06,09/10/2020,5,1, , , , ,0,0, , , , ,0,0, , , , ,0,0,14:05:05,09/10/2020,1,1,2,23,13061997,3,1,1,2,1,2, , , , , , ,1,3, , , ,3, , ,4,3, ,6,1,1,76, , , , , , ,11, ,1, ,1, ,8, ,2,1, ,9, , , , , , ,1,2, ,2, ,2, ,2, ,NINGUNO,5,14:10:06,09/10/2020,1, ,1,10274.8060330981,2,12972.2223581386,2
01010019,1,01010019_01,2,4,12,0101001580001,01,01 AGUASCALIENTES,010,010 EL LLANO,MQ062,20:13:19,08/10/2020,20:14:17,08/10/2020,1,1, , , , ,0,0, , , , ,0,0, , , , ,0,0,20:13:19,08/10/2020,1,1,1,28,12041992,5,1,1,2,1,1, , , , , , ,1,3, , , ,3, , ,4,5, , ,1,2, , , , , , , , , , , , , , , , , , ,5, , , , , , , , , , , , , , , , ,1,20:14:17,08/10/2020,1, ,1,10956.0726117833,2,7420.85796133646,2
01010020,1,01010020_01,2,4,12,0101001580001,01,01 AGUASCALIENTES,010,010 EL LLANO,MQ062,11:42:38,08/10/2020,11:48:06,08/10/2020,6,1, , , , ,0,0, , , , ,0,0, , , , ,0,0,11:42:38,08/10/2020,1,1,1,42,99031978,1,1,1,2,1,1, , , , , , ,1,3, , , ,3, , ,4,2,2, ,1,2, , , , , , , , , , , , , , , , , , ,5, , , , , , , , , , , , , , , , ,6,11:48:06,08/10/2020,1, ,1,18881.3982695656,2,16467.5072597457,2
01010022,1,01010022_01,2,4,12,0101001580001,01,01 AGUASCALIENTES,010,010 EL LLANO,MQ062,16:31:58,08/10/2020,16:33:54,08/10/2020,2,1, , , , ,0,0, , , , ,0,0, , , , ,0,0,16:31:58,08/10/2020,1,1,1,29,24091991,0,1,1,2,1,2, , , , , , ,1,3, , , ,3, , ,4,3,5, ,1,2, , , , , , , , , , , , , , , , , , ,5, , , , , , , , , , , , , , , , ,2,16:33:54,08/10/2020,1, ,1,10956.0726117833,2,7420.85796133646,2
01010023,1,01010023_01,2,4,12,0101001580001,01,01 AGUASCALIENTES,010,010 EL LLANO,MQ062,10:38:36,10/10/2020,10:40:05,10/10/2020,2,1, , , , ,0,0, , , , ,0,0, , , , ,0,0,10:38:36,10/10/2020,1,1,2,30,6101990,0,1,1,1,1,1, , , , , , ,1,3, , , ,3, , ,3,5, , ,1,2, , , , , , , , , , , , , , , , , , ,5, , , , , , ,1,2, ,2, ,2, ,2, , ,2,10:40:05,10/10/2020,1, ,1,8177.90684266991,2,10324.8300401511,2
01010027,2,01010027_02,2,4,12,0101001580001,01,01 AGUASCALIENTES,010,010 EL LLANO,MQ062,12:49:25,09/10/2020,12:51:15,09/10/2020,2,2,12:51:54,09/10/2020,13:00:38,09/10/2020,9,1, , , , ,0,0, , , , ,0,0,12:49:25,09/10/2020,1,1,2,40,1031980,7,1,1,2,1,1, , , , , , ,1,3, , , ,3, , ,4,3, ,6,1,2, , , , , , , , , , , , , , , , , , ,5, , , , , , ,1,2, ,2, ,2, ,2, , ,11,13:00:38,09/10/2020,1, ,1,11794.4258176779,2,16867.4607467294,2