﻿FOLIO_I,ID_INT,FOLIO_INT,estrato,region_cv,est_sel,Upm,ENTIDAD,DESC_ENT,MUNICIPIO,DESC_MUN,MAQUINA,HORA_INI_1,FECHA_INI_1,HORA_FIN_1,FECHA_FIN_1,TIEMPO1,RESULTADO_1,HORA_INI_2,FECHA_INI_2,HORA_FIN_2,FECHA_FIN_2,TIEMPO2,RESULTADO_2,HORA_INI_3,FECHA_INI_3,HORA_FIN_3,FECHA_FIN_3,TIEMPO3,RESULTADO_3,HORA_INI_4,FECHA_INI_4,HORA_FIN_4,FECHA_FIN_4,TIEMPO4,RESULTADO_4,HORA_INI,FECHA_INI,LOCALIZADO,H0902A,H0904,H0401,H0302,H0303,H0304,MESES,VIVO,n_util_h,nn_util_h,borra,NOTA1,EDAD,SEXO,ENF_HOG,INSTUT,EDAD_U,SEXO_U,U0101,U0102,U01011,U01011E,U0202A,U0202AE,U0203A,U0203B,U0203C,U0203E,U0204,U0205H,U0205M,U0206H,U0206M,U0207M,U0207H,U0208,U0209,U0310,U0311,U0312,U0313A,U0313B,U0313C,U0313D,U0313E1,U0313E,U0314A,U0314B,U0314C,U0314D,U0314E1,U0314F,U0314G,U0314H,U0314I,U0314J,U0314K,U0314L,U0314M,U0314N,U0314O,U0314E,U0315,U0416,U0417,U0418A,U0418B,U0418C,U0418D,U0418E1,U0418F,U0418E,U0419A,U0419B,U0419C,U0419D,U0419E1,U0419F,U0419G,U0419H,U0419I,U0419J,U0419K,U0419L,U0419M,U0419E,U0420,U0421,U0422A,U0422B,U0422C,U0523A,U0523,U0524A,U0524B,U0524C,U0524D,U0524E1,U0524F,U0524G,U0524H,U0524I,U0524J,U0524K,U0524L,U0524M,U0524N,U0524O,U0524P,U0524Q,U0524E,U0525,U0526,COMENTARIO,TIEMPO,HORA_FIN,FECHA_FIN,COMPLETA,OTROENT,ponde_f,ponde_g,ponde_g20,rural_20,area_20
01001002,1,01001002_01,3,4,13,0100108010001,01,01 AGUASCALIENTES,001,001 AGUASCALIENTES,MQ075,19:18:40,12/10/2020,19:22:00,12/10/2020,4,1, , , , ,0,0, , , , ,0,0, , , , ,0,0,19:18:40,12/10/2020,1,9,2,1,2,67,11011953,9,1,7550.92798323223,7550.92798323223,1,1,67,2,35,2,67,2,1,1, , ,2, ,01, , , ,7777,0,15,0,20,15,0,2, ,3,1,1,2, , , , , , , , , , , , , , , , , , , , , ,7777,2, , , , , , , , , , , , , , , , , , , , , , , ,2, , , , ,1, , , , , , , , , , , , , , , , , , ,9,3,ninguno,4,19:22:00,12/10/2020,1, ,7178.39289355004,16005.0957720432,16519.596222932,3,2
01001003,1,01001003_01,3,4,13,0100108010001,01,01 AGUASCALIENTES,001,001 AGUASCALIENTES,MQ075,19:54:26,12/10/2020,19:59:14,12/10/2020,5,1, , , , ,0,0, , , , ,0,0, , , , ,0,0,19:54:26,12/10/2020,1,9,2,1,2,92,16061928,3,1,7550.92798323223,7550.92798323223,1,1,92,2,28,1,92,2,1,1, , ,1, ,01, , , ,7777,0,15,0,20,30,0,2, ,2,1,1,2, , , , , , , , , , , , , , , , , , , , , ,7777,2, , , , , , , , , , , , , , , , , , , , , , , ,2, , , , ,1, , , , , , , , , , , , , , , , , , ,8,3,ninguno,5,19:59:14,12/10/2020,1, ,7178.39289355004,16005.0957720432,16519.596222932,3,2
01001007,1,01001007_01,3,4,13,0100108010001,01,01 AGUASCALIENTES,001,001 AGUASCALIENTES,MQ055,11:36:40,12/10/2020,11:43:38,12/10/2020,7,1, , , , ,0,0, , , , ,0,0, , , , ,0,0,11:36:40,12/10/2020,1,1,2,1,1,73,13061947,3,1,7548.11408043834,7548.11408043834,1,1,73,1,15,2,73,1,1,1, , ,2, ,01, , , ,7777,0,15,0,5,20,0,2, ,5,1,1,1, , , , , , , , , , , , , , , , , , , , , ,7777,2, , , , , , , , , , , , , , , , , , , , , , , ,2, , , , ,1, , , , , , , , , , , , , , , , , , ,10,1,ninguno,7,11:43:38,12/10/2020,1, ,7143.91610062019,16038.6691657311,16669.4543686287,3,2
01001022,1,01001022_01,3,4,13,0100108010001,01,01 AGUASCALIENTES,001,001 AGUASCALIENTES,MQ069,17:44:45,12/10/2020,17:48:33,12/10/2020,4,1, , , , ,0,0, , , , ,0,0, , , , ,0,0,17:44:45,12/10/2020,1,5,2,1,2,47,1101973,0,1,23554.4945145815,23554.4945145815,1,1,47,2,2,14,47,2,1,1, , ,14, ,03, , , ,7777,0,0,0,0,30,0,2, ,1,1,1,3, , , , , , , , , , , , , , , , , , , , , ,7777,2, , , , , , , , , , , , , , , , , , , , , , , ,2, , , , ,1, , , , , , , , , , , , , , , , , , ,10,1, ,4,17:48:33,12/10/2020,1, ,9857.59446013355,16296.9848306942,16073.8498989792,3,2
01001022,3,01001022_03,3,4,13,0100108010001,01,01 AGUASCALIENTES,001,001 AGUASCALIENTES,MQ069,17:27:41,12/10/2020,17:30:15,12/10/2020,3,1, , , , ,0,0, , , , ,0,0, , , , ,0,0,17:27:41,12/10/2020,1,9, ,1,1,3,23022017,7,1,23554.4945145815,23554.4945145815,1,1,3,1,1,14,3,1,1,1, , ,14, ,03, , , ,7777,0,0,0,0,30,0,2, ,3,1,1,3, , , , , , , , , , , , , , , , , , , , , ,7777,2, , , , , , , , , , , , , , , , , , , , , , , ,2, , , , ,1, , , , , , , , , , , , , , , , , , ,10,1, ,3,17:30:15,12/10/2020,1, ,13954.4991992958,15775.5267631441,15561.2298365388,3,2
01009008,1,01009008_01,1,4,11,0100900340000,01,01 AGUASCALIENTES,009,009 TEPEZALÁ,MQ075,14:51:48,14/10/2020,14:55:00,14/10/2020,4,1, , , , ,0,0, , , , ,0,0, , , , ,0,0,14:51:48,14/10/2020,1,9,2,1,2,36,7051984,5,1,5240.1629690953,5240.1629690953,1,1,36,2,28,14,36,2,1,1, , ,14, ,02, , , ,100,0,15,0,10,20,0,1,450,0, , , , , , , , , , , , , , , , , , , , , , , , , ,2, , , , , , , , , , , , , , , , , , , , , , , ,2, , , , ,1, , , , , , , , , , , , , , , , , , ,10,2,ninguno,4,14:55:00,14/10/2020,1, ,2929.62208573764,4843.37298354288,4777.05852653257,1,1
01009008,2,01009008_02,1,4,11,0100900340000,01,01 AGUASCALIENTES,009,009 TEPEZALÁ,MQ075,15:06:48,14/10/2020,15:10:32,14/10/2020,4,1, , , , ,0,0, , , , ,0,0, , , , ,0,0,15:06:48,14/10/2020,1,9,2,1,1,16,13062004,4,1,5240.1629690953,5240.1629690953,1,1,16,1,1,14,16,1,1,1, , ,14, ,02, , , ,7777,0,5,0,10,10,0,1,100,4,1,1,1, , , , , , , , , , , , , , , , , , , , , ,450,2, , , , , , , , , , , , , , , , , , , , , , , ,2, , , , ,1, , , , , , , , , , , , , , , , , , ,10,1,ninguno,4,15:10:32,14/10/2020,1, ,3056.53113739779,5202.13832269929,4962.07881445465,1,1
01009015,2,01009015_02,1,4,11,0100900340000,01,01 AGUASCALIENTES,009,009 TEPEZALÁ,MQ062,18:22:14,15/10/2020,18:26:01,15/10/2020,4,1, , , , ,0,0, , , , ,0,0, , , , ,0,0,18:22:14,15/10/2020,1,9,2,1,2,39,29031981,6,1,2583.22921323076,2583.22921323076,1,1,39,2,44,1,39,2,1,1, , ,1, ,01, , , ,500,0,50,0,0,88,88,2, ,2,1,1,1, , , , , , , , , , , , , , , , , , , , , ,7777,1,1,1, , , , , , , , , , , , , , , , , , , , ,7777,2, , , , ,1, , , , , , , , , , , , , , , , , , ,8,3, ,4,18:26:01,15/10/2020,1, ,2929.31527313141,4842.86574819152,4776.5582361423,1,1
01009020,1,01009020_01,1,4,11,0100900340000,01,01 AGUASCALIENTES,009,009 TEPEZALÁ,MQ055,13:43:58,15/10/2020,13:56:00,15/10/2020,13,1, , , , ,0,0, , , , ,0,0, , , , ,0,0,13:43:58,15/10/2020,1,3,2,1,1,61,26081959,1,1,4513.06971374442,4513.06971374442,1,1,61,1,16,1,61,1,1,1, , ,1, ,01, , , ,100,0,10,1,30,15,0,2, ,3,1,1,1, , , , , , , , , , , , , , , , , , , , , ,7777,2, , , , , , , , , , , , , , , , , , , , , , , ,2, , , , ,2,03,08,11,12, , , , , , , , , , , , , , ,8,4,ninguno,13,13:56:00,15/10/2020,1, ,2083.56850133336,4677.77972282216,4861.75223332666,1,1
01009020,2,01009020_02,1,4,11,0100900340000,01,01 AGUASCALIENTES,009,009 TEPEZALÁ,MQ055,13:12:26,15/10/2020,13:43:32,15/10/2020,31,1, , , , ,0,0, , , , ,0,0, , , , ,0,0,13:12:26,15/10/2020,1,1,2,1,2,36,21051984,4,1,4513.06971374442,4513.06971374442,1,1,36,2,15,14,36,2,1,1, , ,1, ,01, , , ,100,0,10,1,30,15,0,2, ,4,4,1,1, , , , , , , , , , , , , , , , , , , , , ,7777,1,2, , , , , , , ,01, , , , , , , , , , , , , , ,2, , , , ,1, , , , , , , , , , , , , , , , , , ,6,4,ninguno,31,13:43:32,15/10/2020,1, ,2929.31527313141,4842.86574819152,4776.5582361423,1,1
01010008,1,01010008_01,2,4,12,0101001580001,01,01 AGUASCALIENTES,010,010 EL LLANO,MQ069,11:31:56,09/10/2020,11:42:00,09/10/2020,11,1, , , , ,0,0, , , , ,0,0, , , , ,0,0,11:31:56,09/10/2020,1,3,2,1,2,73,18081947,1,1,2664.71311988255,2664.71311988255,1,1,73,2,16,7,73,2,1,1, , ,7, ,02,03, , ,7777,0,5,0,5,20,0,2, ,2,1,3,1, , , , , ,05, , , , , , , , , , , , , , , ,7777,1,1,4, , , , , , ,01, , , , , , , , , , , , , ,1200,2, , , , ,1, , , , , , , , , , , , , , , , , , ,10,3, ,11,11:42:00,09/10/2020,1, ,2294.1123373531,6820.00148977708,7039.23753131839,2,2
01010011,1,01010011_01,2,4,12,0101001580001,01,01 AGUASCALIENTES,010,010 EL LLANO,MQ069,13:56:52,08/10/2020,14:00:25,08/10/2020,4,1, , , , ,0,0, , , , ,0,0, , , , ,0,0,13:56:52,08/10/2020,1,3,1,1,2,69,26081951,1,1,6850.12398635933,6850.12398635933,1,1,69,2,16,1,69,2,1,1, , ,7, ,02,03, , ,7777,0,10,0,3,30,0,2, ,4,1,2, , , , , , ,01, , , , , , , , , , , , , , , , ,2, , , , , , , , , , , , , , , , , , , , , , , ,2, , , , ,2,06, , , , , , , , , , , , , , , , , ,6,4, ,4,14:00:25,08/10/2020,1, ,2294.1123373531,6820.00148977708,7039.23753131839,2,2
01010011,2,01010011_02,2,4,12,0101001580001,01,01 AGUASCALIENTES,010,010 EL LLANO,MQ069,14:00:26,08/10/2020,14:16:48,08/10/2020,16,5,18:00:29,08/10/2020,18:07:02,08/10/2020,7,1, , , , ,0,0, , , , ,0,0,14:00:26,08/10/2020,1,9,1,1,1,33,27071987,2,1,6850.12398635933,6850.12398635933,1,1,33,1,44,8,33,1,1,1, , ,8, ,02, , , ,300,0,25,0,40,88,88,9, ,4,2,1,3, , , , , , , , , , , , , , , , , , , , , ,500,1,1,1, , , , , , , , , , , , , , , , , , , , ,9999,2, , , , ,2,06,10,12, , , , , , , , , , , , , , , ,6,4, ,23,18:07:02,08/10/2020,1, ,3976.27732606947,21535.2569549128,21009.1415919081,2,2
01010014,1,01010014_01,2,4,12,0101001580001,01,01 AGUASCALIENTES,010,010 EL LLANO,MQ075,19:36:20,08/10/2020,19:42:22,08/10/2020,6,1, , , , ,0,0, , , , ,0,0, , , , ,0,0,19:36:20,08/10/2020,1,1,2,1,1,62,4031958,7,1,3421.98478019322,3421.98478019322,1,1,62,1,28,2,62,1,1,1, , ,2, ,01, , , ,7777,0,5,0,5,30,0,2, ,3,1,1,2, , , , , , , , , , , , , , , , , , , , , ,7777,2, , , , , , , , , , , , , , , , , , , , , , , ,2, , , , ,1, , , , , , , , , , , , , , , , , , ,10,2,ninguno,6,19:42:22,08/10/2020,1, ,1460.95502930293,4373.28286072985,4545.27980686851,2,2
01010014,2,01010014_02,2,4,12,0101001580001,01,01 AGUASCALIENTES,010,010 EL LLANO,MQ075,16:48:01,08/10/2020,16:52:39,08/10/2020,4,1, , , , ,0,0, , , , ,0,0, , , , ,0,0,16:48:01,08/10/2020,1,1,2,1,2,59,8031961,7,1,3421.98478019322,3421.98478019322,1,1,59,2,28,2,59,2,1,1, , ,2, ,01, , , ,7777,0,5,0,10,30,1,2, ,3,1,1,2, , , , , , , , , , , , , , , , , , , , , ,7777,2, , , , , , , , , , , , , , , , , , , , , , , ,2, , , , ,1, , , , , , , , , , , , , , , , , , ,9,2,ninguno,4,16:52:39,08/10/2020,1, ,1478.60620344553,4395.64198583534,4536.9444694861,2,2
01010018,1,01010018_01,2,4,12,0101001580001,01,01 AGUASCALIENTES,010,010 EL LLANO,MQ075,12:06:22,08/10/2020,12:12:03,08/10/2020,6,1, , , , ,0,0, , , , ,0,0, , , , ,0,0,12:06:22,08/10/2020,1,9,1,1,1,64,4051956,5,1,4842.41741173376,4842.41741173376,1,1,64,1,31,14,64,1,1,1, , ,14, ,07, , , ,300,0,30,1,0,30,0,1,500,2,1,1,2, , , , , , , , , , , , , , , , , , , , , ,2000,1,1,2,3, , , , , ,01, , , , , , , , , , , , , ,1000,2, , , , ,1, , , , , , , , , , , , , , , , , , ,10,1,ninguno,6,12:12:03,08/10/2020,1, ,1460.95502930293,4373.28286072985,4545.27980686851,2,2
01010018,5,01010018_05,2,4,12,0101001580001,01,01 AGUASCALIENTES,010,010 EL LLANO,MQ075,14:10:35,09/10/2020,14:13:19,09/10/2020,3,1, , , , ,0,0, , , , ,0,0, , , , ,0,0,14:10:35,09/10/2020,1,9, ,1,1,2,3052018,5,1,4842.41741173376,4842.41741173376,1,1,2,1,1,14,2,1,1,1, , ,13, ,01, , , ,7777,0,5,0,20,20,0,1,50,2,1,1,2, , , , , , , , , , , , , , , , , , , , , ,150,2, , , , , , , , , , , , , , , , , , , , , , , ,2, , , , ,1, , , , , , , , , , , , , , , , , , ,9,3,ninguno,3,14:13:19,09/10/2020,1, ,2907.62562862842,4448.09638378425,4387.67283035237,2,2
01010026,5,01010026_05,2,4,12,0101001580001,01,01 AGUASCALIENTES,010,010 EL LLANO,MQ062,17:22:14,10/10/2020,17:35:53,10/10/2020,13,1, , , , ,0,0, , , , ,0,0, , , , ,0,0,17:22:14,10/10/2020,1,9,2,1,1,16,16092004,0,1,6317.75890824245,9737.57960144446,1,1,16,1,1,14,16,1,2,1,44,VERTIGO,14, ,09, , , ,200,2,0,0,10,40,0,1,600,1,1,1,3, , , , , , , , , , , , , , , , , , , , , ,780,2, , , , , , , , , , , , , , , , , , , , , , , ,2, , , , ,1, , , , , , , , , , , , , , , , , , ,8,3, ,13,17:35:53,10/10/2020,1, ,2890.87237604449,9840.38264125599,9644.73860168644,2,2
01010026,6,01010026_06,2,4,12,0101001580001,01,01 AGUASCALIENTES,010,010 EL LLANO,MQ062,17:35:55,10/10/2020,17:39:21,10/10/2020,4,1, , , , ,0,0, , , , ,0,0, , , , ,0,0,17:35:55,10/10/2020,1,9, ,1,1,7,11122012,9,1,6317.75890824245,9737.57960144446,1,1,7,1,1,14,7,1,1,1, , ,14, ,02,04,13, ,7777,0,15,0,30,25,0,1,200,3,1,1,1, , , , , , , , , , , , , , , , , , , , , ,180,2, , , , , , , , , , , , , , , , , , , , , , , ,2, , , , ,1, , , , , , , , , , , , , , , , , , ,8,3, ,4,17:39:21,10/10/2020,1, ,2831.59539597267,7133.96257978808,7235.98240060142,2,2
02001003,1,02001003_01,3,1,23,0200195850001,02,02 BAJA CALIFORNIA,001,001 ENSENADA,MQ050,20:19:50,03/11/2020,20:28:25,03/11/2020,9,1, , , , ,0,0, , , , ,0,0, , , , ,0,0,20:19:50,03/11/2020,1,5,2,1,1,44,28091976,1,1,11057.3438833184,11057.3438833184,1,1,44,1,23,14,44,1,1,1, , ,14, ,16, , ,NO TENIA SEGURO,30,0,15,0,2,40,0,1,500,4,1,1,3, , , , , , , , , , , , , , , , , , , , , ,1500,1,1,4, , , , , , ,01, , , , , , , , , , , , , ,700,1,125,9999,9999,2,1, , , , , , , , , , , , , , , , , , ,10,1, ,9,20:28:25,03/11/2020,1, ,5416.00885578372,9279.43793342172,9751.5279369967,3,2
02001003,2,02001003_02,3,1,23,0200195850001,02,02 BAJA CALIFORNIA,001,001 ENSENADA,MQ050,20:28:35,03/11/2020,20:32:49,03/11/2020,4,1, , , , ,0,0, , , , ,0,0, , , , ,0,0,20:28:35,03/11/2020,1,9,2,1,2,42,7081978,2,1,11057.3438833184,11057.3438833184,1,1,42,2,1,1,42,2,1,1, , ,1, ,01, , , ,40,0,20,0,15,5,0,2, ,3,1,1,1, , , , , , , , , , , , , , , , , , , , , ,7777,2, , , , , , , , , , , , , , , , , , , , , , , ,2, , , , ,1, , , , , , , , , , , , , , , , , , ,10,3, ,4,20:32:49,03/11/2020,1, ,5136.49769062452,10705.1458022081,10792.5699768769,3,2
02002004,1,02002004_01,3,1,23,0200206590001,02,02 BAJA CALIFORNIA,002,002 MEXICALI,MQ044,12:53:54,08/10/2020,12:59:24,08/10/2020,6,1, , , , ,0,0, , , , ,0,0, , , , ,0,0,12:53:54,08/10/2020,1,2,2,1,1,49,7121970,10,1,4580.46667323307,4580.46667323307,1,1,49,1,44,3,49,1,1,1, , ,3, ,01, , , ,500,0,10,1,0,0,3,2, ,5,1,1,1, , , , , , , , , , , , , , , , , , , , , ,7777,1,1,1, , , , , , , , , , , , , , , , , , , , ,7777,1,5000,1000,0,2,1, , , , , , , , , , , , , , , , , , ,10,2, ,6,12:59:24,08/10/2020,1, ,4284.45711809747,8564.16242880125,8999.86289909242,3,2
02002008,2,02002008_02,3,1,23,0200206590001,02,02 BAJA CALIFORNIA,002,002 MEXICALI,MQ242,21:52:01,07/10/2020,21:54:27,07/10/2020,2,1, , , , ,0,0, , , , ,0,0, , , , ,0,0,21:52:01,07/10/2020,1,2,2,1,2,31,21011989,8,1,5160.83168863504,5160.83168863504,1,1,31,2,1,13,31,2,1,1, , ,13, ,11, , , ,50,0,10,0,10,10,0,1,60,3,1,1,1, , , , , , , , , , , , , , , , , , , , , ,500,2, , , , , , , , , , , , , , , , , , , , , , , ,2, , , , ,1, , , , , , , , , , , , , , , , , , ,10,3,NINGUNA,2,21:54:27,07/10/2020,1, ,5173.42452204493,11913.8884746045,11638.6984079184,3,2
02002011,1,02002011_01,3,1,23,0200206590001,02,02 BAJA CALIFORNIA,002,002 MEXICALI,MQ245,14:52:12,07/10/2020,14:58:42,07/10/2020,6,1, , , , ,0,0, , , , ,0,0, , , , ,0,0,14:52:12,07/10/2020,1,9,1,1,2,27,2081993,2,1,3931.21772387434,3931.21772387434,1,1,27,2,28,14,27,2,1,1, , ,14, ,13, , , ,50,0,20,0,15,20,0,1,400,0, , , , , , , , , , , , , , , , , , , , , , , , , ,2, , , , , , , , , , , , , , , , , , , , , , , ,2, , , , ,1, , , , , , , , , , , , , , , , , , ,10,1,no,6,14:58:42,07/10/2020,1, ,3940.81020293228,9075.29878076979,8865.67519045333,3,2
02002014,1,02002014_01,3,1,23,0200206590001,02,02 BAJA CALIFORNIA,002,002 MEXICALI,MQ050,20:49:35,08/10/2020,21:06:21,08/10/2020,17,1, , , , ,0,0, , , , ,0,0, , , , ,0,0,20:49:35,08/10/2020,1,1,1,1,1,57,31011963,8,1,3522.37409479123,3522.37409479123,1,1,57,1,16,1,57,1,1,1, , ,1, ,01, , , ,17,0,20,0,5,10,0,2, ,4,1,1,1, , , , , , , , , , , , , , , , , , , , , ,7777,2, , , , , , , , , , , , , , , , , , , , , , , ,2, , , , ,1, , , , , , , , , , , , , , , , , , ,10,3, ,17,21:06:21,08/10/2020,1, ,3326.86405418801,7409.2966255788,7614.79287380737,3,2
02002018,1,02002018_01,3,1,23,0200206590001,02,02 BAJA CALIFORNIA,002,002 MEXICALI,MQ044,15:22:04,08/10/2020,15:24:03,08/10/2020,2,1, , , , ,0,0, , , , ,0,0, , , , ,0,0,15:22:04,08/10/2020,1,1,2,1,2,57,4071963,3,1,3109.36644966898,3109.36644966898,1,1,57,2,44,13,57,2,1,1, , ,13, ,03, , , ,7777,0,10,0,15,20,0,1,60,3,1,1,1, , , , , , , , , , , , , , , , , , , , , ,260,2, , , , , , , , , , , , , , , , , , , , , , , ,2, , , , ,1, , , , , , , , , , , , , , , , , , ,10,1, ,2,15:24:03,08/10/2020,1, ,2982.70681319566,6072.134726248,6163.16387986001,3,2
02002023,1,02002023_01,3,1,23,0200206590001,02,02 BAJA CALIFORNIA,002,002 MEXICALI,MQ050,14:44:23,08/10/2020,14:51:24,08/10/2020,7,1, , , , ,0,0, , , , ,0,0, , , , ,0,0,14:44:23,08/10/2020,1,1,2,1,1,75,24081945,1,1,3404.26357223105,3404.26357223105,1,1,75,1,44,14,75,1,1,1, , ,14, ,10, , , ,7777,0,5,0,10,20,0,2, ,3,1,1,3, , , , , , , , , , , , , , , , , , , , , ,7777,1,1,4, , , , , , ,01, , , , , , , , , , , , , ,7777,2, , , , ,1, , , , , , , , , , , , , , , , , , ,10,2, ,7,14:51:24,08/10/2020,1, ,3215.30927853034,7160.85172089232,7359.45736959647,3,2
02002025,2,02002025_02,3,1,23,0200227630001,02,02 BAJA CALIFORNIA,002,002 MEXICALI,MQ242,00:23:17,02/10/2020,00:23:36,02/10/2020,0,5,16:03:14,16/10/2020,16:06:35,16/10/2020,3,1, , , , ,0,0, , , , ,0,0,00:23:17,02/10/2020,1,1,2,1,2,29,20101990,11,1,6177.07887572044,6177.07887572044,1,1,29,2,15,14,29,2,1,1, , ,14, ,11, , , ,100,0,10,15,0,20,0,1,300,0, , , , , , , , , , , , , , , , , , , , , , , , , ,2, , , , , , , , , , , , , , , , , , , , , , , ,2, , , , ,1, , , , , , , , , , , , , , , , , , ,9,3,NINGUNA,3,16:06:35,16/10/2020,1, ,6192.15143183828,12222.7855504485,11940.460499489,3,2
02002029,1,02002029_01,3,1,23,0200227630001,02,02 BAJA CALIFORNIA,002,002 MEXICALI,MQ242,12:43:07,02/10/2020,12:46:20,02/10/2020,3,1, , , , ,0,0, , , , ,0,0, , , , ,0,0,12:43:07,02/10/2020,1,9,2,1,2,33,31101986,11,1,11760.502083464,11760.502083464,1,1,33,2,14,14,33,2,1,1, , ,13, ,11, , , ,50,0,5,1,0,20,0,1,800,4,1,3,3, , , , , ,07, , , , , , , , , , , , , , , ,1308,2, , , , , , , , , , , , , , , , , , , , , , , ,2, , , , ,1, , , , , , , , , , , , , , , , , , ,10,2,NINGUNA,3,12:46:20,02/10/2020,1, ,6192.15143183828,12222.7855504485,11940.460499489,3,2
02002029,2,02002029_02,3,1,23,0200227630001,02,02 BAJA CALIFORNIA,002,002 MEXICALI,MQ242,11:06:41,05/10/2020,11:15:25,05/10/2020,9,1, , , , ,0,0, , , , ,0,0, , , , ,0,0,11:06:41,05/10/2020,1,9,2,1,1,35,26091985,0,1,11760.502083464,11760.502083464,1,1,35,1,14,14,35,1,1,1, , ,14, ,11, , , ,50,0,10,0,20,20,0,1,800,4,1,1,3, , , , , , , , , , , , , , , , , , , , , ,1000,2, , , , , , , , , , , , , , , , , , , , , , , ,2, , , , ,1, , , , , , , , , , , , , , , , , , ,9,1,NINGUNA,9,11:15:25,05/10/2020,1, ,5222.59826614618,8948.06078652296,9403.29202779074,3,2
02002031,1,02002031_01,3,1,23,0200227630001,02,02 BAJA CALIFORNIA,002,002 MEXICALI,MQ245,12:27:22,10/10/2020,12:29:14,10/10/2020,2,1, , , , ,0,0, , , , ,0,0, , , , ,0,0,12:27:22,10/10/2020,1,3,2,1,1,84,1991936,1,1,4194.63628309928,4194.63628309928,1,1,84,1,28,13,84,1,1,1, , ,3, ,01, , , ,7777,0,10,0,30,30,0,2, ,0, , , , , , , , , , , , , , , , , , , , , , , , , ,2, , , , , , , , , , , , , , , , , , , , , , , ,2, , , , ,1, , , , , , , , , , , , , , , , , , ,6,3,no,2,12:29:14,10/10/2020,1, ,3961.81220253464,7562.91157729349,7772.66832389923,3,2
02002033,1,02002033_01,3,1,23,0200227630001,02,02 BAJA CALIFORNIA,002,002 MEXICALI,MQ245,12:52:42,01/10/2020,12:55:51,01/10/2020,3,1, , , , ,0,0, , , , ,0,0, , , , ,0,0,12:52:42,01/10/2020,1,6,2,1,1,78,6121941,9,1,8025.90875965588,8025.90875965588,1,1,78,1,28,2,78,1,1,1, , ,2, ,01, , , ,7777,0,10,0,15,10,0,2, ,3,4,1,1, , , , , , , , , , , , , , , , , , , , , ,7777,2, , , , , , , , , , , , , , , , , , , , , , , ,2, , , , ,1, , , , , , , , , , , , , , , , , , ,10,2,no,3,12:55:51,01/10/2020,1, ,3961.81220253464,7562.91157729349,7772.66832389923,3,2
02002033,2,02002033_02,3,1,23,0200227630001,02,02 BAJA CALIFORNIA,002,002 MEXICALI,MQ245,12:55:58,01/10/2020,12:59:06,01/10/2020,4,1, , , , ,0,0, , , , ,0,0, , , , ,0,0,12:55:58,01/10/2020,1,1,2,1,2,75,20011945,8,1,8025.90875965588,8025.90875965588,1,1,75,2,28,2,75,2,1,1, , ,2, ,01, , , ,7777,0,10,0,10,15,0,2, ,4,1,3,1, , , , , ,01, , , , , , , , , , , , , , , ,600,1,2, , , , , , , ,12, , , , , , , , , , , , , , ,2, , , , ,1, , , , , , , , , , , , , , , , , , ,10,2,no,4,12:59:06,01/10/2020,1, ,3675.20609230571,6413.06646331511,6509.20662464744,3,2
02002037,1,02002037_01,3,1,23,0200227630001,02,02 BAJA CALIFORNIA,002,002 MEXICALI,MQ050,12:32:20,10/10/2020,12:37:14,10/10/2020,5,1, , , , ,0,0, , , , ,0,0, , , , ,0,0,12:32:20,10/10/2020,1,3,2,1,1,81,7071939,3,1,3623.75651578967,3623.75651578967,1,1,81,1,16,3,81,1,1,1, , ,2, ,01, , , ,10,0,5,0,5,5,0,2, ,2,1,1,1, , , , , , , , , , , , , , , , , , , , , ,7777,2, , , , , , , , , , , , , , , , , , , , , , , ,2, , , , ,1, , , , , , , , , , , , , , , , , , ,9,3, ,5,12:37:14,10/10/2020,1, ,3422.61922472627,6533.61775774965,6714.82712274417,3,2
02002040,1,02002040_01,3,1,23,0200227630001,02,02 BAJA CALIFORNIA,002,002 MEXICALI,MQ044,13:54:40,01/10/2020,13:58:08,01/10/2020,4,1, , , , ,0,0, , , , ,0,0, , , , ,0,0,13:54:40,01/10/2020,1,9,1,1,2,63,15091957,0,1,3318.83978281716,3318.83978281716,1,1,63,2,28,14,63,2,1,1, , ,14, ,07, , , ,100,0,15,0,30,45,0,1,350,4,1,1,3, , , , , , , , , , , , , , , , , , , , , ,3862,1,1,1, , , , , , , , , , , , , , , , , , , , ,400,2, , , , ,1, , , , , , , , , , , , , , , , , , ,10,1, ,4,13:58:08,01/10/2020,1, ,3183.64727745982,5555.31882384672,5638.60023860084,3,2
02002058,1,02002058_01,3,1,23,0200243120001,02,02 BAJA CALIFORNIA,002,002 MEXICALI,MQ245,14:02:16,05/10/2020,14:06:27,05/10/2020,4,1, , , , ,0,0, , , , ,0,0, , , , ,0,0,14:02:16,05/10/2020,1,9,1,1,1,33,11051987,4,1,11131.5945829375,11131.5945829375,1,1,33,1,14,14,33,1,1,1, , ,14, ,01, , , ,7777,0,15,0,10,30,0,2, ,6,1,1,1, , , , , , , , , , , , , , , , , , , , , ,7777,2, , , , , , , , , , , , , , , , , , , , , , , ,1,500,0,0,2,1, , , , , , , , , , , , , , , , , , ,9,2,no,4,14:06:27,05/10/2020,1, ,5731.21473394976,13983.9527757389,13422.7378501781,3,2
02002058,2,02002058_02,3,1,23,0200243120001,02,02 BAJA CALIFORNIA,002,002 MEXICALI,MQ245,13:57:58,05/10/2020,14:01:53,05/10/2020,4,1, , , , ,0,0, , , , ,0,0, , , , ,0,0,13:57:58,05/10/2020,1,1,1,1,2,32,27011988,8,1,11131.5945829375,11131.5945829375,1,1,32,2,14,14,32,2,1,1, , ,14, ,01, , , ,7777,0,15,0,30,15,0,2, ,3,1,1,1, , , , , , , , , , , , , , , , , , , , , ,7777,1,1,1, , , , , , , , , , , , , , , , , , , , ,7777,1,200,0,0,2,1, , , , , , , , , , , , , , , , , , ,10,1,no,4,14:01:53,05/10/2020,1, ,5614.97352359043,11083.4849576534,10827.475765431,3,2
02002067,1,02002067_01,3,1,23,0200243120001,02,02 BAJA CALIFORNIA,002,002 MEXICALI,MQ050,16:02:21,05/10/2020,16:10:27,05/10/2020,8,1, , , , ,0,0, , , , ,0,0, , , , ,0,0,16:02:21,05/10/2020,1,9,1,1,1,24,29091996,0,1,4815.48946661713,4815.48946661713,1,1,24,1,35,1,24,1,1,1, , ,1, ,01,16, ,PARA PODER OPTENER LA I CAPACIDAD,100,0,10,4,0,0,1,2, ,2,1,1,1, , , , , , , , , , , , , , , , , , , , , ,7777,1,1,1, , , , , , , , , , , , , , , , , , , , ,7777,2, , , , ,2,17, , , , , , , , , , , , , , , , ,"SE TARDARON MUCHO EN ATENDERLO, Y NO HSBIS GENTE",10,2, ,8,16:10:27,05/10/2020,1, ,4990.44548262292,12176.503097242,11687.8261552571,3,2
02002073,1,02002073_01,3,1,23,0200243120001,02,02 BAJA CALIFORNIA,002,002 MEXICALI,MQ242,11:43:36,09/10/2020,11:51:25,09/10/2020,8,1, , , , ,0,0, , , , ,0,0, , , , ,0,0,11:43:36,09/10/2020,1,3,1,1,2,60,14021960,7,1,6282.1998083021,6282.1998083021,1,1,60,2,14,14,60,2,1,1, , ,14, ,11, , , ,200,0,30,2,0,40,0,1,200,10,1,1,3, , , , , , , , , , , , , , , , , , , , , ,5000,1,1,3, , , , , , ,01, , , , , , , , , , , , , ,1500,2, , , , ,1, , , , , , , , , , , , , , , , , , ,10,1,NINGUNA,8,11:51:25,09/10/2020,1, ,2453.51689472547,4281.27471482002,4345.45656045429,3,2
02002073,2,02002073_02,3,1,23,0200243120001,02,02 BAJA CALIFORNIA,002,002 MEXICALI,MQ242,15:07:37,08/10/2020,15:10:06,08/10/2020,3,1, , , , ,0,0, , , , ,0,0, , , , ,0,0,15:07:37,08/10/2020,1,9,1,1,1,41,25041979,5,1,6282.1998083021,6282.1998083021,1,1,41,1,14,14,41,1,1,1, , ,14, ,11, , , ,9999,0,10,0,5,15,0,1,50,4,1,1,3, , , , , , , , , , , , , , , , , , , , , ,2000,2, , , , , , , , , , , , , , , , , , , , , , , ,2, , , , ,1, , , , , , , , , , , , , , , , , , ,9,3,NINGUNA,3,15:10:06,08/10/2020,1, ,3483.80217278003,5968.92045331675,6272.58838001261,3,2