code_upm,estrato,Folio del hogar,Folio de vivienda,N�mero de integrante en el hogar,C�digo de entidad,C�digo de municipio,Tama�o de la localidad,N�mero de hogar,N�mero de hogares en la vivienda,numprog,Clave del entrevistador,Tama�o de porci�n crema,edad,m100,m600,m601,m602a,m602ba,m602bb,m602bc,m602bd,m602be,m602bf,m602bg,m602bh,m602bi,m602bj,m602bk,m602besp,m603,m604,m605,m606a,m606b,m701b,m701da,m701db,m702b,m702c,m702da,m702db,m703b,m703c,m703da,m703db,m704b,m704c,m704da,m704db,m705b,m705c,m705da,m705db,m706b,m706c,m706da,m706db,m707b,m707c,m707da,m707db,m708b,m708c,m708da,m708db,m709b,m709da,m709db,m710b,m710c,m710da,m710db,m711b,m711da,m711db,m712b,m712c,m712da,m712db,m713b,p_ni�os,indice,NS,NSq
1011,11,101103002,101103002.1,4,1,1,1,1,1,1,10,1,7,2,2, , , , , , , , , , , , , , , , , , , , , , , , , , , , , , , , , , , , , , , , , , , , , , , , , , , , , , , , , , , , , , , , , ,186,-0.06,2,3
1011,11,101103004,101103004.1,6,1,1,1,1,1,2,10,2,1,3,3,1, , , , , , , , , , , , , , , , , , ,1,0,6,1,3,0,12,2,0, , ,2,0, , ,1,1,0,12,1,1,0,6,2,0, , ,2,0, , ,2, , ,1,1,0,12,2, , ,2,0, , ,1,62,0.19,2,3
1011,11,101103006,101103006.1,6,1,1,1,1,1,3,10,2,5,2,2,1, , , , , , , , , , , , , , , , , , , , , , , , , , , , , , , , , , , , , , , , , , , , , , , , , , , , , , , , , , , , , , , , ,62,-0.2,2,2
1011,11,101103014,101103014.1,11,1,1,1,1,1,6,10,1,2,4,4,1, , , , , , , , , , , , , , , , , , ,1,0,2,1,3,0,6,2,0, , ,1,2,14,0,1,4,0,4,1,5,0,12,1,1,0,7,1,1,0,8,2, , ,1,4,0,8,2, , ,1,2,0,12,1,124,1.71,3,5
1011,11,101103008,101103008.1,5,1,1,1,1,1,4,10,1,5,2,2,1, , , , , , , , , , , , , , , , , , , , , , , , , , , , , , , , , , , , , , , , , , , , , , , , , , , , , , , , , , , , , , , , ,186,-0.3,2,2
1011,11,101103010,101103010.1,8,1,1,1,1,1,5,10,2,9,3,3, , , , , , , , , , , , , , , , , , , , , , , , , , , , , , , , , , , , , , , , , , , , , , , , , , , , , , , , , , , , , , , , , ,62,1.15,3,4
1011,11,101103012,101103012.1,4,1,1,1,1,1,6,10,2,5,2,2,1, , , , , , , , , , , , , , , , , , , , , , , , , , , , , , , , , , , , , , , , , , , , , , , , , , , , , , , , , , , , , , , , ,124,-0.3,2,2
1011,11,101103018,101103018.1,4,1,1,1,1,1,9,10,2,2,2,2,1, , , , , , , , , , , , , , , , , , ,1,0,2,1,1,0,12,2,0, , ,1,6,0,4,1,4,0,4,1,6,0,6,1,1,0,4,1,1,0,12,1,0,12,2,4, , ,2, , ,2,2, , ,1,124,-1.73,1,1
1011,11,101103022,101103022.1,6,1,1,1,1,1,11,10,1,7,2,3, , , , , , , , , , , , , , , , , , , , , , , , , , , , , , , , , , , , , , , , , , , , , , , , , , , , , , , , , , , , , , , , , ,62,0.92,2,4
1011,11,101103024,101103024.1,4,1,1,1,1,1,12,10,1,8,1,1, , , , , , , , , , , , , , , , , , , , , , , , , , , , , , , , , , , , , , , , , , , , , , , , , , , , , , , , , , , , , , , , , ,62,1.88,3,5
1011,11,101103026,101103026.1,5,1,1,1,1,1,1,38,2,4,4,4,2, , , , , , , , , , , , , , , , , , , , , , , , , , , , , , , , , , , , , , , , , , , , , , , , , , , , , , , , , , , , , , , , ,62,-3.72,1,1
1011,11,101103028,101103028.1,4,1,1,1,1,1,2,38,1,7,2,2, , , , , , , , , , , , , , , , , , , , , , , , , , , , , , , , , , , , , , , , , , , , , , , , , , , , , , , , , , , , , , , , , ,62,-2.81,1,1
1011,11,101103034,101103034.1,8,1,1,1,1,1,5,38,2,6,2,2, , , , , , , , , , , , , , , , , , , , , , , , , , , , , , , , , , , , , , , , , , , , , , , , , , , , , , , , , , , , , , , , , ,124,0.34,2,3
1011,11,101103036,101103036.1,7,1,1,1,1,1,6,38,1,6,2,2, , , , , , , , , , , , , , , , , , , , , , , , , , , , , , , , , , , , , , , , , , , , , , , , , , , , , , , , , , , , , , , , , ,124,-3.14,1,1
1011,11,101103038,101103038.1,3,1,1,1,1,1,7,38,2,6,1,1, , , , , , , , , , , , , , , , , , , , , , , , , , , , , , , , , , , , , , , , , , , , , , , , , , , , , , , , , , , , , , , , , ,248,-3.39,1,1
1011,11,101103040,101103040.1,9,1,1,1,1,1,8,38,1,6,5,2, , , , , , , , , , , , , , , , , , , , , , , , , , , , , , , , , , , , , , , , , , , , , , , , , , , , , , , , , , , , , , , , , ,124,-1.86,1,1
1011,11,101103044,101103044.1,5,1,1,1,1,1,10,38,2,5,1,2,1, , , , , , , , , , , , , , , , , , , , , , , , , , , , , , , , , , , , , , , , , , , , , , , , , , , , , , , , , , , , , , , , ,186,-0.69,1,2
1011,11,101103046,101103046.1,4,1,1,1,1,1,11,38,2,7,2,2, , , , , , , , , , , , , , , , , , , , , , , , , , , , , , , , , , , , , , , , , , , , , , , , , , , , , , , , , , , , , , , , , ,124,0.42,2,3
1011,11,101103048,101103048.1,3,1,1,1,1,1,12,38,2,4,2,2,1, , , , , , , , , , , , , , , , , , , , , , , , , , , , , , , , , , , , , , , , , , , , , , , , , , , , , , , , , , , , , , , , ,186,-3.07,1,1
1011,11,101103050,101103050.1,4,1,1,1,1,1,1,38,1,5,1,1,1, , , , , , , , , , , , , , , , , , , , , , , , , , , , , , , , , , , , , , , , , , , , , , , , , , , , , , , , , , , , , , , , ,248,-0.38,2,2
1011,11,101103052,101103052.1,6,1,1,1,1,1,2,38,1,0,2,2,2, , , , , , , , , , , , , , , , , , ,1,0,1,1,2,2,0,2,0, , ,2,0, , ,2,0, , ,1,1,0,6,1,1,0,3,2,0, , ,2, , ,2,0, , ,2, , ,1,2,0,4,2,62,0.59,2,3
1011,11,101103056,101103056.1,4,1,1,1,1,1,4,38,1,5,2,2,1, , , , , , , , , , , , , , , , , , , , , , , , , , , , , , , , , , , , , , , , , , , , , , , , , , , , , , , , , , , , , , , , ,186,0.34,2,3
1011,11,101103058,101103058.1,5,1,1,1,1,1,5,38,1,3,2,2,1, , , , , , , , , , , , , , , , , , , , , , , , , , , , , , , , , , , , , , , , , , , , , , , , , , , , , , , , , , , , , , , , ,124,-0.22,2,2
1011,11,101103060,101103060.1,5,1,1,1,1,1,6,38,2,6,1,2, , , , , , , , , , , , , , , , , , , , , , , , , , , , , , , , , , , , , , , , , , , , , , , , , , , , , , , , , , , , , , , , , ,62,1.31,3,4
1011,11,101103062,101103062.1,4,1,1,1,1,1,7,38,2,9,2,2, , , , , , , , , , , , , , , , , , , , , , , , , , , , , , , , , , , , , , , , , , , , , , , , , , , , , , , , , , , , , , , , , ,124,0.34,2,3
1011,11,101103064,101103064.1,6,1,1,1,1,1,8,38,2,8,1,1, , , , , , , , , , , , , , , , , , , , , , , , , , , , , , , , , , , , , , , , , , , , , , , , , , , , , , , , , , , , , , , , , ,62,-1.7,1,1
1011,11,101103066,101103066.1,6,1,1,1,1,1,9,38,2,6,2,2, , , , , , , , , , , , , , , , , , , , , , , , , , , , , , , , , , , , , , , , , , , , , , , , , , , , , , , , , , , , , , , , , ,62,0.59,2,3
1011,11,101103068,101103068.1,2,1,1,1,1,1,10,38,2,3,1,1,1, , , , , , , , , , , , , , , , , , , , , , , , , , , , , , , , , , , , , , , , , , , , , , , , , , , , , , , , , , , , , , , , ,62,-1.63,1,1
1011,11,101103072,101103072.1,4,1,1,1,1,1,12,38,2,1,2,2,1, , , , , , , , , , , , , , , , , , ,1,0,4,1,3,0,12,2,0, , ,1,2,0,3,1,4,0,4,1,1,0,4,1,1,0,4,1,1,0,12,2, , ,1,4,0,4,1,0,12,1,2,0,5,1,124,-1.95,1,1
1012,12,101203012,101203012.1,5,1,1,1,1,1,6,10,2,8,2,2, , , , , , , , , , , , , , , , , , , , , , , , , , , , , , , , , , , , , , , , , , , , , , , , , , , , , , , , , , , , , , , , , ,243,-0.9,1,2
1012,12,101203014,101203014.1,4,1,1,1,1,1,7,10,2,9,1,99, , , , , , , , , , , , , , , , , , , , , , , , , , , , , , , , , , , , , , , , , , , , , , , , , , , , , , , , , , , , , , , , , ,486,0.04,2,3
1012,12,101203018,101203018.1,7,1,1,1,1,1,9,10,2,5,2,2,1, , , , , , , , , , , , , , , , , , , , , , , , , , , , , , , , , , , , , , , , , , , , , , , , , , , , , , , , , , , , , , , , ,243,-0.41,2,2
1012,12,101203028,101203028.1,3,1,1,1,1,1,2,25,1,6,2,2, , , , , , , , , , , , , , , , , , , , , , , , , , , , , , , , , , , , , , , , , , , , , , , , , , , , , , , , , , , , , , , , , ,242,-0.66,1,2
1012,12,101203034,101203034.1,5,1,1,1,1,1,5,25,1,5,4,4,1, , , , , , , , , , , , , , , , , , , , , , , , , , , , , , , , , , , , , , , , , , , , , , , , , , , , , , , , , , , , , , , , ,121,1.15,3,4
1012,12,101203042,101203042.1,7,1,1,1,1,1,9,25,2,8,2,2, , , , , , , , , , , , , , , , , , , , , , , , , , , , , , , , , , , , , , , , , , , , , , , , , , , , , , , , , , , , , , , , , ,242,1.23,3,4
1012,12,101203046,101203046.1,6,1,1,1,1,1,11,25,2,1,4,4,1, , , , , , , , , , , , , , , , , , ,1,0,2,2,0, , ,2,0, , ,1,1,0,4,1,1,0,9,1,7,0,12,1,1,0,4,2,0, , ,2, , ,1,1,0,12,2, , ,1,2,0,6,1,121,0.59,2,3
1012,12,101203048,101203048.1,5,1,1,1,1,1,12,25,1,9,2,2, , , , , , , , , , , , , , , , , , , , , , , , , , , , , , , , , , , , , , , , , , , , , , , , , , , , , , , , , , , , , , , , , ,121,0.74,2,3
1012,12,101203050,101203050.1,5,1,1,1,1,1,13,25,1,5,2,2,1, , , , , , , , , , , , , , , , , , , , , , , , , , , , , , , , , , , , , , , , , , , , , , , , , , , , , , , , , , , , , , , , ,121,1.24,3,4
1012,12,101203052,101203052.1,5,1,1,1,1,1,14,25,2,2,2,2,1, , , , , , , , , , , , , , , , , , ,1,0,6,1,3,0,12,2,0, , ,2,0, , ,1,1,0,12,1,1,0,6,1,1,0,6,2,0, , ,1,0,6,2,0, , ,2, , ,1,2,0,12,1,242,0.27,2,3
1012,12,101203060,101203060.1,4,1,1,1,1,1,18,25,1,7,1,2, , , , , , , , , , , , , , , , , , , , , , , , , , , , , , , , , , , , , , , , , , , , , , , , , , , , , , , , , , , , , , , , , ,363,-0.38,2,2
1012,12,101203068,101203068.1,7,1,1,1,1,1,22,25,2,8,2,3, , , , , , , , , , , , , , , , , , , , , , , , , , , , , , , , , , , , , , , , , , , , , , , , , , , , , , , , , , , , , , , , , ,363,1.4,3,4
1013,13,101300902,101300902.1,3,1,7,2,1,1,2,5,1,1,1,1,1, , , , , , , , , , , , , , , , , , ,1,0,1,1,2,0,12,2,2, , ,2,5, , ,1,2,0,12,1,1,0,3,1,1,0,3,2,2, , ,2, , ,1,4,0,3,2, , ,1,1,0,12,2,124,-2.02,1,1
1013,13,101300903,101300903.1,7,1,7,2,1,1,3,5,2,8,2,2, , , , , , , , , , , , , , , , , , , , , , , , , , , , , , , , , , , , , , , , , , , , , , , , , , , , , , , , , , , , , , , , , ,310,-0.66,1,2
1013,13,101300904,101300904.1,3,1,7,2,1,1,4,5,1,2,4,2,1, , , , , , , , , , , , , , , , , , ,1,0,4,1,3,0,12,2,0, , ,1,5,0,3,2,4, , ,1,1,0,6,1,1,0,3,2,1, , ,2, , ,1,4,0,5,2, , ,1,1,0,12,2,62,-0.06,2,3
1013,13,101300905,101300905.1,4,1,7,2,1,1,5,5,1,3,2,2,1, , , , , , , , , , , , , , , , , , , , , , , , , , , , , , , , , , , , , , , , , , , , , , , , , , , , , , , , , , , , , , , , ,124,1.15,3,4
1013,13,101300906,101300906.1,8,1,7,2,1,1,6,5,1,6,2,2, , , , , , , , , , , , , , , , , , , , , , , , , , , , , , , , , , , , , , , , , , , , , , , , , , , , , , , , , , , , , , , , , ,124,-1.06,1,2
1013,13,101301001,101301001.1,8,1,7,2,1,1,1,13,1,3,1,2,2, , , , , , , , , , , , , , , , , , , , , , , , , , , , , , , , , , , , , , , , , , , , , , , , , , , , , , , , , , , , , , , , ,248,1.23,3,4
1013,13,101301002,101301002.1,4,1,7,2,1,1,2,13,2,7,2,2, , , , , , , , , , , , , , , , , , , , , , , , , , , , , , , , , , , , , , , , , , , , , , , , , , , , , , , , , , , , , , , , , ,248,-0.62,1,2
1013,13,101301003,101301003.1,5,1,7,2,1,1,3,13,1,3,2,2,1, , , , , , , , , , , , , , , , , , , , , , , , , , , , , , , , , , , , , , , , , , , , , , , , , , , , , , , , , , , , , , , , ,186,-0.66,1,2
1013,13,101301004,101301004.1,6,1,7,2,1,1,5,13,2,5,2,2,1, , , , , , , , , , , , , , , , , , , , , , , , , , , , , , , , , , , , , , , , , , , , , , , , , , , , , , , , , , , , , , , , ,62,-1.95,1,1
1013,13,101301005,101301005.1,8,1,7,2,1,1,6,13,1,2,2,2,1, , , , , , , , , , , , , , , , , , ,1,0,3,1,1,0,6,2,1, , ,1,6,0,3,1,4,0,4,1,1,0,3,2,2, , ,1,1,0,3,1,0,6,2,4, , ,1,0,12,1,2,0,3,1,186,-2.42,1,1
1013,13,101301006,101301006.1,3,1,7,2,1,1,7,13,1,3,2,2,1, , , , , , , , , , , , , , , , , , , , , , , , , , , , , , , , , , , , , , , , , , , , , , , , , , , , , , , , , , , , , , , , ,62,-1.95,1,1
1013,13,101301901,101301901.1,4,1,7,2,1,1,1,13,2,9,2,2, , , , , , , , , , , , , , , , , , , , , , , , , , , , , , , , , , , , , , , , , , , , , , , , , , , , , , , , , , , , , , , , , ,186,1.88,3,5
1013,13,101301902,101301902.1,7,1,7,2,1,1,2,13,1,1,2,99,2, , , , , , , , , , , , , , , , , , ,1,88,88,2,3, , ,2,0, , ,1,2,0,4,2,2, , ,1,1,0,8,1,2,0,8,1,1,0,6,2, , ,1,4,0,7,2, , ,1,1,0,12,2,62,-0.9,1,2
1013,13,101301903,101301903.1,6,1,7,2,1,1,3,13,1,6,2,2, , , , , , , , , , , , , , , , , , , , , , , , , , , , , , , , , , , , , , , , , , , , , , , , , , , , , , , , , , , , , , , , , ,186,0.91,2,4
1013,13,101301904,101301904.1,6,1,7,2,1,1,4,13,2,0,5,5,1,2, , , , , , , , , , , , ,1,3,2,0,7,1,0,1,1,1,0,1,2,0, , ,2,6, , ,2,0, , ,2,1, , ,1,2,0,5,2,0, , ,2, , ,2,0, , ,1,0,5,1,2,0,6,2,62,-1.17,1,2
1013,13,101301905,101301905.1,14,1,7,2,1,1,5,13,1,0,3,3,1,2, , , , , , , , , , , , ,1,6,4,0,3,2, , ,1,1,0,1,2,0, , ,2,0, , ,2,0, , ,2,0, , ,2,0, , ,2,0, , ,2, , ,2,0, , ,2, , ,2,0, , ,2,248,-0.53,1,2
1013,13,101301906,101301906.1,4,1,7,2,1,1,6,13,2,6,2,2, , , , , , , , , , , , , , , , , , , , , , , , , , , , , , , , , , , , , , , , , , , , , , , , , , , , , , , , , , , , , , , , , ,186,0.02,2,3
1013,13,101303101,101303101.1,4,1,7,2,1,1,1,13,1,7,2,2, , , , , , , , , , , , , , , , , , , , , , , , , , , , , , , , , , , , , , , , , , , , , , , , , , , , , , , , , , , , , , , , , ,186,-1.17,1,2
1013,13,101303102,101303102.1,2,1,7,2,1,1,2,13,1,9,1,1, , , , , , , , , , , , , , , , , , , , , , , , , , , , , , , , , , , , , , , , , , , , , , , , , , , , , , , , , , , , , , , , , ,186,0.1,2,3
1013,13,101303103,101303103.1,7,1,7,2,1,1,3,13,2,2,2,2,1, , , , , , , , , , , , , , , , , , ,1,0,6,1,3,0,12,2,0, , ,2,4, , ,1,1,0,7,1,1,0,8,2,2, , ,1,1,0,8,2, , ,2,4, , ,2, , ,1,2,0,7,1,124,-0.37,2,2
1013,13,101303104,101303104.1,4,1,7,2,1,1,4,13,1,2,1,1,1, , , , , , , , , , , , , , , , , , ,1,0,4,1,1,2,0,1,1,0,12,1,1,0,12,1,1,0,7,1,6,0,7,2,0, , ,1,1,0,8,2, , ,1,4,0,9,1,0,12,1,2,0,9,1,186,-0.62,1,2
1013,13,101303105,101303105.1,3,1,7,2,1,1,5,13,2,6,2,2, , , , , , , , , , , , , , , , , , , , , , , , , , , , , , , , , , , , , , , , , , , , , , , , , , , , , , , , , , , , , , , , , ,248,-3.07,1,1
1013,13,101304101,101304101.1,3,1,7,2,1,1,1,5,1,5,1,99,1, , , , , , , , , , , , , , , , , , , , , , , , , , , , , , , , , , , , , , , , , , , , , , , , , , , , , , , , , , , , , , , , ,62,-2.28,1,1
1013,13,101304102,101304102.1,11,1,7,2,1,1,2,5,2,8,2,2, , , , , , , , , , , , , , , , , , , , , , , , , , , , , , , , , , , , , , , , , , , , , , , , , , , , , , , , , , , , , , , , , ,186,-2.7,1,1
1013,13,101304103,101304103.1,7,1,7,2,1,1,3,5,1,8,2,2, , , , , , , , , , , , , , , , , , , , , , , , , , , , , , , , , , , , , , , , , , , , , , , , , , , , , , , , , , , , , , , , , ,248,0.22,2,3
1013,13,101304104,101304104.1,3,1,7,2,1,1,5,5,1,1,2,2,1, , , , , , , , , , , , , , , , , , ,1,2,0,2,0, , ,2,0, , ,1,1,0,3,1,4,0,12,1,6,0,3,1,1,0,6,2,1, , ,2, , ,1,4,0,2,2, , ,1,2,0,3,2,62,-0.06,2,3
1013,13,101304105,101304105.1,3,1,7,2,1,1,6,5,1,4,2,2,1, , , , , , , , , , , , , , , , , , , , , , , , , , , , , , , , , , , , , , , , , , , , , , , , , , , , , , , , , , , , , , , , ,124,-2.67,1,1
1013,13,101304106,101304106.1,5,1,7,2,1,1,6,5,2,2,4,4,1, , , , , , , , , , , , , , , , , , ,1,0,2,1,2,1,0,1,1,0,12,1,5,0,4,2,4, , ,1,1,0,4,1,1,0,4,2,1, , ,2, , ,2,1, , ,1,0,12,1,2,0,5,1,124,-3.08,1,1
1013,13,101304201,101304201.1,4,1,7,2,1,1,1,5,1,3,2,2,2, , , , , , , , , , , , , , , , , , , , , , , , , , , , , , , , , , , , , , , , , , , , , , , , , , , , , , , , , , , , , , , , ,62,-0.13,2,2
1013,13,101304202,101304202.1,3,1,7,2,1,1,2,5,1,2,5,2,1, , , , , , , , , , , , , , , , , , ,1,0,3,1,2,0,8,2,0, , ,1,2,0,3,1,4,0,6,1,1,0,6,1,2,0,6,1,1,0,8,2, , ,1,3,0,7,2, , ,2,2, , ,2,62,0.59,2,3
1013,13,101304203,101304203.1,11,1,7,2,1,1,3,5,1,0,2,2,1,1,11, , , , , , , , , , , ,1,5,6,0,4,1,0,1,1,1,1,0,2,0, , ,1,6,0,2,2,4, , ,2,0, , ,2,0, , ,2,0, , ,2, , ,2,0, , ,2, , ,2,0, , ,2,248,-1.25,1,2
1013,13,101304204,101304204.1,4,1,7,2,1,1,4,5,2,9,2,2, , , , , , , , , , , , , , , , , , , , , , , , , , , , , , , , , , , , , , , , , , , , , , , , , , , , , , , , , , , , , , , , , ,186,1.56,3,4
1013,13,101304205,101304205.1,10,1,7,2,1,1,5,5,2,1,2,2,1, , , , , , , , , , , , , , , , , , ,1,0,2,1,2,0,6,2,0, , ,1,5,0,7,2,4, , ,1,1,0,8,2,1, , ,2,0, , ,2, , ,2,4, , ,2, , ,2,2, , ,1,248,-0.09,2,3
1013,13,101304206,101304206.1,13,1,7,2,1,1,6,5,2,2,3,3,1, , , , , , , , , , , , , , , , , , ,1,0,4,1,3,0,8,2,0, , ,2,5, , ,1,2,0,6,1,1,0,12,1,1,0,9,2,1, , ,1,0,12,1,4,0,6,2, , ,1,1,0,12,1,62,0.27,2,3
1014,14,101400303,101400303.1,10,1,2,2,1,1,7,13,2,3,2,2,1, , , , , , , , , , , , , , , , , , , , , , , , , , , , , , , , , , , , , , , , , , , , , , , , , , , , , , , , , , , , , , , , ,441,1.25,3,4
1014,14,101400306,101400306.1,6,1,2,2,1,1,14,13,1,5,2,2,1, , , , , , , , , , , , , , , , , , , , , , , , , , , , , , , , , , , , , , , , , , , , , , , , , , , , , , , , , , , , , , , , ,441,0.52,2,3
1014,14,101401301,101401301.1,5,1,2,2,1,1,1,9,2,6,2,2, , , , , , , , , , , , , , , , , , , , , , , , , , , , , , , , , , , , , , , , , , , , , , , , , , , , , , , , , , , , , , , , , ,294,0.66,2,3
1014,14,101401302,101401302.1,5,1,2,2,1,1,4,9,1,2,2,2,1, , , , , , , , , , , , , , , , , , ,1,0,2,1,1,0,3,2,0, , ,2,4, , ,2,4, , ,2,2, , ,1,1,0,4,2,1, , ,2, , ,2,4, , ,2, , ,1,2,0,5,2,147,1.88,3,5
1014,14,101401303,101401303.1,5,1,2,2,1,1,7,9,2,6,2,2, , , , , , , , , , , , , , , , , , , , , , , , , , , , , , , , , , , , , , , , , , , , , , , , , , , , , , , , , , , , , , , , , ,147,-1.1,1,2
1014,14,101401306,101401306.1,3,1,2,2,1,1,17,9,2,9,2,2, , , , , , , , , , , , , , , , , , , , , , , , , , , , , , , , , , , , , , , , , , , , , , , , , , , , , , , , , , , , , , , , , ,294,0.75,2,3
1014,14,101401701,101401701.1,5,1,2,2,1,1,1,13,1,5,2,2,1, , , , , , , , , , , , , , , , , , , , , , , , , , , , , , , , , , , , , , , , , , , , , , , , , , , , , , , , , , , , , , , , ,294,0.59,2,3
1014,14,101401703,101401703.1,6,1,2,2,1,1,3,13,1,4,2,2,1, , , , , , , , , , , , , , , , , , , , , , , , , , , , , , , , , , , , , , , , , , , , , , , , , , , , , , , , , , , , , , , , ,294,-0.82,1,2
1014,14,101401704,101401704.1,5,1,2,2,1,1,5,13,1,1,2,2,1, , , , , , , , , , , , , , , , , , ,1,0,3,1,1,0,8,2,0, , ,1,3,0,12,1,2,0,8,1,1,0,3,1,1,0,3,1,1,0,12,1,0,12,2,3, , ,2, , ,1,2,0,9,1,441,-0.73,1,2
1014,14,101401706,101401706.1,8,1,2,2,1,1,7,13,2,9,2,2, , , , , , , , , , , , , , , , , , , , , , , , , , , , , , , , , , , , , , , , , , , , , , , , , , , , , , , , , , , , , , , , , ,441,2.03,3,5
1014,14,101402401,101402401.1,5,1,2,2,1,1,1,9,1,4,2,2,1, , , , , , , , , , , , , , , , , , , , , , , , , , , , , , , , , , , , , , , , , , , , , , , , , , , , , , , , , , , , , , , , ,294,1.48,3,4
1014,14,101402405,101402405.1,5,1,2,2,1,1,11,9,1,3,2,2,1, , , , , , , , , , , , , , , , , , , , , , , , , , , , , , , , , , , , , , , , , , , , , , , , , , , , , , , , , , , , , , , , ,441,0.35,2,3
1014,14,101402406,101402406.1,6,1,2,2,1,1,14,9,1,9,2,2, , , , , , , , , , , , , , , , , , , , , , , , , , , , , , , , , , , , , , , , , , , , , , , , , , , , , , , , , , , , , , , , , ,147,0.98,2,4
1014,14,101403602,101403602.1,3,1,2,2,1,1,3,9,1,5,2,2,1, , , , , , , , , , , , , , , , , , , , , , , , , , , , , , , , , , , , , , , , , , , , , , , , , , , , , , , , , , , , , , , , ,147,-0.3,2,2
1014,14,101404101,101404101.1,4,1,2,2,1,1,1,13,2,6,2,2, , , , , , , , , , , , , , , , , , , , , , , , , , , , , , , , , , , , , , , , , , , , , , , , , , , , , , , , , , , , , , , , , ,294,-0.45,1,2
1014,14,101404102,101404102.1,4,1,2,2,1,1,3,13,2,4,2,2,1, , , , , , , , , , , , , , , , , , , , , , , , , , , , , , , , , , , , , , , , , , , , , , , , , , , , , , , , , , , , , , , , ,588,0.34,2,3
1014,14,101404103,101404103.1,9,1,2,2,1,1,6,13,2,8,2,2, , , , , , , , , , , , , , , , , , , , , , , , , , , , , , , , , , , , , , , , , , , , , , , , , , , , , , , , , , , , , , , , , ,294,1.8,3,5
1014,14,101404104,101404104.1,5,1,2,2,1,1,9,13,2,2,2,2,1, , , , , , , , , , , , , , , , , , ,1,0,4,1,1,3,0,2,0, , ,2,2, , ,2,4, , ,1,1,0,6,1,1,0,5,2,0, , ,1,0,8,2,4, , ,2, , ,1,2,0,6,1,441,0.52,2,3
1014,14,101404106,101404106.1,6,1,2,2,1,1,15,13,2,4,3,3,1, , , , , , , , , , , , , , , , , , , , , , , , , , , , , , , , , , , , , , , , , , , , , , , , , , , , , , , , , , , , , , , , ,147,-1.93,1,1
1015,15,101500601,101500601.1,7,1,1,3,1,1,1,15,2,4,1,1,1, , , , , , , , , , , , , , , , , , , , , , , , , , , , , , , , , , , , , , , , , , , , , , , , , , , , , , , , , , , , , , , , ,264,-1.93,1,1
1015,15,101500602,101500602.1,5,1,1,3,1,1,2,15,2,4,1,1,1, , , , , , , , , , , , , , , , , , , , , , , , , , , , , , , , , , , , , , , , , , , , , , , , , , , , , , , , , , , , , , , , ,176,-0.13,2,2
1015,15,101500603,101500603.1,6,1,1,3,1,1,3,15,1,5,1,1,1, , , , , , , , , , , , , , , , , , , , , , , , , , , , , , , , , , , , , , , , , , , , , , , , , , , , , , , , , , , , , , , , ,88,1.63,3,5
1015,15,101500606,101500606.1,5,1,1,3,1,1,6,15,2,9,2,3, , , , , , , , , , , , , , , , , , , , , , , , , , , , , , , , , , , , , , , , , , , , , , , , , , , , , , , , , , , , , , , , , ,176,0.84,2,4
1015,15,101501402,101501402.1,5,1,1,3,1,1,2,15,1,8,2,2, , , , , , , , , , , , , , , , , , , , , , , , , , , , , , , , , , , , , , , , , , , , , , , , , , , , , , , , , , , , , , , , , ,146,-0.62,1,2
1015,15,101501404,101501404.1,6,1,1,3,1,1,4,15,2,7,2,2, , , , , , , , , , , , , , , , , , , , , , , , , , , , , , , , , , , , , , , , , , , , , , , , , , , , , , , , , , , , , , , , , ,146,0.28,2,3
1015,15,101501405,101501405.1,4,1,1,3,1,1,5,15,1,8,2,2, , , , , , , , , , , , , , , , , , , , , , , , , , , , , , , , , , , , , , , , , , , , , , , , , , , , , , , , , , , , , , , , , ,146,-0.13,2,2
1015,15,101501406,101501406.1,7,1,1,3,1,1,6,15,1,2,4,3,1, , , , , , , , , , , , , , , , , , ,1,0,4,2,1, , ,1,2,0,12,1,4,0,12,1,1,0,12,1,1,0,5,2,1, , ,1,1,0,12,1,0,12,2,4, , ,2, , ,1,2,0,5,1,219,-0.13,2,2
1015,15,101501901,101501901.1,4,1,1,3,1,1,1,15,1,9,2,2, , , , , , , , , , , , , , , , , , , , , , , , , , , , , , , , , , , , , , , , , , , , , , , , , , , , , , , , , , , , , , , , , ,73,-0.45,2,2
1015,15,101501903,101501903.1,6,1,1,3,1,1,4,15,2,5,2,3,1, , , , , , , , , , , , , , , , , , , , , , , , , , , , , , , , , , , , , , , , , , , , , , , , , , , , , , , , , , , , , , , , ,73,0.92,2,4
1015,15,101501904,101501904.1,9,1,1,3,1,1,5,15,2,4,3,3,1, , , , , , , , , , , , , , , , , , , , , , , , , , , , , , , , , , , , , , , , , , , , , , , , , , , , , , , , , , , , , , , , ,219,-0.98,1,2
1015,15,101501905,101501905.1,7,1,1,3,1,1,7,15,1,7,2,2, , , , , , , , , , , , , , , , , , , , , , , , , , , , , , , , , , , , , , , , , , , , , , , , , , , , , , , , , , , , , , , , , ,219,-1.46,1,1
1015,15,101501906,101501906.1,6,1,1,3,1,1,8,15,1,8,2,2, , , , , , , , , , , , , , , , , , , , , , , , , , , , , , , , , , , , , , , , , , , , , , , , , , , , , , , , , , , , , , , , , ,146,1.56,3,4
1015,15,101502101,101502101,6,1,1,3,1,1,1,15,2,6,2,2, , , , , , , , , , , , , , , , , , , , , , , , , , , , , , , , , , , , , , , , , , , , , , , , , , , , , , , , , , , , , , , , , ,73,0.34,2,3
1015,15,101502102,101502102,6,1,1,3,1,1,2,15,2,4,2,2,1, , , , , , , , , , , , , , , , , , , , , , , , , , , , , , , , , , , , , , , , , , , , , , , , , , , , , , , , , , , , , , , , ,146,1.88,3,5
1015,15,101502103,101502103,5,1,1,3,1,1,3,15,1,6,2,2, , , , , , , , , , , , , , , , , , , , , , , , , , , , , , , , , , , , , , , , , , , , , , , , , , , , , , , , , , , , , , , , , ,219,0.66,2,3
1015,15,101502104,101502104,3,1,1,3,1,1,4,15,1,7,2,2, , , , , , , , , , , , , , , , , , , , , , , , , , , , , , , , , , , , , , , , , , , , , , , , , , , , , , , , , , , , , , , , , ,73,-0.22,2,2
1015,15,101502105,101502105,5,1,1,3,1,1,5,15,1,7,2,2, , , , , , , , , , , , , , , , , , , , , , , , , , , , , , , , , , , , , , , , , , , , , , , , , , , , , , , , , , , , , , , , , ,73,-0.38,2,2
1015,15,101502106,101502106,5,1,1,3,1,1,6,15,2,8,1,2, , , , , , , , , , , , , , , , , , , , , , , , , , , , , , , , , , , , , , , , , , , , , , , , , , , , , , , , , , , , , , , , , ,73,0.66,2,3
1015,15,101502401,101502401,6,1,1,3,1,1,1,15,2,1,2,2,1, , , , , , , , , , , , , , , , , , ,1,0,3,1,1,0,3,1,0, , ,1,6,0,4,1,4,0,4,1,7,0,7,1,2,0,6,1,1,0,6,2, , ,2,3, , ,2, , ,1,2,0,12,2,146,0.34,2,3
1015,15,101502401,101502401.1,7,1,1,3,1,1,4,15,1,8,2,2, , , , , , , , , , , , , , , , , , , , , , , , , , , , , , , , , , , , , , , , , , , , , , , , , , , , , , , , , , , , , , , , , ,73,0.34,2,3
1015,15,101502402,101502402,6,1,1,3,1,1,2,15,2,5,2,2,1, , , , , , , , , , , , , , , , , , , , , , , , , , , , , , , , , , , , , , , , , , , , , , , , , , , , , , , , , , , , , , , , ,73,-0.13,2,3