Código UPM,Estrato,Folio de vivienda,Folio del hogar,Número de integrante en el hogar,Código Entidad,Código Municipio,Tamaño de la localidad,Tipo de localidad,Número de hogar,Número de hogares en la vivienda,Número progresivo de la vivienda,Sexo,Edad,Fecha de nacimiento,Parentesco con el jefe del hogar,Condición de residencia,SEGURO MÉDICO ¿Está afiliado o inscrito algún seguro médico?,SEGURO MÉDICO ¿Está afiliado o inscrito algún seguro médico?,SEGURO MÉDICO ¿Está afiliado o inscrito algún seguro médico?,SEGURO MÉDICO Especifique:,"Actualmente, por algún familiar o pariente recibe servicios médicos o alguna pensión en el…","Actualmente, por algún familiar o pariente recibe servicios médicos o alguna pensión en el…","Actualmente, por algún familiar o pariente recibe servicios médicos o alguna pensión en el…",Especifique,FUENTE DE ASEGURAMIENTO ¿Tiene seguro médico por... (Opción1),FUENTE DE ASEGURAMIENTO ¿Tiene seguro médico por... (Opción2),FUENTE DE ASEGURAMIENTO ¿Tiene seguro médico por... (Opción3),ASUMIRSE INDÍGENA ¿Se considera indígena?,LENGUA INDÍGENA ¿Habla alguna lengua indígena?,LENGUA INDÍGENA ¿Habla alguna lengua indígena?,HABLA ESPAÑOL ¿También habla español?,ALFABETISMO ¿Sabe leer y escribir un recado?,¿Alguna vez ha ido a la escuela?,ASISTENCIA A LA ESCUELA ¿Actualmente va a la escuela?,ESCOLARIDAD ¿Cuál es el último grado de educación que pasó (aprobó) en la escuela?,¿Qué año cursó?,Estado Conyugal,Condición de actividad. ¿La semana pasada…,Verificación de actividad,"INGRESO(S) POR TRABAJOS En total, ¿Cuánto gana o recibe por su(s) trabajo(s) o actividad(es)?",¿Cada cuando recibe ésta cantidad? ,"INGRESOS POR PRESTACIONES SOCIALES En el último año ¿Cuánto recibió en total  por aguinaldo, reparto de utilidades, ahorro para el retiro, fondo de ahorro para la vivienda, indemnización por suspención de actividades, jubilaciones y/o pensiones...?","OTROS INGRESOS En total ¿Cuánto dinero recibió en el último mes por indemnizaciones, regalos y donativos originados dentro del país o ingresos provenientes de otros paises, venta de algún bien...?","ESTADO DE SALUD En general, ¿como calificaría su estado de salud hoy?","MORBILIDAD En las últimas dos semanas ¿Ha tenido algún problema de salud, por enfermedad, lesiones físicas por accidente o agresiones?",PROBLEMAS DE SALUD ¿Podría decirme cúal fue el último problema de salud que tuvo en las últimas dos semanas?,Especifique,PERCEPCIÓN DEL PROBLEMA En el momento en que presentó ese problema de salud ¿usted pensó que era…,TIPO DE RECURSOS HUMANOS ¿Quién atendió a  ?,Especifique,"MOTIVO DE NO ATENCIÓN ¿Por qué no se atendió con un médico, enfermera ó algún otro personal de salud?",Especifique,INSTITUCIÓN DE ATENCIÓN ¿En qué institución de salud se atendió?,Especifique,TIPO DE DISCAPACIDAD ¿Tiene limitación o dificultad permanente para…,TIPO DE DISCAPACIDAD ¿Tiene limitación o dificultad permanente para…,TIPO DE DISCAPACIDAD ¿Tiene limitación o dificultad permanente para…,"UTILIZADORES DE SERVICIOS DE SALUD AMBULATORIOS En las últimas dos semanas ¿Buscó o recibió atención médica(ambulatoria), ya sea por prevención, enfermedad, lesión o accidente?","ENFERMEDADES CRÓNICAS Además del problema de salud que comentó, ¿durante el último año algún médico le diagnosticó a  …","ENFERMEDADES CRÓNICAS Además del problema de salud que comentó, ¿durante el último año algún médico le diagnosticó a  …","ENFERMEDADES CRÓNICAS Además del problema de salud que comentó, ¿durante el último año algún médico le diagnosticó a  …",Especifique,DONADORES DE SANGRE Durante el último año ¿Ha donado sangre?,Especifique,"HOSPITALIZACIONES EN EL ÚLTIMO AÑO Durante este último año, ¿  estuvo hospitalizado o internado?",MOTIVO DE LA ÚLTIMA HOSPITALIZACIÓN Ahora le preguntaré por la última vez que estuvo hospitalizado ¿Por qué motivo fue hospitalizado?,Especifique,"INSTITUCIÓN El hospital donde estuvo internado, ¿a qué institución pertenece?","NÚMERO DE HOSPITALIZACIONES En total, ¿cuántas veces estuvo hospitalizado en el último año?","DÍAS DE HOSPITALIZACIÓN En total, ¿cuántos días estuvo (lleva) internado en el último año?",TRANSFUSIONES La última vez que estuvo hospitalizado(a) requirió de alguna transfusión de sangre?,Especifique,SATISFACCIÓN POR ATENCIÓN Si tuviera la oportunidad de escoger ¿regresaría a ese mismo lugar para la hospitalización?,MOTIVO DE LA INSATISFACCIÓN ¿Por qué no regresaría?,Especifique,CALIDAD DE LA ATENCIÓN En general la calidad de la atención fue…,MOTIVOS DE BUENA CALIDAD ¿Por qué le pareció muy buena o buena la atención que recibió?,MOTIVOS DE BUENA CALIDAD ¿Por qué le pareció muy buena o buena la atención que recibió?,Especifique,"MOTIVOS DE MALA CALIDAD ¿Por qué le pareció regular, mala o muy mala la atención que recibió?","MOTIVOS DE MALA CALIDAD ¿Por qué le pareció regular, mala o muy mala la atención que recibió?",Especifique,Ponderador de Integrante,completa,ind_ter,llave,Numero de Cuestionario,nivel,Código USM,Código UTM,Maquina,Código Localidad,Otras de seguridad social y sin especificar reforzada,IMSS,Seguro Popular (SSA),ISSSTE e ISSSTE Estatal,Particular,sinderr,Seguro médico del utilizador,"En las últimas dos semanas ¿  buscó o recibió  atención ambulatoria, ya sea por una enfermedad, lesión o accidente?",Además de problemas de salud ¿  buscó o recibió atención en las dos últimas semanas por ... ,Además de problemas de salud ¿  buscó o recibió atención en las dos últimas semanas por ... ,Además de problemas de salud ¿  buscó o recibió atención en las dos últimas semanas por ... ,Además de problemas de salud ¿  buscó o recibió atención en las dos últimas semanas por ... ,Además de problemas de salud ¿  buscó o recibió atención en las dos últimas semanas por ... ,Además de problemas de salud ¿  buscó o recibió atención en las dos últimas semanas por ... ,u102esp,"¿Cuál fue el principal motivo por el que recibió atención, la última ocasión durante las dos últimas semanas?",u103esp,¿Desde cuando comenzó a estar enfermo?,¿En dónde se atendió?,u202esp,¿Qué persona (lo) atendió (a)?,¿A qué institución pertenece la persona que atendió a?,u204esp,¿En qué se fue (fueron) al lugar dónde lo (la) atendieron?,¿En qué se fue (fueron) al lugar dónde lo (la) atendieron?,u301c,"En total, ¿cuánto pago para llegar hasta ese lugar?",¿Considera que el lugar en donde lo (la) atendieron está…,¿Aproximadamente cuánto tiempo tardó en llegar al lugar en donde lo (la) atendieron? (Horas),¿Aproximadamente cuánto tiempo tardó en llegar al lugar en donde lo (la) atendieron? (Minutos),El tiempo que tardó en llegar al lugar en donde lo (la) atendieron ¿le pareció …,¿Aproximadamente cuánto tiempo tuvo que esperar para que lo atendieran? (Horas),¿Aproximadamente cuánto tiempo tuvo que esperar para que lo atendieran? (Minutos),El tiempo que esperó para que lo (la) atendieran ¿le pareció …,¿Cuánto tiempo duró la consulta? (Horas),¿Cuánto tiempo duró la consulta? (Minutos),"El servicio que le dio la persona que lo (la) atendió,  ¿le pareció …",¿Le cobraron por la atención que recibió?,¿Cuánto le cobraron por la atención?,¿Lo que le cobraron le pareció…,¿Durante la consulta le recetaron medicamentos?,Sobre los medicamentos que le recetaron ¿la persona que lo atendió…,¿Consiguió los medicamentos?,¿Por qué no los consiguió?,u316esp,¿Pagó por los medicamentos?,u317c,¿Lo que pagó le pareció…,"¿En la consulta le pidieron que se hiciera algún examen de laboratorio (sangre, orina)?","¿En la consulta le pidieron que se hiciera algún examen de laboratorio (sangre, orina)?","¿Se hizó los exámenes de laboratorio (sangre, orina) o gabinete (rayos x, ultrasonido, electrocardiograma, tomografía)?","¿Se realizó los exámenes de laboratorio (sangre, orina) o gabinete (rayos x, ultrasonido, electrocardiograma, tomografía)…",u321esp,"¿Pagó por los exámenes de laboratorio (sangre, orina) o gabinete (rayos x, ultrasonido, electrocardiograma, tomografía)?",u322c,¿Lo que pagó le pareció…,"Aparte de lo que ya me dijo, ¿tuvo otros gastos por atenderse o por la atención de …",¿Cuánto gastó en otros gastos médicos?,¿Cuánto gasto en comida/hospedaje?,¿Cuánto gasto en otros gastos?,Después de la última atención que recibió ¿considera que su estado de salud…,"Si tuviera oportunidad de escoger,  ¿regresaría a ese mismo lugar para atenderse?",¿Por qué no regresaría?,¿Por qué no regresaría?,¿Por qué no regresaría?,u402esp,"En general, ¿la calidad de la atención que recibió fue...",¿Por qué le pareció (MUY BUENA O BUENA) la atención que recibió?,¿Por qué le pareció (MUY BUENA O BUENA) la atención que recibió?,¿Por qué le pareció (MUY BUENA O BUENA) la atención que recibió?,u404esp,"¿Por qué le pareció (REGULAR, MALA O MUY MALA) la atención que recibió?","¿Por qué le pareció (REGULAR, MALA O MUY MALA) la atención que recibió?","¿Por qué le pareció (REGULAR, MALA O MUY MALA) la atención que recibió?",u405esp,p_util,Seguro médico del hogar del utilizador,niv_se,niv_se2
1011,11,101103014,101103014.0645,8,1,1,1,1,1,1,6,1,12,26/02/1993,9,4,2,#NULL!,#NULL!,,2,#NULL!,#NULL!,,2,#NULL!,#NULL!,2,14,#NULL!,#NULL!,1,1,1,3,1,6,8,7,#NULL!,#NULL!,#NULL!,0,2,1,1,,2,11,,#NULL!,,10,,10,#NULL!,#NULL!,1,20,#NULL!,#NULL!,,#NULL!,,2,#NULL!,,#NULL!,#NULL!,#NULL!,#NULL!,,#NULL!,#NULL!,,#NULL!,#NULL!,#NULL!,,#NULL!,#NULL!,,62,#NULL!,26 de nov de 05,0101103014.0645.8.261,,,01011-0315,01011-0315-030,MQ261,315,0,0,1,0,0,0,2,1,24,#NULL!,#NULL!,77,#NULL!,#NULL!,GRIPA,1,,1,5,,10,10,,4,#NULL!,#NULL!,0,3,0,30,2,0,3,4,0,15,3,1,20,4,1,1,1,#NULL!,,1,100,3,3,#NULL!,#NULL!,#NULL!,,#NULL!,#NULL!,#NULL!,2,#NULL!,#NULL!,#NULL!,2,1,#NULL!,#NULL!,#NULL!,,2,12,14,#NULL!,,#NULL!,#NULL!,#NULL!,,124,16,2,0
1011,11,101103018,101103018.0647,2,1,1,1,1,1,1,9,2,23,17/11/1981,2,4,11,#NULL!,#NULL!,,11,#NULL!,#NULL!,,#NULL!,#NULL!,#NULL!,2,14,#NULL!,#NULL!,1,2,2,3,3,2,5,7,#NULL!,#NULL!,#NULL!,0,3,1,1,,3,11,,#NULL!,,3,,10,#NULL!,#NULL!,1,11,13,#NULL!,,4,,2,#NULL!,,#NULL!,#NULL!,#NULL!,#NULL!,,#NULL!,#NULL!,,#NULL!,#NULL!,#NULL!,,#NULL!,#NULL!,,62,#NULL!,26 de nov de 05,0101103018.0647.2.261,,,01011-0315,01011-0315-030,MQ261,315,0,0,0,0,0,1,16,1,24,#NULL!,#NULL!,77,#NULL!,#NULL!,"GRIPA, TOS",1,,1,8,,10,3,,1,#NULL!,#NULL!,0,3,0,10,4,6,0,2,0,20,2,1,20,4,1,1,3,#NULL!,,1,200,3,3,#NULL!,#NULL!,#NULL!,,#NULL!,#NULL!,#NULL!,2,#NULL!,#NULL!,#NULL!,2,1,#NULL!,#NULL!,#NULL!,,2,11,12,15,,#NULL!,#NULL!,#NULL!,,248,16,2,0
1011,11,101103022,101103022.0649,6,1,1,1,1,1,1,11,1,7,21/08/1998,3,4,11,#NULL!,#NULL!,,11,#NULL!,#NULL!,,#NULL!,#NULL!, ,2,14,#NULL!,#NULL!,1,1,1,2,2,#NULL!,#NULL!,#NULL!,#NULL!,#NULL!,#NULL!,#NULL!,2,1,1,,5,11,,#NULL!,,3,,10,#NULL!,#NULL!,1,20,#NULL!,#NULL!,,#NULL!,,2,#NULL!,,#NULL!,#NULL!,#NULL!,#NULL!,,#NULL!,#NULL!,,#NULL!,#NULL!,#NULL!,,#NULL!,#NULL!,,62,#NULL!,26 de nov de 05,0101103022.0649.6.261,,,01011-0315,01011-0315-030,MQ261,315,0,0,0,0,0,1,16,1,24,#NULL!,#NULL!,77,#NULL!,#NULL!,GRIPA,1,,1,7,,10,3,,1,#NULL!,#NULL!,777777,2,0,2,5,2,3,2,0,30,2,2,#NULL!,#NULL!,1,1,1,#NULL!,,2,#NULL!,#NULL!,3,#NULL!,#NULL!,#NULL!,,#NULL!,#NULL!,#NULL!,2,#NULL!,#NULL!,#NULL!,2,1,#NULL!,#NULL!,#NULL!,,2,15,#NULL!,#NULL!,,#NULL!,#NULL!,#NULL!,,124,16,2,0
1011,11,101103024,101103024.065,3,1,1,1,1,1,1,12,1,13,09/10/1992,3,4,2,#NULL!,#NULL!,,2,#NULL!,#NULL!,,2,#NULL!,#NULL!,2,14,#NULL!,#NULL!,1,1,1,3,1,6,8,7,#NULL!,#NULL!,#NULL!,100,2,1,1,,2,11,,#NULL!,,4,,10,#NULL!,#NULL!,1,20,#NULL!,#NULL!,,#NULL!,,2,#NULL!,,#NULL!,#NULL!,#NULL!,#NULL!,,#NULL!,#NULL!,,#NULL!,#NULL!,#NULL!,,#NULL!,#NULL!,,62,#NULL!,26 de nov de 05,0101103024.0650.3.261,,,01011-0315,01011-0315-030,MQ261,315,0,0,1,0,0,0,2,1,24,#NULL!,#NULL!,77,#NULL!,#NULL!,GRIPA,1,,1,7,,10,4,,1,#NULL!,#NULL!,0,3,0,10,3,0,15,3,0,25,2,2,#NULL!,#NULL!,1,1,3,#NULL!,,1,220,3,3,#NULL!,#NULL!,#NULL!,,#NULL!,#NULL!,#NULL!,2,#NULL!,#NULL!,#NULL!,2,1,#NULL!,#NULL!,#NULL!,,2,12,15,#NULL!,,#NULL!,#NULL!,#NULL!,,62,2,5,2
1011,11,101103038,101103038.0557,3,1,1,1,1,1,1,7,2,6,04/01/1999,3,4,2,#NULL!,#NULL!,,2,#NULL!,#NULL!,,2,#NULL!,#NULL!,2,14,#NULL!,#NULL!,1,1,1,1,1,#NULL!,#NULL!,#NULL!,#NULL!,#NULL!,#NULL!,#NULL!,3,1,5,,2,11,,#NULL!,,4,,10,#NULL!,#NULL!,1,20,#NULL!,#NULL!,,#NULL!,,2,#NULL!,,#NULL!,#NULL!,#NULL!,#NULL!,,#NULL!,#NULL!,,#NULL!,#NULL!,#NULL!,,#NULL!,#NULL!,,62,#NULL!,26 de nov de 05,0101103038.0557.3.267,,,01011-0992,01011-0992-030,MQ267,992,0,0,1,0,0,0,2,1,24,#NULL!,#NULL!,24,#NULL!,#NULL!,,5,,1,4,,10,4,,1,#NULL!,#NULL!,777777,3,0,20,2,3,0,2,0,15,2,2,#NULL!,#NULL!,1,1,1,#NULL!,,2,#NULL!,#NULL!,3,#NULL!,#NULL!,#NULL!,,#NULL!,#NULL!,#NULL!,2,#NULL!,#NULL!,#NULL!,2,1,#NULL!,#NULL!,#NULL!,,2,8,11,#NULL!,,#NULL!,#NULL!,#NULL!,,62,2,2,0
1011,11,101103040,101103040.0558,2,1,1,1,1,1,1,8,2,40,16/12/1964,2,4,1,2,#NULL!,,11,#NULL!,#NULL!,,2,2,#NULL!,2,14,#NULL!,#NULL!,1,1,2,2,6,1,1,#NULL!,650,3,0,340,2,1,1,,2,11,,#NULL!,,3,,10,#NULL!,#NULL!,1,20,#NULL!,#NULL!,,4,,2,#NULL!,,#NULL!,#NULL!,#NULL!,#NULL!,,#NULL!,#NULL!,,#NULL!,#NULL!,#NULL!,,#NULL!,#NULL!,,62,#NULL!,26 de nov de 05,0101103040.0558.2.267,,,01011-0992,01011-0992-030,MQ267,992,0,1,1,0,0,0,7,1,24,#NULL!,#NULL!,24,#NULL!,#NULL!,,1,,1,4,,10,4,,1,#NULL!,#NULL!,777777,2,0,10,4,3,0,2,0,20,2,2,#NULL!,#NULL!,1,1,1,#NULL!,,2,#NULL!,#NULL!,3,#NULL!,#NULL!,#NULL!,,#NULL!,#NULL!,#NULL!,2,#NULL!,#NULL!,#NULL!,2,1,#NULL!,#NULL!,#NULL!,,2,8,77,#NULL!,ESE MISMO DIA LO ATIENDEN A UNO,#NULL!,#NULL!,#NULL!,,186,7,4,1
1011,11,101103044,101103044.056,3,1,1,1,1,1,1,10,1,7,30/12/1997,3,4,11,#NULL!,#NULL!,,11,#NULL!,#NULL!,,#NULL!,#NULL!,#NULL!,2,14,#NULL!,#NULL!,1,1,1,2,2,#NULL!,#NULL!,#NULL!,#NULL!,#NULL!,#NULL!,#NULL!,2,1,5,,2,11,,#NULL!,,3,,10,#NULL!,#NULL!,1,20,#NULL!,#NULL!,,#NULL!,,2,#NULL!,,#NULL!,#NULL!,#NULL!,#NULL!,,#NULL!,#NULL!,,#NULL!,#NULL!,#NULL!,,#NULL!,#NULL!,,62,#NULL!,26 de nov de 05,0101103044.0560.3.267,,,01011-0992,01011-0992-030,MQ267,992,0,0,0,0,0,1,16,1,24,#NULL!,#NULL!,24,#NULL!,#NULL!,,5,,1,4,,10,3,,1,#NULL!,#NULL!,777777,3,0,20,3,1,0,3,0,15,2,1,40,3,1,2,1,#NULL!,,1,0,3,3,#NULL!,#NULL!,#NULL!,,#NULL!,#NULL!,#NULL!,2,#NULL!,#NULL!,#NULL!,1,1,#NULL!,#NULL!,#NULL!,,2,11,15,#NULL!,,#NULL!,#NULL!,#NULL!,,62,16,2,0
1011,11,101103046,101103046.0561,5,1,1,1,1,1,1,11,1,0,10/06/2005,3,4,11,#NULL!,#NULL!,,11,#NULL!,#NULL!,,#NULL!,#NULL!,#NULL!,2,14,#NULL!,#NULL!,#NULL!,#NULL!,#NULL!,#NULL!,#NULL!,#NULL!,#NULL!,#NULL!,#NULL!,#NULL!,#NULL!,#NULL!,3,1,5,,3,11,,#NULL!,,3,,10,#NULL!,#NULL!,1,20,#NULL!,#NULL!,,#NULL!,,2,#NULL!,,#NULL!,#NULL!,#NULL!,#NULL!,,#NULL!,#NULL!,,#NULL!,#NULL!,#NULL!,,#NULL!,#NULL!,,62,#NULL!,26 de nov de 05,0101103046.0561.5.267,,,01011-0992,01011-0992-030,MQ267,992,0,0,0,0,0,1,16,1,24,#NULL!,#NULL!,24,#NULL!,#NULL!,,5,,1,4,,10,3,,1,#NULL!,#NULL!,777777,3,0,20,3,5,0,2,0,15,2,2,#NULL!,#NULL!,1,4,1,#NULL!,,2,#NULL!,#NULL!,3,#NULL!,#NULL!,#NULL!,,#NULL!,#NULL!,#NULL!,2,#NULL!,#NULL!,#NULL!,3,1,#NULL!,#NULL!,#NULL!,,3,#NULL!,#NULL!,#NULL!,,1,77,#NULL!,NO HABIA FICHAS Y TUVE QUE ESPERAR,62,16,4,1
1011,11,101103050,101103050.0539,3,1,1,1,1,1,1,1,2,9,02/08/1996,3,4,2,#NULL!,#NULL!,,11,#NULL!,#NULL!,,7,#NULL!,#NULL!,2,14,#NULL!,#NULL!,1,1,1,2,4,#NULL!,#NULL!,#NULL!,#NULL!,#NULL!,#NULL!,#NULL!,3,2,#NULL!,,#NULL!,#NULL!,,#NULL!,,#NULL!,,10,#NULL!,#NULL!,1,20,#NULL!,#NULL!,,#NULL!,,2,#NULL!,,#NULL!,#NULL!,#NULL!,#NULL!,,#NULL!,#NULL!,,#NULL!,#NULL!,#NULL!,,#NULL!,#NULL!,,62,#NULL!,26 de nov de 05,0101103050.0539.3.322,,,01011-0106,01011-0106-030,MQ322,106,0,0,1,0,0,0,2,1,24,#NULL!,#NULL!,24,#NULL!,#NULL!,,1,,1,4,,10,4,,1,#NULL!,#NULL!,777777,2,0,10,5,3,0,1,0,20,1,2,#NULL!,#NULL!,2,#NULL!,#NULL!,#NULL!,,#NULL!,#NULL!,#NULL!,3,#NULL!,#NULL!,#NULL!,,#NULL!,#NULL!,#NULL!,2,#NULL!,#NULL!,#NULL!,2,1,#NULL!,#NULL!,#NULL!,,2,8,#NULL!,#NULL!,,#NULL!,#NULL!,#NULL!,,372,16,2,0
1011,11,101103052,101103052.054,1,1,1,1,1,1,1,2,1,41,12/05/1964,1,4,1,#NULL!,#NULL!,,11,#NULL!,#NULL!,,1,#NULL!,#NULL!,2,14,#NULL!,#NULL!,1,1,2,2,4,2,6,7,#NULL!,#NULL!,#NULL!,1000,3,2,#NULL!,,#NULL!,#NULL!,,#NULL!,,#NULL!,,10,#NULL!,#NULL!,1,20,#NULL!,#NULL!,,4,,2,#NULL!,,#NULL!,#NULL!,#NULL!,#NULL!,,#NULL!,#NULL!,,#NULL!,#NULL!,#NULL!,,#NULL!,#NULL!,,62,#NULL!,26 de nov de 05,0101103052.0540.1.322,,,01011-0106,01011-0106-030,MQ322,106,0,1,0,0,0,0,1,1,24,#NULL!,#NULL!,24,#NULL!,#NULL!,,26,,1,7,,10,2,,6,#NULL!,#NULL!,10,2,0,15,4,0,30,3,0,15,2,2,#NULL!,#NULL!,2,#NULL!,#NULL!,#NULL!,,#NULL!,#NULL!,#NULL!,2,#NULL!,1,1,,2,#NULL!,#NULL!,2,#NULL!,#NULL!,#NULL!,2,1,#NULL!,#NULL!,#NULL!,,2,11,17,#NULL!,,#NULL!,#NULL!,#NULL!,,62,16,2,0
1011,11,101103056,101103056.0542,4,1,1,1,1,1,1,4,1,5,24/06/2000,3,4,1,#NULL!,#NULL!,,1,#NULL!,#NULL!,,2,#NULL!,#NULL!,2,14,#NULL!,#NULL!,1,1,1,1,2,#NULL!,#NULL!,#NULL!,#NULL!,#NULL!,#NULL!,#NULL!,3,1,5,,2,1,,77,LES PROPONEN HACER EL ASEO DEL CENTRO DE SALUD PARA SER ATEN,#NULL!,,10,#NULL!,#NULL!,1,20,#NULL!,#NULL!,,#NULL!,,2,#NULL!,,#NULL!,#NULL!,#NULL!,#NULL!,,#NULL!,#NULL!,,#NULL!,#NULL!,#NULL!,,#NULL!,#NULL!,,62,#NULL!,26 de nov de 05,0101103056.0542.4.263,,,01011-0106,01011-0106-030,MQ263,106,0,1,0,0,0,0,1,2,4,#NULL!,#NULL!,13,14,#NULL!,,64,,#NULL!,4,,10,3,,1,#NULL!,#NULL!,777777,2,0,10,4,2,30,1,0,15,2,2,#NULL!,#NULL!,2,#NULL!,#NULL!,#NULL!,,#NULL!,#NULL!,#NULL!,3,#NULL!,#NULL!,#NULL!,,#NULL!,#NULL!,#NULL!,2,#NULL!,#NULL!,#NULL!,2,2,9,77,#NULL!,SON GROSEROS Y SE MOLESTAN,2,77,#NULL!,#NULL!,HAY ALGUNAS ENFERMERAS QUE LOS TRATAN BIEN,#NULL!,#NULL!,#NULL!,,310,1,5,2
1011,11,101103058,101103058.0543,5,1,1,1,1,1,1,5,1,3,07/02/2002,3,4,1,#NULL!,#NULL!,,1,#NULL!,#NULL!,,2,#NULL!,#NULL!,2,14,#NULL!,#NULL!,#NULL!,#NULL!,#NULL!,#NULL!,#NULL!,#NULL!,#NULL!,#NULL!,#NULL!,#NULL!,#NULL!,#NULL!,3,2,#NULL!,,#NULL!,#NULL!,,#NULL!,,#NULL!,,10,#NULL!,#NULL!,1,20,#NULL!,#NULL!,,#NULL!,,2,#NULL!,,#NULL!,#NULL!,#NULL!,#NULL!,,#NULL!,#NULL!,,#NULL!,#NULL!,#NULL!,,#NULL!,#NULL!,,62,#NULL!,26 de nov de 05,0101103058.0543.5.322,,,01011-0106,01011-0106-030,MQ322,106,0,1,0,0,0,0,1,1,24,#NULL!,#NULL!,24,#NULL!,#NULL!,,5,,1,5,,10,10,,6,#NULL!,#NULL!,30,3,0,20,4,0,5,4,0,20,2,1,150,3,1,1,3,#NULL!,,1,200,3,3,#NULL!,#NULL!,#NULL!,,#NULL!,#NULL!,#NULL!,2,#NULL!,#NULL!,#NULL!,1,1,#NULL!,#NULL!,#NULL!,,1,4,11,17,,#NULL!,#NULL!,#NULL!,,62,1,2,0
1011,11,101103066,101103066.0547,3,1,1,1,1,1,1,9,2,60,10/05/1945,12,4,1,#NULL!,#NULL!,,1,#NULL!,#NULL!,,2,#NULL!,#NULL!,2,14,#NULL!,#NULL!,2,2,2,0,#NULL!,5,7,7,#NULL!,#NULL!,#NULL!,0,3,1,11,,4,7,,#NULL!,,4,,1,#NULL!,#NULL!,1,20,#NULL!,#NULL!,,4,,1,2,,2,1,15,4,,2,3,,2,2,#NULL!,,#NULL!,#NULL!,,62,#NULL!,26 de nov de 05,0101103066.0547.3.263,,,01011-0106,01011-0106-030,MQ263,106,0,1,0,0,0,0,1,1,24,#NULL!,#NULL!,11,12,#NULL!,,11,,6,1,,9,11,,#NULL!,#NULL!,#NULL!,#NULL!,#NULL!,#NULL!,#NULL!,#NULL!,0,0,#NULL!,#NULL!,#NULL!,3,2,#NULL!,#NULL!,2,#NULL!,#NULL!,#NULL!,,#NULL!,#NULL!,#NULL!,3,#NULL!,#NULL!,#NULL!,,#NULL!,#NULL!,#NULL!,2,#NULL!,#NULL!,#NULL!,3,3,4,#NULL!,#NULL!,,3,#NULL!,#NULL!,#NULL!,,15,#NULL!,#NULL!,,186,7,2,0
1011,11,101103070,101103070.0549,2,1,1,1,1,1,1,11,2,19,25/07/1986,3,4,11,#NULL!,#NULL!,,11,#NULL!,#NULL!,,#NULL!,#NULL!,#NULL!,2,14,#NULL!,#NULL!,1,1,2,2,3,6,5,7,#NULL!,#NULL!,#NULL!,0,3,1,1,,4,11,,#NULL!,,3,,10,#NULL!,#NULL!,1,20,#NULL!,#NULL!,,4,,2,#NULL!,,#NULL!,#NULL!,#NULL!,#NULL!,,#NULL!,#NULL!,,#NULL!,#NULL!,#NULL!,,#NULL!,#NULL!,,62,#NULL!,26 de nov de 05,0101103070.0549.2.263,,,01011-0106,01011-0106-030,MQ263,106,0,0,0,0,0,1,16,1,24,#NULL!,#NULL!,24,#NULL!,#NULL!,,84,"FIEBRE, VOMITO Y DOLOR DE COSTILLA",#NULL!,4,,10,3,,1,#NULL!,#NULL!,30,2,0,5,2,5,0,1,0,10,3,1,30,4,1,1,1,#NULL!,,1,30,4,3,#NULL!,#NULL!,#NULL!,,#NULL!,#NULL!,#NULL!,2,#NULL!,#NULL!,#NULL!,2,2,77,#NULL!,#NULL!,LE HICIERON ESPERAR 5 HRS,3,#NULL!,#NULL!,#NULL!,,2,17,#NULL!,,186,16,2,0
1011,11,101103072,101103072.055,2,1,1,1,1,1,1,12,2,19,26/08/1986,2,4,2,#NULL!,#NULL!,,11,#NULL!,#NULL!,,5,#NULL!,#NULL!,2,14,#NULL!,#NULL!,1,1,2,3,3,1,5,7,#NULL!,#NULL!,#NULL!,0,2,1,1,,4,1,,8,,#NULL!,,10,#NULL!,#NULL!,1,20,#NULL!,#NULL!,,4,,2,#NULL!,,#NULL!,#NULL!,#NULL!,#NULL!,,#NULL!,#NULL!,,#NULL!,#NULL!,#NULL!,,#NULL!,#NULL!,,62,#NULL!,26 de nov de 05,0101103072.0550.2.263,,,01011-0106,01011-0106-030,MQ263,106,0,0,1,0,0,0,2,1,24,#NULL!,#NULL!,24,#NULL!,#NULL!,,81,,#NULL!,5,,10,4,,1,#NULL!,#NULL!,777777,2,15,0,4,3,0,2,0,20,2,2,#NULL!,#NULL!,1,1,6,7,,#NULL!,#NULL!,#NULL!,3,#NULL!,#NULL!,#NULL!,,#NULL!,#NULL!,#NULL!,2,#NULL!,#NULL!,#NULL!,2,1,#NULL!,#NULL!,#NULL!,,2,17,#NULL!,#NULL!,,#NULL!,#NULL!,#NULL!,,124,2,2,0
1012,12,101203002,101203002.0627,2,1,1,1,2,1,1,1,2,56,14/07/1949,2,4,4,#NULL!,#NULL!,,4,#NULL!,#NULL!,,2,#NULL!,#NULL!,2,14,#NULL!,#NULL!,1,1,2,2,6,2,5,7,#NULL!,#NULL!,#NULL!,0,3,2,#NULL!,,#NULL!,#NULL!,,#NULL!,,#NULL!,,10,#NULL!,#NULL!,1,12,#NULL!,#NULL!,,4,,2,#NULL!,,#NULL!,#NULL!,#NULL!,#NULL!,,#NULL!,#NULL!,,#NULL!,#NULL!,#NULL!,,#NULL!,#NULL!,,243,#NULL!,25 de nov de 05,0101203002.0627.2.266,,,01012-0292,01012-0292-030,MQ266,292,0,0,0,1,0,0,3,1,1,#NULL!,#NULL!,24,#NULL!,#NULL!,,61,,#NULL!,8,,12,13,,6,#NULL!,#NULL!,60,3,2,0,3,0,15,3,0,5,2,2,#NULL!,#NULL!,2,#NULL!,#NULL!,#NULL!,,#NULL!,#NULL!,#NULL!,3,#NULL!,#NULL!,#NULL!,,#NULL!,#NULL!,#NULL!,2,#NULL!,#NULL!,#NULL!,2,1,#NULL!,#NULL!,#NULL!,,2,8,11,#NULL!,,#NULL!,#NULL!,#NULL!,,486,8,8,3
1012,12,101203006,101203006.0629,2,1,1,1,2,1,1,3,2,63,08/02/1942,2,4,1,#NULL!,#NULL!,,1,#NULL!,#NULL!,,6,#NULL!,#NULL!,2,14,#NULL!,#NULL!,2,2,2,0,#NULL!,2,8,7,#NULL!,#NULL!,#NULL!,0,3,1,26,,1,11,,#NULL!,,2,,10,#NULL!,#NULL!,1,3,#NULL!,#NULL!,,#NULL!,,2,#NULL!,,#NULL!,#NULL!,#NULL!,#NULL!,,#NULL!,#NULL!,,#NULL!,#NULL!,#NULL!,,#NULL!,#NULL!,,243,#NULL!,25 de nov de 05,0101203006.0629.2.261,,,01012-0292,01012-0292-030,MQ261,292,0,1,0,0,0,0,1,1,24,#NULL!,#NULL!,12,#NULL!,#NULL!,,26,,6,8,,10,2,,6,#NULL!,#NULL!,100,2,0,30,2,0,30,3,0,20,2,2,#NULL!,#NULL!,1,1,1,#NULL!,,2,#NULL!,#NULL!,3,#NULL!,#NULL!,#NULL!,,#NULL!,#NULL!,#NULL!,2,#NULL!,#NULL!,#NULL!,3,1,#NULL!,#NULL!,#NULL!,,3,#NULL!,#NULL!,#NULL!,,13,16,#NULL!,,729,16,4,1
1012,12,101203014,101203014.0633,4,1,1,1,2,1,1,7,2,9,19/04/1996,9,2,11,#NULL!,#NULL!,,11,#NULL!,#NULL!,,#NULL!,#NULL!,#NULL!,2,14,#NULL!,#NULL!,1,1,1,2,3,#NULL!,#NULL!,#NULL!,#NULL!,#NULL!,#NULL!,#NULL!,3,1,5,,2,11,,#NULL!,,10,,10,#NULL!,#NULL!,1,20,#NULL!,#NULL!,,#NULL!,,2,#NULL!,,#NULL!,#NULL!,#NULL!,#NULL!,,#NULL!,#NULL!,,#NULL!,#NULL!,#NULL!,,#NULL!,#NULL!,,243,#NULL!,25 de nov de 05,0101203014.0633.4.267,,,01012-0292,01012-0292-030,MQ267,292,0,0,0,0,0,1,16,1,24,#NULL!,#NULL!,24,#NULL!,#NULL!,,5,,1,5,,10,10,,4,#NULL!,#NULL!,100,3,0,30,3,0,0,#NULL!,#NULL!,#NULL!,2,1,50,4,1,1,1,#NULL!,,1,260,3,3,#NULL!,#NULL!,#NULL!,,#NULL!,#NULL!,#NULL!,2,#NULL!,#NULL!,#NULL!,1,1,#NULL!,#NULL!,#NULL!,,2,1,12,16,,#NULL!,#NULL!,#NULL!,,243,16,2,0
1012,12,101203024,101203024.0638,1,1,1,1,2,1,1,12,1,70,30/11/1934,1,4,1,#NULL!,#NULL!,,11,#NULL!,#NULL!,,1,#NULL!,#NULL!,2,14,#NULL!,#NULL!,1,1,2,2,3,2,6,7,#NULL!,#NULL!,#NULL!,1500,3,2,#NULL!,,#NULL!,#NULL!,,#NULL!,,#NULL!,,10,#NULL!,#NULL!,1,3,12,#NULL!,,#NULL!,,2,#NULL!,,#NULL!,#NULL!,#NULL!,#NULL!,,#NULL!,#NULL!,,#NULL!,#NULL!,#NULL!,,#NULL!,#NULL!,,243,#NULL!,25 de nov de 05,0101203024.0638.1.261,,,01012-0292,01012-0292-030,MQ261,292,0,1,0,0,0,0,1,1,24,#NULL!,#NULL!,12,#NULL!,#NULL!,,26,,6,8,,10,2,,6,#NULL!,#NULL!,20,3,0,40,2,3,0,2,0,30,3,2,#NULL!,#NULL!,1,1,1,#NULL!,,2,#NULL!,#NULL!,3,#NULL!,#NULL!,#NULL!,,#NULL!,#NULL!,#NULL!,2,#NULL!,#NULL!,#NULL!,3,1,#NULL!,#NULL!,#NULL!,,2,2,11,16,,#NULL!,#NULL!,#NULL!,,243,1,2,0