Folio consecutivo,N�mero de Integrante,Integrante seleccionado para cuestionario de Utilizadores de salud,Entidad Federativa,Municipio,Localidad,Sexo,Edad,"En las �ltimas dos semanas, �usted solicit� o recibi� consulta (que no haya requerido hospitalizaci�n) por enfermedad, control de la misma, lesi�n o accidente?","En las �ltimas dos semanas, el principal motivo por el que busc� consulta fue:",ESPECIFIQUE:,�Cu�ndo comenz� el episodio de enfermedad por el que acudi� a consulta?,�Recibi� atenci�n por este motivo?,�Por qu� no la recibi�?,ESPECIFIQUE:,�En d�nde se atendi�?,ESPECIFIQUE,�Qu� persona lo(la) atendi�?,ESPECIFIQUE:,"El servicio que le dio la persona que lo(la) atendi�, �le pareci� ...",�Por qu� motivos se atendi� en este lugar?     Tiene afiliaci�n,�Por qu� motivos se atendi� en este lugar?     Est� cerca,�Por qu� motivos se atendi� en este lugar?     Es barato/No cuesta,�Por qu� motivos se atendi� en este lugar?     Conoce al m�dico/yerbero/curandera/partera,�Por qu� motivos se atendi� en este lugar?     Le gusta como lo(la) atienden,�Por qu� motivos se atendi� en este lugar?     Le atienden r�pido,�Por qu� motivos se atendi� en este lugar?     Otro,�Por qu� motivos se atendi� en este lugar?     NS/NR,ESPECIFIQUE:,�Tuvo usted oportunidad de elegir el lugar donde se atendi�?,�Su consulta fue programada mediante cita?,"En su opini�n, �el tiempo que pas� desde que solicito la cita hasta que lo atendieron fue...","En total, �cu�nto pag� para llegar hasta el sitio en que lo atendieron?",Aproximadamente �cu�nto tiempo tard� en llegar al lugar en donde lo(la) atendieron? HORAS,Aproximadamente �cu�nto tiempo tard� en llegar al lugar en donde lo(la) atendieron? MINUTOS, El tiempo que tard� en llegar al lugar en donde lo(la) atendieron �le pareci�...,�Considera usted que el lugar en donde lo(la) atendieron est�...,"Una vez en el lugar de atenci�n, �cu�nto tiempo aproximadamente tuvo que esperar para que lo(la) atendieran? HORAS","Una vez en el lugar de atenci�n, �cu�nto tiempo aproximadamente tuvo que esperar para que lo(la) atendieran? MINUTOS", El tiempo que esper� usted para que lo(la) atendieran �le pareci� ...,�Cu�nto tiempo dur� la consulta? HORAS,�Cu�nto tiempo dur� la consulta? MINUTOS,�Le cobraron por la atenci�n que recibi�?,�Cu�nto le cobraron?, �Cu�ntos medicamentos le recetaron en la consulta?,Sobre los medicamentos que le recetaron �la persona que lo(la) atendi�..., �Consigui� todos los medicamentos,�D�nde los consigui�?,�Por qu� no lo(s) consigui�?,ESPECIFIQUE:,�Cu�nto pag� por los medicamentos que consigui�?,"�En la consulta le pidieron que se hiciera alg�n examen de laboratorio (en sangre u orina) o gabinete (rayos x, ultrasonido, electrocardiograma, tomograf�a)?","�Se hizo los ex�menes de laboratorio (sangre, orina) o gabinete (rayos x, ultrasonido, electrocardiograma, tomograf�a) que le solicitaron?","�D�nde se realiz� los ex�menes de laboratorio (sangre, orina) o gabinete (rayos x, ultrasonido, electrocardiograma, tomograf�a) que le solicitaron?",ESPECIFIQUE:,�Cu�nto pag� por los ex�menes de laboratorio o gabinete que realiz�?,"Aparte de lo que ya me dijo, �tuvo otros gastos por atenderse o por la atenci�n?",�En qu� y cu�nto gast� en Otros gastos m�dicos?,�En qu� y cu�nto gast� en Comida/hospedaje?,�En qu� y cu�nto gast� en Otros gastos?,Despu�s de la �ltima atenci�n que recibi� �considera que su estado de salud...,"Si tuviera oportunidad de escoger, regresar�a a ese mismo lugar para atenderse?",�Por qu� s� regresar�a?     No tiene otra opci�n,�Por qu� s� regresar�a?     La(lo) tratan bien,�Por qu� s� regresar�a?     La(lo) atienden bien,�Por qu� s� regresar�a?     No tiene que pagar,�Por qu� s� regresar�a?     Queda cerca de su casa,�Por qu� s� regresar�a?     Es barato,�Por qu� s� regresar�a?     Le atienden r�pido,�Por qu� s� regresar�a?     Le dieron los medicamentos,�Por qu� s� regresar�a?     El tiempo de espera fue corto,�Por qu� s� regresar�a?     El lugar estaba limpio,�Por qu� s� regresar�a?     El m�dico me explic� sobre mi enfermedad y tratamiento,�Por qu� s� regresar�a?     Otro,�Por qu� s� regresar�a?     NS/NR,ESPECIFIQUE:,�Por qu� no regresar�a?     Lo(la) trataron mal,�Por qu� no regresar�a?     No estuvo de acuerdo con el diagn�stico,�Por qu� no regresar�a?     No estuvo de acuerdo con el tratamiento,�Por qu� no regresar�a?     No mejor�,�Por qu� no regresar�a?     Era caro el servicio,�Por qu� no regresar�a?     Estaba lejos de su casa,�Por qu� no regresar�a?     No hab�a medicamentos,�Por qu� no regresar�a?     No hab�a materiales,�Por qu� no regresar�a?     No dejaron entrar a sus familiares,�Por qu� no regresar�a?     El tiempo de espera era largo,�Por qu� no regresar�a?     El lugar estaba sucio,�Por qu� no regresar�a?     El m�dico no me explic� sobre mi enfermedad y tratamiento,�Por qu� no regresar�a?     Otro,�Por qu� no regresar�a?     NS/NR,ESPECIFIQUE:,�La persona que le dio la consulta le dijo claramente cu�l era su enfermedad?,"Con relaci�n a su tratamiento, �la persona que le dio la consulta...",�En qu� condiciones usted considera que se encuentra el lugar donde se atendi�?,UPM,Estrato de Dise�o,Estrato de Urbanidad,Estrato de Marginalidad,Ponderador, Estrato para calcular varianzas
10001,3,1,1,1,1,1,19,1,39, ,2,1, , ,1, ,6, ,1,1,0,0,0,0,1,0,0, ,1,1,4,7777,0,10,4,2,0,40,2,0,20,2, ,2,1,1,1, , , ,1,1,2, ,0,2, , , ,1,1,0,1,1,0,0,0,1,0,0,0,0,0,0, , , , , , , , , , , , , , , , ,1,1,5,M0101,5,3,1,536.830613,15
10006,1,1,1,1,1,1,62,1,13, ,6,1, , ,1, ,5, ,4,1,0,0,0,0,0,0,0, ,2,1,2,20,0,10,5,1,1,0,1,0,10,2, ,14,1,1,1, , , ,1,1,1, ,0,2, , , ,3,1,1,0,0,1,0,0,0,0,0,0,0,0,0, , , , , , , , , , , , , , , , ,2,1,4,M0101,5,3,1,319.528383,15
10006,2,1,1,1,1,2,60,1,13, ,6,1, , ,1, ,5, ,2,1,0,0,0,0,0,0,0, ,2,1,2,20,0,10,4,2,1,0,2,0,15,2, ,4,1,1,1, , , ,2, , , , ,2, , , ,2,1,0,0,1,0,0,0,0,0,0,0,0,0,0, , , , , , , , , , , , , , , , ,1,1,4,M0101,5,3,1,377.32003,15
10011,3,1,1,1,1,2,33,2, , , , , , , , , , , , , , , , , , , , , , , , , , , , , , , , , , , , , , , , , , , , , , , , , , , , , , , , , , , , , , , , , , , , , , , , , , , , , , , , , , , , , ,M0101,5,3,1,418.570103,15
10014,2,1,1,1,1,2,3,1,77,INFECCION EN EL ESTOMAGO,1,1, , ,1, ,5, ,2,0,0,1,0,0,0,0,0, ,2,2, ,12,0,30,3,2,0,40,3,0,15,2, ,3,1,1,1, , , ,2, , , , ,1,40,9999,9999,2,1,0,0,1,0,0,0,0,0,0,0,0,0,0, , , , , , , , , , , , , , , , ,1,1,4,M0101,5,3,1,428.177889,15
10017,3,1,1,1,1,2,22,1,4, ,1,1, , ,9, ,5, ,1,0,0,0,0,0,0,1,0,PORQUE YA SABIA QUE NO LA ATENDERIAN RAPIDO EN EL CENTRO DE SALUD Y NO TENDRIAN LAS MEDICINAS,1,2, ,7777,0,15,4,2,0,10,4,0,10,1,30,3,1,1,1, , , ,2, , , , ,2, , , ,2,1,0,0,1,0,0,0,0,0,0,0,1,0,0, , , , , , , , , , , , , , , , ,1,1,1,M0101,5,3,1,454.214824,15
10023,1,1,1,1,1,2,42,1,77,DOLOR EN LAS COSTILLAS Y EL ESTOMAGO,4,1, , ,7, ,5, ,1,1,0,0,0,1,0,0,0, ,2,2, ,7777,0,15,2,4,4,0,3,0,25,2, ,3,1,1,1, , , ,1,2, , , ,2, , , ,3,1,0,0,1,1,0,0,0,0,0,0,1,0,0, , , , , , , , , , , , , , , , ,1,1,4,M0101,5,3,1,418.570103,15
10037,2,1,1,1,1,2,51,1,33, ,3,1, , ,7, ,6, ,2,0,0,1,0,0,0,0,0, ,2,2, ,9999,0,30,4,3,3,0,1,2,0,2, ,3,1,3, ,1, ,1200,1,1,1, ,0,2, , , ,3,1,1,0,0,0,0,0,0,0,0,0,0,0,0, , , , , , , , , , , , , , , , ,1,1,4,M0101,5,3,1,418.570103,15
10046,1,1,1,1,1,1,63,1,77,CHEKEO,6,1, , ,77,SE GURO PRIBADO,6, ,1,1,0,0,0,0,0,0,0, ,1,1,5,7,0,15,5,1,0,1,5,0,10,2, ,2,1,1,1, , , ,2, , , , ,2, , , ,2,1,0,1,1,0,1,0,1,1,0,0,0,0,0, , , , , , , , , , , , , , , , ,1,1,5,M0102,5,3,1,207.982399,15
10046,2,1,1,1,1,2,61,1,77,CHEKEO,6,1, , ,77,SERGURO BANCARIO,6, ,5,1,0,0,0,0,0,0,0, ,1,1,3,7,0,15,4,1,0,1,5,0,15,2, ,2,1,1,1, , , ,1,2, , , ,2, , , ,3,1,0,1,1,0,0,0,0,1,1,0,0,0,0, , , , , , , , , , , , , , , , ,1,1,5,M0102,5,3,1,245.599231,15
10051,2,1,1,1,1,2,55,1,9, ,1,1, , ,7, ,5, ,1,0,1,0,0,0,0,0,0, ,1,2, ,6,0,40,2,2,0,30,3,0,30,2, ,4,1,1,3, , , ,2, , , , ,2, , , ,1,1,0,1,0,0,0,0,0,0,0,0,0,0,0, , , , , , , , , , , , , , , , ,1,1,3,M0102,5,3,1,231.475117,15
10053,2,1,1,1,1,2,55,1,77,TENDONITIS EN EL BRAZO,1,1, , ,10, ,6, ,1,0,0,0,0,0,0,1,0,SELO RECOMENDARON Y ES ESPECIALISTA,1,1,3,7777,0,10,4,3,0,15,4,1,0,1,1500,3,1,1,3, , , ,1,1,2, ,500,2, , , ,2,1,0,0,0,0,0,0,0,0,0,1,1,0,0, , , , , , , , , , , , , , , , ,1,1,4,M0102,5,3,1,462.950233,15
10054,3,1,1,1,1,2,26,1,4, ,1,1, , ,10, ,5, ,1,0,0,0,0,0,1,0,0, ,1,2, ,7777,0,10,1,2,0,1,4,0,30,1,150,3,1,1,3, , , ,2, , , , ,2, , , ,1,1,0,1,0,0,0,0,0,0,0,0,1,0,0, , , , , , , , , , , , , , , , ,2,1,5,M0102,5,3,1,251.187146,15
10057,2,1,1,1,1,2,51,1,77,PITRIASIS ROSADA  DE GILBERT,1,1, , ,10, ,77,DERMATOLOGA,1,0,1,0,1,0,0,0,0, ,1,1,3,7777,0,15,4,2,0,10,4,0,25,1,500,6,1,1,3, , , ,2, , , , ,2, , , ,2,1,0,1,1,0,1,0,0,0,0,0,1,0,0, , , , , , , , , , , , , , , , ,1,1,5,M0102,5,3,1,231.475117,15
10062,3,1,1,1,1,2,1,1,77,INFEECCION ESTOMACAL,1,1, , ,9, ,5, ,1,0,1,1,0,0,0,0,0, ,2,2, ,7777,0,10,3,2,0,20,3,0,10,2, ,3,1,1,1, , , ,2, , , , ,2, , , ,2,1,1,0,0,0,1,0,0,0,0,0,0,0,0, , , , , , , , , , , , , , , , ,2,1,3,M0102,5,3,1,278.70283,15
10069,5,1,1,1,1,2,17,1,4, ,1,1, , ,4, ,5, ,1,1,0,0,1,0,0,0,0, ,2,2, ,7777,0,10,4,2,0,20,4,0,25,2, ,1,1,1,1, , , ,2, , , , ,2, , , ,2,1,0,1,0,0,0,0,0,1,0,0,1,0,0, , , , , , , , , , , , , , , , ,1,1,5,M0102,5,3,1,251.187146,15
10070,2,1,1,1,1,2,58,1,77,GINECOLOGO,1,1, , ,1, ,6, ,2,1,0,0,0,0,0,0,0, ,2,1,3,20,0,10,3,3,2,30,1,0,15,2, ,2,1,1,1, , , ,2, , , , ,2, , , ,2,1,1,0,0,0,0,0,0,0,0,0,1,0,0, , , , , , , , , , , , , , , , ,1,1,4,M0102,5,3,1,245.599231,15
10074,2,1,1,1,1,2,71,1,12, ,6,1, , ,1, ,5, ,2,1,0,0,0,0,0,0,0, ,2,1,3,7777,0,15,3,3,0,15,3,0,20,2, ,3,1,1,1, , , ,1,1,1, ,0,1,500,9999,9999,2,1,0,1,1,0,0,0,0,0,0,0,0,0,0, , , , , , , , , , , , , , , , ,1,1,3,M0102,5,3,1,289.073338,15
10077,1,1,1,1,1,1,82,1,77,CONSULTA MEDICA PROGRAMADA Y CONTROL DE LA HIPERTENSION,1,1, , ,2, ,6, ,2,1,0,0,0,0,0,0,0, ,1,1,3,7777,0,15,4,2,0,45,2,0,30,2, ,2,1,1,1, , , ,1,2, , , ,2, , , ,2,1,0,0,1,0,0,0,0,1,0,0,0,0,0, , , , , , , , , , , , , , , , ,1,1,3,M0102,5,3,1,207.982399,15
10080,2,1,1,1,1,2,57,1,1, ,1,1, , ,1, ,5, ,2,1,0,0,0,0,0,0,0, ,2,1,3,24,0,20,3,3,2,0,2,0,20,2, ,5,1,1,1, , , ,2, , , , ,2, , , ,2,1,0,1,0,1,0,0,0,1,0,0,0,0,0, , , , , , , , , , , , , , , , ,1,1,3,M0102,5,3,1,245.599231,15
10081,3,1,1,1,1,1,5,1,4, ,1,1, , ,10, ,6, ,1,0,0,0,0,0,1,0,0, ,1,1,3,7777,0,10,4,2,0,1,4,0,30,1,300,6,1,1,3, , , ,1,1,2, ,200,2, , , ,2,1,0,1,0,0,0,0,1,0,0,0,1,0,0, , , , , , , , , , , , , , , , ,1,1,4,M0102,5,3,1,271.538618,15
10081,4,1,1,1,1,2,2,1,4, ,1,1, , ,10, ,6, ,2,0,1,0,0,0,0,0,0, ,1,1,3,7777,0,10,4,2,0,1,4,0,30,1,300,6,1,1,3, , , ,1,1,2, ,200,2, , , ,2,1,0,1,1,0,1,0,0,1,0,0,0,0,0, , , , , , , , , , , , , , , , ,2,1,5,M0102,5,3,1,278.70283,15
10085,1,1,1,1,1,1,48,1,8, ,6,1, , ,9, ,5, ,2,0,0,1,0,1,0,0,0, ,1,2, ,7777,0,10,5,1,0,15,3,0,10,2, ,2,1,1,1, , , ,2, , , , ,2, , , ,2,1,0,0,0,1,1,0,0,0,0,0,0,0,0, , , , , , , , , , , , , , , , ,1,1,4,M0103,5,3,1,290.531372,15
10085,2,1,1,1,1,2,47,1,1, ,1,1, , ,10, ,5, ,2,0,1,0,0,0,1,0,0, ,2,2, ,7777,0,5,5,2,0,10,3,0,20,1,200,3,1,1,3, , , ,2, , , , ,2, , , ,2,1,0,0,0,0,1,0,1,0,0,0,0,0,0, , , , , , , , , , , , , , , , ,1,1,4,M0103,5,3,1,265.759639,15
10101,2,1,1,1,1,2,36,1,33, ,2,1, , ,1, ,5, ,2,1,0,0,0,0,0,0,0, ,2,2, ,50,0,15,4,2,1,0,1,0,15,2, ,2,4,1,1, , , ,2, , , , ,2, , , ,3,1,1,0,0,0,0,0,0,0,0,0,0,1,0,POR QUE ES OBLIGACION DEL SEGURO SOCIAL QUE LA ATIENDAN YA QUE POR ESO PAGA EL SERVICIO, , , , , , , , , , , , , , , ,1,1,4,M0103,5,3,1,312.802388,15
10112,2,1,1,1,1,2,61,1,13, ,6,1, , ,1, ,5, ,1,1,1,0,0,0,1,0,0, ,2,1,3,7777,0,20,4,2,0,15,4,0,20,2, ,4,1,1,1, , , ,1,2, , , ,2, , , ,3,1,0,1,1,0,0,0,0,0,0,0,0,0,0, , , , , , , , , , , , , , , , ,1,1,5,M0103,5,3,1,563.951443,15
10113,2,1,1,1,1,2,75,1,7, ,6,1, , ,10, ,6, ,2,1,0,0,1,1,0,0,0, ,1,1,3,64,0,10,4,2,0,30,4,0,30,1,500,2,1,1,3, , , ,2, , , , ,2, , , ,2,1,0,0,1,0,1,0,0,0,0,0,0,0,0, , , , , , , , , , , , , , , , ,1,1,4,M0103,5,3,1,281.975721,15
10115,1,1,1,1,1,2,78,1,22, ,6,1, , ,10, ,5, ,1,0,0,0,0,0,1,0,0, ,1,2, ,7777,0,30,3,4,0,20,3,0,10,1,300,4,1,1,3, , , ,2, , , , ,2, , , ,2,1,0,0,1,0,0,0,0,0,0,0,1,0,0, , , , , , , , , , , , , , , , ,1,1,4,M0103,5,3,1,281.975721,15
10117,1,1,1,1,1,1,42,1,16, ,6,1, , ,1, ,5, ,2,1,1,1,0,0,0,0,0, ,1,1,4,7777,0,20,3,3,0,30,2,0,10,2, ,4,1,1,1, , , ,1,1,1, ,0,2, , , ,2,1,0,0,0,1,0,0,0,0,0,0,1,0,0, , , , , , , , , , , , , , , , ,1,1,4,M0103,5,3,1,290.531372,15
10117,2,1,1,1,1,2,44,1,13, ,5,1, , ,1, ,5, ,3,1,0,1,0,0,0,0,0, ,2,1,2,60,0,20,3,3,0,40,2,0,20,2, ,7,4,1,1, , , ,1,1,1, ,0,2, , , ,3,1,1,0,0,1,0,0,0,1,0,0,0,0,0, , , , , , , , , , , , , , , , ,2,1,4,M0103,5,3,1,265.759639,15
10121,1,1,1,1,1,1,69,1,13, ,6,1, , ,2, ,5, ,3,1,0,0,0,0,0,0,0, ,1,1,3,20,0,7,3,3,0,15,3,0,5,2, ,4,1,2, ,1, , ,2, , , , ,2, , , ,2,1,1,0,0,0,0,0,0,0,0,0,0,0,0, , , , , , , , , , , , , , , , ,1,1,3,M0103,5,3,1,238.787339,15
10123,2,1,1,1,1,2,62,1,77,CHEQUEO SEMESTRAL CANSER,6,1, , ,1, ,6, ,1,1,0,1,0,0,0,0,0, ,2,1,3,52,0,20,3,2,0,30,3,0,7,2, ,0, , , , , , ,1,2, , , ,2, , , ,2,1,1,0,1,0,0,0,0,0,0,0,0,0,0, , , , , , , , , , , , , , , , ,1,1,5,M0103,5,3,1,281.975721,15
10124,2,1,1,1,1,2,55,1,4, ,1,1, , ,10, ,5, ,1,0,0,0,1,1,1,0,0, ,2,2, ,7777,0,1,5,1,0,1,5,0,20,2, ,3,1,1,3, , , ,2, , , , ,2, , , ,1,1,0,1,1,0,0,0,0,0,0,0,1,0,0, , , , , , , , , , , , , , , , ,1,1,5,M0103,5,3,1,265.759639,15
10130,2,1,1,1,1,2,52,1,4, ,1,1, , ,9, ,5, ,2,0,0,1,0,0,0,0,0, ,1,2, ,7777,0,10,4,2,0,15,4,0,15,1,20,1,1,1,1, , , ,2, , , , ,2, , , ,1,1,0,0,0,0,1,1,1,0,0,0,0,0,0, , , , , , , , , , , , , , , , ,1,1,3,M0104,5,3,1,258.756586,15
10131,2,1,1,1,1,2,53,2, , , , , , , , , , , , , , , , , , , , , , , , , , , , , , , , , , , , , , , , , , , , , , , , , , , , , , , , , , , , , , , , , , , , , , , , , , , , , , , , , , , , , ,M0104,5,3,1,258.756586,15
10140,1,1,1,1,1,1,52,1,31, ,1,1, , ,1, ,6, ,1,1,0,0,0,0,0,0,0, ,2,2, ,7777,0,5,3,1,0,1,5,23,0,2, ,7,1,1,1, , , ,2, , , , ,2, , , ,1,1,0,1,1,0,0,0,0,0,0,0,0,0,0, , , , , , , , , , , , , , , , ,1,1,5,M0104,5,3,1,282.875558,15
10143,4,1,1,1,1,2,28,2, , , , , , , , , , , , , , , , , , , , , , , , , , , , , , , , , , , , , , , , , , , , , , , , , , , , , , , , , , , , , , , , , , , , , , , , , , , , , , , , , , , , , ,M0104,5,3,1,330.495497,15
10145,5,1,1,1,1,2,6,1,4, ,1,1, , ,9, ,5, ,2,0,0,0,0,0,0,1,0,POR QUE SE ENFERMO DE RAPIDO,1,2, ,7777,0,5,4,2,30,0,3,0,20,1,20,3,1,3, ,1, ,50,2, , , , ,2, , , ,2,1,0,0,0,0,1,0,0,0,0,0,0,0,0, , , , , , , , , , , , , , , , ,1,1,4,M0104,5,3,1,311.550519,15
10147,1,1,1,1,1,1,56,1,18, ,2,1, , ,7, ,5, ,2,1,0,0,0,0,0,0,0, ,2,2, ,7777,0,10,4,2,2,0,3,0,30,2, ,0, , , , , , ,1,1,1, ,0,2, , , ,2,1,0,1,0,0,0,0,0,1,0,0,0,0,0, , , , , , , , , , , , , , , , ,1,1,4,M0104,5,3,1,232.495036,15
10150,1,1,1,1,1,1,35,1,4, ,1,1, , ,7, ,5, ,3,1,1,0,0,0,0,0,0, ,1,2, ,30,0,10,4,2,0,15,5,0,10,2, ,3,1,2, ,1, , ,2, , , , ,2, , , ,2,1,1,0,0,0,1,0,0,0,0,0,0,0,0, , , , , , , , , , , , , , , , ,1,1,3,M0104,5,3,1,499.422055,15
10153,1,1,1,1,1,2,71,1,1, ,1,1, , ,10, ,5, ,1,0,0,0,0,1,0,0,0, ,1,1,5,15,0,5,1,1,0,10,4,0,20,1,200,5,1,1,3, , , ,2, , , , ,2, , , ,1,1,0,1,0,0,0,0,0,0,0,0,0,0,0, , , , , , , , , , , , , , , , ,1,1,4,M0104,5,3,1,274.545356,15
10157,1,1,1,1,1,1,49,2, , , , , , , , , , , , , , , , , , , , , , , , , , , , , , , , , , , , , , , , , , , , , , , , , , , , , , , , , , , , , , , , , , , , , , , , , , , , , , , , , , , , , ,M0104,5,3,1,282.875558,15
10161,1,1,1,1,1,1,53,1,12, ,6,1, , ,7, ,6, ,2,1,0,0,0,0,0,0,0, ,2,1,3,24,0,40,3,4,6,0,1,2,0,2, ,4,1,1,1, , , ,1,1,1, ,0,2, , , ,1,1,0,1,1,0,0,0,0,0,0,0,0,0,0, , , , , , , , , , , , , , , , ,1,1,4,M0104,5,3,1,282.875558,15
10165,2,1,1,1,1,2,47,1,77,CONTRACION MUSCULAR,3,1, , ,7, ,5, ,1,0,1,0,0,0,0,0,0, ,1,2, ,7777,0,10,4,2,0,10,1,0,10,1,40,0, , , , , , ,2, , , , ,2, , , ,2,1,0,1,0,0,0,0,0,0,0,0,0,0,0, , , , , , , , , , , , , , , , ,2,1,5,M0104,5,3,1,258.756586,15
10166,1,1,1,1,1,1,67,1,13, ,6,1, , ,1, ,5, ,2,1,0,0,0,0,0,0,0, ,1,1,3,7777,0,10,4,1,0,15,4,0,20,2, ,1,1,1,1, , , ,2, , , , ,2, , , ,2,1,1,1,0,0,0,0,0,0,0,0,0,0,0, , , , , , , , , , , , , , , , ,1,1,4,M0104,5,3,1,232.495036,15
10181,2,1,1,1,1,2,47,1,23, ,2,1, , ,77,PARTICULAR,6, ,2,0,0,0,0,0,0,1,0,PORQUW NO TIENE OTRO SERVICIO DE SALUD,1,1,4,7777,0,15,4,2,1,30,2,0,20,1,200,3,1,1,4, , , ,1,1,1, ,700,2, , , ,2,1,0,0,0,0,0,0,0,0,0,0,0,1,0,LE DAN BUEN SERVICVIO, , , , , , , , , , , , , , , ,1,1,4,M0105,5,3,1,216.049204,15
10192,3,1,1,1,1,2,16,1,4, ,1,1, , ,1, ,5, ,3,1,0,0,0,0,0,0,0, ,2,2, ,7777,0,15,4,2,0,50,2,0,15,2, ,3,1,1,1, , , ,2, , , , ,2, , , ,2,2, , , , , , , , , , , , , , ,0,0,0,0,0,0,0,0,0,1,0,0,0,0, ,1,1,3,M0105,5,3,1,234.447589,15
10195,1,1,1,1,1,2,80,1,12, ,6,1, , ,1, ,5, ,1,1,0,0,0,0,0,0,0, ,2,1,3,7777,0,15,4,3,0,45,2,0,15,2, ,3,1,1,1, , , ,2, , , , ,2, , , ,2,1,0,1,0,0,0,0,0,0,0,0,0,0,0, , , , , , , , , , , , , , , , ,1,1,5,M0105,5,3,1,229.232062,15
10200,2,1,1,1,1,2,52,1,12, ,1,1, , ,1, ,5, ,2,1,0,0,0,0,0,0,0, ,2,1,2,17,0,10,1,3,0,15,3,0,15,2, ,5,1,2, ,1, , ,1,2, , , ,2, , , ,2,1,1,1,1,0,0,0,0,0,0,0,0,0,0, , , , , , , , , , , , , , , , ,1,1,3,M0105,5,3,1,254.292589,15
10200,3,1,1,1,1,2,30,1,77,CHEQUEO POR CIRUGIA Y FRACTURA DEPIE,1,1, , ,1, ,5, ,3,0,0,0,0,0,0,1,0,FUE DE EMERGENCIA,2,2, ,27,0,15,3,3,2,0,1,0,5,2, ,2,4,1,1, , , ,2, , , , ,2, , , ,2,1,1,1,1,0,0,0,0,0,0,0,0,0,0, , , , , , , , , , , , , , , , ,1,1,4,M0105,5,3,1,254.292589,15
10206,1,1,1,1,1,2,57,1,77,MAL CONGENITO,6,1, , ,1, ,5, ,1,1,0,0,0,0,0,0,0, ,1,1,3,7777,0,45,4,3,0,2,5,0,20,2, ,8,1,1,1, , , ,1,1,1, ,0,2, , , ,2,1,0,1,1,0,0,0,0,0,0,0,1,0,0, , , , , , , , , , , , , , , , ,1,1,4,M0105,5,3,1,269.808977,15
10211,2,1,1,1,1,2,22,1,22, ,3,1, , ,1, ,6, ,2,1,0,0,0,0,0,0,0, ,1,1,4,7777,0,15,4,2,0,30,3,0,30,2, ,2,1,1,1, , , ,1,2, , , ,2, , , ,2,1,0,0,0,0,0,0,0,0,0,0,0,1,0,POR QUE ESTA AFILIADA, , , , , , , , , , , , , , , ,1,1,3,M0105,5,3,1,551.895431,15
10222,2,1,1,1,1,2,26,1,43, ,5,1, , ,77,VIO MATERNA,6, ,2,0,0,0,0,0,0,1,0,SE LO RECOMENDARON,1,1,3,7777,0,10,3,3,0,5,3,0,20,1,300,2,1,1,3, , , ,2, , , , ,2, , , ,2,1,0,0,0,0,0,0,0,0,0,0,0,1,0,ES BUEN LUGAR Y ES CONFIABLE, , , , , , , , , , , , , , , ,1,1,4,M0105,5,3,1,234.447589,15
10226,1,1,1,1,1,1,76,1,9, ,2,1, , ,1, ,5, ,2,1,0,0,0,0,0,0,0, ,2,2, ,7777,0,10,4,2,0,20,3,0,10,2, ,2,2,3, ,1, ,0,2, , , , ,2, , , ,2,1,1,0,0,0,0,0,0,0,0,0,0,0,0, , , , , , , , , , , , , , , , ,1,4,4,M0106,5,3,1,274.180915,15
10232,4,1,1,1,1,1,0,1,4, ,1,1, , ,9, ,5, ,1,0,1,0,0,0,0,0,0, ,1,2, ,7777,0,5,5,1,0,5,5,0,20,1,30,1,1,1,1, , , ,2, , , , ,2, , , ,2,1,0,0,0,0,1,0,1,0,0,0,0,0,0, , , , , , , , , , , , , , , , ,1,1,4,M0106,5,3,1,304.131363,15
10233,1,1,1,1,1,2,64,1,36, ,6,1, , ,10, ,6, ,1,0,0,0,0,0,0,1,0,RECOMENDACION DE UN COMPADRE,2,1,3,7777,0,35,3,3,0,25,3,0,20,1,450,1,1,1,3, , , ,2, , , , ,2, , , ,2,1,0,0,1,0,0,0,0,0,0,0,0,0,0, , , , , , , , , , , , , , , , ,1,1,4,M0106,5,3,1,275.078474,15
10234,1,1,1,1,1,2,65,1,39, ,1,1, , ,1, ,6, ,2,1,1,0,0,0,0,0,0, ,2,2, ,7777,0,30,4,2,3,0,4,0,10,2, ,2,1,1,1, , , ,1,2, , , ,2, , , ,2,1,0,1,1,0,0,0,0,0,0,0,0,0,0, , , , , , , , , , , , , , , , ,1,1,4,M0106,5,3,1,275.078474,15
10236,3,1,1,1,1,2,10,1,77,VACUNA,1,1, , ,1, ,8, ,1,1,0,0,0,0,0,0,0, ,2,1,3,10,0,10,3,2,0,5,3,0,5,2, ,0, , , , , , ,2, , , , ,2, , , ,3,1,0,0,1,0,0,0,0,0,0,0,0,0,0, , , , , , , , , , , , , , , , ,2,1,4,M0106,5,3,1,331.137259,15
10238,4,1,1,1,1,1,9,1,1, ,1,1, , ,9, ,5, ,2,0,1,1,0,0,0,0,0, ,1,2, ,7777,0,5,4,2,0,2,4,0,15,2, ,3,1,1,1, , , ,2, , , , ,2, , , ,2,1,0,1,0,0,1,0,0,0,0,0,0,0,0, , , , , , , , , , , , , , , , ,1,1,4,M0106,5,3,1,304.131363,15
10244,2,1,1,1,1,2,45,1,8, ,1,1, , ,1, ,5, ,2,1,0,0,0,0,0,0,0, ,1,2, ,18,0,15,3,2,0,30,3,0,30,2, ,3,1,1,1, , , ,1,1,1, ,0,2, , , ,1,1,0,0,1,0,0,0,0,0,0,0,0,0,0, , , , , , , , , , , , , , , , ,1,1,3,M0106,5,3,1,259.259044,15
10258,2,1,1,1,1,2,47,1,4, ,1,1, , ,77,MEDICO OMEOPATA,2, ,1,0,0,0,1,0,0,0,0, ,1,1,3,7777,0,5,4,2,0,5,5,0,20,2, ,1,1,1,1, , , ,2, , , , ,2, , , ,2,1,0,0,1,0,0,0,0,0,0,0,0,1,0,LA EFICASIA DEL MEDICAMENTO, , , , , , , , , , , , , , , ,1,1,4,M0106,5,3,1,259.259044,15
10264,1,1,1,1,1,2,51,1,77,CHEQUEO MEDICO,1,1, , ,1, ,5, ,3,1,1,1,0,0,0,0,0, ,2,1,2,12,0,10,3,2,0,20,3,0,15,2, ,2,1,1,1, , , ,2, , , , ,2, , , ,2,1,0,0,0,0,1,1,0,0,0,0,0,0,0, , , , , , , , , , , , , , , , ,1,1,3,M0106,5,3,1,584.152841,15
10266,1,1,1,1,1,1,80,1,1, ,1,1, , ,1, ,5, ,2,1,1,0,0,0,0,0,0, ,1,2, ,30,0,10,4,2,1,30,2,0,15,2, ,3,1,1,1, , , ,2, , , , ,2, , , ,2,1,1,1,0,1,0,0,0,0,0,0,0,0,0, , , , , , , , , , , , , , , , ,1,1,4,M0106,5,3,1,232.946499,15
10267,1,1,1,1,1,1,65,1,77,CHEQUEO MEDICO,1,1, , ,1, ,5, ,1,1,0,0,0,0,0,0,0, ,1,1,3,12,0,20,3,2,0,15,3,0,15,2, ,2,1,1,1, , , ,2, , , , ,2, , , ,2,1,1,0,0,0,0,0,0,0,0,0,0,0,0, , , , , , , , , , , , , , , , ,1,1,4,M0108,5,3,1,187.405113,15
10268,2,1,1,1,1,2,25,2, , , , , , , , , , , , , , , , , , , , , , , , , , , , , , , , , , , , , , , , , , , , , , , , , , , , , , , , , , , , , , , , , , , , , , , , , , , , , , , , , , , , , ,M0108,5,3,1,226.335286,15
10276,1,1,1,1,1,1,63,1,77,CHEQUEO MEDICO,4,1, , ,1, ,6, ,2,1,0,1,0,0,0,0,0, ,2,1,3,12,0,20,3,3,0,30,3,0,15,2, ,4,1,1,1, , , ,1,1,1, ,0,2, , , ,2,1,1,1,1,0,0,0,0,0,0,0,0,0,0, , , , , , , , , , , , , , , , ,1,1,3,M0108,5,3,1,220.578141,15
10283,5,1,1,1,1,2,25,1,1, ,1,1, , ,1, ,5, ,2,1,0,0,0,0,0,0,0, ,2,2, ,6,0,10,4,2,3,0,1,0,20,2, ,3,1,1,1, , , ,2, , , , ,2, , , ,2,1,0,0,1,0,0,0,0,0,0,0,1,0,0, , , , , , , , , , , , , , , , ,1,1,5,M0108,5,3,1,532.798871,15
10283,13,1,1,1,1,1,2,1,4, ,1,1, , ,1, ,5, ,1,1,0,0,1,0,0,0,0, ,1,2, ,24,0,40,2,3,1,30,1,0,30,2, ,2,1,1,1, , , ,2, , , , ,2, , , ,2,1,1,0,0,1,0,0,0,0,0,0,0,0,0, , , , , , , , , , , , , , , , ,1,1,4,M0108,5,3,1,489.346464,15
10286,3,1,1,1,1,2,41,1,77,SINUSITIS Y FARINGITIS CRONICA,2,1, , ,1, ,5, ,2,1,0,0,0,0,0,0,0, ,2,2, ,12,0,30,4,2,0,45,3,0,20,2, ,5,1,1,1, , , ,1,1,1, ,0,1,35,9999,9999,2,1,1,0,0,0,0,0,0,0,0,0,0,0,0, , , , , , , , , , , , , , , , ,1,1,3,M0108,5,3,1,245.493615,15
10286,9,1,1,1,1,1,4,1,1, ,1,1, , ,9, ,5, ,2,0,0,0,0,0,1,0,0, ,1,2, ,7777,0,10,4,2,0,5,5,0,20,1,30,3,1,1,3, , , ,2, , , , ,2, , , ,2,1,0,1,0,0,0,0,1,0,0,0,1,0,0, , , , , , , , , , , , , , , , ,1,1,4,M0108,5,3,1,244.673233,15
10294,1,1,1,1,1,2,61,1,33, ,4,1, , ,7, ,5, ,2,1,1,0,0,0,0,0,0, ,2,2, ,7777,0,20,3,2,0,5,3,0,20,2, ,4,1,3, ,1, ,80,2, , , , ,2, , , ,3,1,1,0,1,1,0,0,0,0,0,0,0,0,0, , , , , , , , , , , , , , , , ,1,1,4,M0108,5,3,1,221.300226,15
10297,2,1,1,1,1,2,54,1,13, ,5,1, , ,1, ,5, ,3,1,0,0,0,0,0,0,0, ,2,1,3,12,0,20,3,2,1,30,1,0,15,2, ,3,4,1,1, , , ,2, , , , ,2, , , ,3,2, , , , , , , , , , , , , , ,1,0,0,0,0,0,0,0,0,0,0,1,0,0, ,1,4,2,M0108,5,3,1,208.573518,15
10300,2,1,1,1,1,2,48,1,4, ,1,1, , ,9, ,5, ,2,0,0,1,0,0,0,0,0, ,1,2, ,50,0,10,4,2,0,10,4,0,10,2, ,3,1,1,1, , , ,2, , , , ,1,9999,9999,200,2,1,0,0,0,0,0,1,0,0,0,0,0,1,0,MEJORO, , , , , , , , , , , , , , , ,1,1,4,M0108,5,3,1,245.493615,15
10305,2,1,1,1,1,2,52,1,4, ,1,1, , ,9, ,5, ,2,0,0,0,0,0,0,1,0,LA ENFERMEDAD,1,2, ,7777,0,10,4,2,0,15,3,0,10,1,30,3,1,1,1, , , ,2, , , , ,2, , , ,2,1,0,0,1,0,0,0,0,0,0,0,0,0,0, , , , , , , , , , , , , , , , ,1,1,3,M0108,5,3,1,208.573518,15
10310,2,1,1,1,1,2,54,1,37, ,6,1, , ,1, ,5, ,4,0,0,1,0,0,0,0,0, ,1,1,2,12,0,30,3,2,1,0,1,0,10,2, ,3,4,1,1, , , ,1,2, , , ,2, , , ,4,2, , , , , , , , , , , , , , ,0,0,0,0,0,0,0,0,0,0,0,0,1,0,NO LA ATIENDE BIEN Y NO LA ESCUCHA,2,1,5,M0109,5,3,1,227.52084,15
10315,4,1,1,1,1,2,5,1,4, ,1,1, , ,9, ,5, ,2,0,0,0,0,0,0,1,0,PORQUE YA ERA TARDE,1,2, ,30,0,10,4,2,0,30,3,0,20,1,25,3,1,1,1, , , ,2, , , , ,2, , , ,2,1,0,0,0,0,0,0,0,0,0,0,0,1,0,PORQUE LOS MEDICAMENTOS SON MEJORES, , , , , , , , , , , , , , , ,1,1,4,M0109,5,3,1,584.152841,15
10317,1,1,1,1,1,1,28,1,4, ,1,1, , ,7, ,5, ,1,1,0,1,0,0,0,0,0, ,1,1,3,7777,0,5,5,2,1,0,3,0,15,2, ,1,1,1,1, , , ,2, , , , ,2, , , ,2,1,0,0,0,0,0,0,0,0,0,0,1,0,0, , , , , , , , , , , , , , , , ,1,1,4,M0109,5,3,1,291.803336,15
10318,1,1,1,1,1,2,73,1,13, ,6,1, , ,7, ,5, ,1,0,1,1,0,0,0,0,0, ,1,1,3,7777,0,30,3,2,0,30,3,0,30,2, ,4,1,2, ,1, , ,2, , , , ,2, , , ,2,1,0,1,0,0,0,0,0,0,0,0,1,0,0, , , , , , , , , , , , , , , , ,1,1,5,M0109,5,3,1,241.403674,15