Folio consecutivo,N�mero de Integrante,Entidad Federativa,Municipio,Localidad,Edad,Meses,D�a de nacimiento,Mes de nacimiento,A�o de nacimiento,Fecha de nacimiento,Sexo,�Qu� es (NOMBRE) del (la) jefe(a) del hogar?,Especif�que que otro parentesco:,"En esta vivienda, �vive la madre de (USTED/NOMBRE)?",�Qui�n es?,"En esta vivienda, �vive el padre de (USTED/NOMBRE)?",�Qui�n es?,Cuando (USTED/NOMBRE) tiene problemas de salud �en d�nde se atiende usualmente?   1a. OPCION,Cuando (USTED/NOMBRE) tiene problemas de salud �en d�nde se atiende usualmente?   2a. OPCION,ESPECIFIQUE,(USTED/NOMBRE) est� afiliado(a) o inscrito(a) a los servicios m�dicos:   1a. OPCION,(USTED/NOMBRE) est� afiliado(a) o inscrito(a) a los servicios m�dicos:   2a. OPCION,(USTED/NOMBRE) est� afiliado(a) inscrito(a) (respuesta de 2.11) por:  1a. OPCION,(USTED/NOMBRE) est� afiliado(a) inscrito(a) (respuesta de 2.11) por:  2a. OPCION,�En qu� dependencia trabaja o trabajaba?,�En qu� fecha se afili� al Seguro Popular? MES,�En qu� fecha se afili� al Seguro Popular? A�O,Ahora quiero preguntarle: �(USTED/NOMBRE) habla alguna lengua ind�gena?,�Qu� lengua ind�gena habla (USTED/NOMBRE)?   1a. OPCION,�Qu� lengua ind�gena habla (USTED/NOMBRE)?   2a. OPCION,ESPECIFIQUE:,�(USTED/NOMBRE)  habla tambi�n espa�ol?,De acuerdo con la cultura de (USTED/NOMBRE) �ella (�l) se considera ind�gena?,�(USTED/NOMBRE) sabe leer y escribir un recado?,�(USTED/NOMBRE) actualmente va a la escuela?,�Cu�l es el �ltimo a�o y grado que aprob� (USTED/NOMBRE) en la escuela?,�Cu�l es el �ltimo a�o y grado que aprob� (USTED/NOMBRE) en la escuela?,�(USTED/NOMBRE) fue a una escuela especial o a un grupo de educaci�n especial en una escuela normal?,�Actualmente (USTED/NOMBRE),"En esta vivienda, �vive la pareja o esposa(o) de (USTED/NOMBRE)?",�Qui�n es?,Ahora le voy a preguntar por la situaci�n laboral. �La semana pasada (USTED/NOMBRE) trabaj� por lo menos una hora?,Aunque ya me dijo que (USTED/NOMBRE) (RESPUESTA DE 2.21) �la semana pasada:,�En su trabajo de la semana pasada(USTED/NOMBRE)fue:," (USTED/NOMBRE) recibe por su trabajo:   servicio m�dico (IMSS, ISSSTE u otro)?",(USTED/NOMBRE) recibe por su trabajo:   aguinaldo?,(USTED/NOMBRE) recibe por su trabajo:    vacaciones con goce de sueldo?,(USTED/NOMBRE) recibe por su trabajo:    reparto de utilidades o prima vacacional?,(USTED/NOMBRE) recibe por su trabajo:    ahorro para el retiro(SAR o AFORE)?,(USTED/NOMBRE) recibe por su trabajo:    otras prestaciones?,"(USTED/NOMBRE) recibe por su trabajo:    entonces, �no recibe ninguna prestaci�n laboral?",(USTED/NOMBRE) recibe por su trabajo:     NS/NR,�Cu�ntas horas trabaj� (USTED/NOMBRE) la semana pasada?,"Me puede decir, �cu�nto obtiene o recibe (USTED/NOMBRE) por su trabajo?","Me puede decir, �cu�nto obtiene o recibe (USTED/NOMBRE) por su trabajo? CANTIDAD","(USTED/NOMBRE) recibe dinero por:     programas de gobierno como Oportunidades, Procampo, becas, ayuda a madres solteras, adultos mayores, etc?",(USTED/NOMBRE) recibe dinero por:     jubilaci�n o pensi�n?,(USTED/NOMBRE) recibe dinero por:     ayuda de personas que viven en otro pa�s?,(USTED/NOMBRE) recibe dinero por:     ayuda de personas que viven dentro del pa�s?,(USTED/NOMBRE) recibe dinero por:     otras fuentes?,(USTED/NOMBRE) recibe dinero por:     Ninguna,"En las �ltimas dos semanas (USTED/NOMBRE) ha tenido alg�n problema de salud, por enfermedad o lesiones f�sicas por accidente o agresiones?",�Podr�a decirme cu�l fue el �ltimo problema de salud que tuvo (USTED/NOMBRE) en las �ltimas dos semanas?,ESPECIFIQUE:,�Est� (USTED/NOMBRE) recibiendo atenci�n por este padecimiento?,"Relacionado con su problema de salud, �utiliz� alg�n medicamento con o sin receta?",�Cu�nto pag� por los medicamentos que utiliz�?,"En el momento en que (USTED/NOMBRE) present� ese problema de salud, �pens� usted que era...",�Qui�n (lo) atendi� a (USTED/NOMBRE)?   1a. OPCION,�Qui�n (lo) atendi� a (USTED/NOMBRE)?   2a. OPCION,ESPECIFIQUE,"�Por qu� no se atendi� (USTED/NOMBRE) con un m�dico, enfermera � alg�n otro personal de salud?   1a. OPCION","�Por qu� no se atendi� (USTED/NOMBRE) con un m�dico, enfermera � alg�n otro personal de salud?   2a. OPCION","�Por qu� no se atendi� (USTED/NOMBRE) con un m�dico, enfermera � alg�n otro personal de salud?   3a. OPCION",ESPECIFIQUE:,�Me puede decir el nombre de la enfermedad que le dijeron que no pod�an atender porque no est� cubierta por el seguro?,�En qu� instituci�n de salud se atendi� (USTED/NOMBRE)?,ESPECIFIQUE:,"En su vida diaria, �(USTED/NOMBRE) tiene dificultad al realizar las siguientes actividades:     caminar, moverse, subir o bajar?","En su vida diaria, �(USTED/NOMBRE) tiene dificultad al realizar las siguientes actividades:     ver, aun usando lentes?","En su vida diaria, �(USTED/NOMBRE) tiene dificultad al realizar las siguientes actividades:     hablar, comunicarse o conversar?","En su vida diaria, �(USTED/NOMBRE) tiene dificultad al realizar las siguientes actividades:     o�r, aun usando aparato auditivo?","En su vida diaria, �(USTED/NOMBRE) tiene dificultad al realizar las siguientes actividades:     vestirse, ba�arse o comer?","En su vida diaria, �(USTED/NOMBRE) tiene dificultad al realizar las siguientes actividades:     poner atenci�n o aprender cosas sencillas?","En su vida diaria, �(USTED/NOMBRE) tiene dificultad al realizar las siguientes actividades:     entender lo que le dicen?","En su vida diaria, �(USTED/NOMBRE) tiene dificultad al realizar las siguientes actividades:     aprender a hacer cosas como otras personas de su edad?","En su vida diaria, �(USTED/NOMBRE) tiene dificultad al realizar las siguientes actividades:     Entonces, �no tiene dificultad f�sica o mental?","�(USTED/NOMBRE) tiene dificultad para caminar, moverse, subir o bajar?...","�(USTED/NOMBRE) tiene dificultad para ver, aun usando lentes?","�(USTED/NOMBRE) tiene dificultad para hablar, comunicarse o conversar?","�(USTED/NOMBRE) tiene dificultad para o�r, aun usando aparato auditivo?","�(USTED/NOMBRE) tiene dificultad para vestirse, ba�arse o comer?",�(USTED/NOMBRE) tiene dificultad para poner atenci�n o aprender cosas sencillas?,�(USTED/NOMBRE) tiene dificultad para entender lo que dicen?,�(USTED/NOMBRE) tiene dificultad para aprender a hacer cosas como otras personas de su edad?,"En las �ltimas dos semanas, �(USTED/NOMBRE) solicit� o recibi� consulta, (que no haya requerido hospitalizaci�n), por enfermedad, control de la misma, lesi�n o accidente?",�Durante el �ltimo a�o alg�n m�dico le diagnostic� a (USTED/NOMBRE)?   1a. OPCION,�Durante el �ltimo a�o alg�n m�dico le diagnostic� a (USTED/NOMBRE)?   2a. OPCION,�Durante el �ltimo a�o alg�n m�dico le diagnostic� a (USTED/NOMBRE)?   3a. OPCION,ESPECIFIQUE:,Durante el �ltimo a�o �(USTED/NOMBRE) ha donado sangre?,�Cu�l fue la raz�n por la que (USTED/NOMBRE) don� sangre?,ESPECIFIQUE:,"Durante este �ltimo a�o, �(USTED/NOMBRE) estuvo hospitalizado(a) o internado(a)?","Ahora le preguntar� por la �ltima vez que estuvo hospitalizado(a) (USTED/NOMBRE), �Por qu� motivo fue hospitalizado(a) (USTED/NOMBRE)?",ESPECIFIQUE:,"El hospital donde estuvo internado(a) (USTED/NOMBRE), �a qu� instituci�n pertenece?",ESPECIFIQUE:,�Esta atenci�n fue financiada por el Seguro Popular?,"En total, �cu�ntas veces estuvo hospitalizado(a) (USTED/NOMBRE) en el �ltimo a�o?","En total, �cu�ntos d�as estuvo (lleva) internado(a) (USTED/NOMBRE) en el �ltimo a�o?",La �ltima vez que estuvo hospitalizado(a) (USTED/NOMBRE) �requiri� de alguna transfusi�n de sangre?,ESPECIFIQUE:,Si (USTED/NOMBRE) tuviera la oportunidad de escoger �regresar�a a ese mismo lugar para la hospitalizaci�n?,�Por qu� no regresar�a (USTED/NOMBRE)?,ESPECIFIQUE:,�En general la calidad de la atenci�n que recibi� fue ...,�Por qu� le pareci� (MUY BUENA O BUENA) la atenci�n que recibi�?   1a. OPCION,�Por qu� le pareci� (MUY BUENA O BUENA) la atenci�n que recibi�?   2a. OPCION,�Por qu� le pareci� (MUY BUENA O BUENA) la atenci�n que recibi�?   3a. OPCION,ESPECIFIQUE:,"Por qu� le pareci� (REGULAR, MALA O MUY MALA) la atenci�n que recibi�?   1a. OPCION","Por qu� le pareci� (REGULAR, MALA O MUY MALA) la atenci�n que recibi�?   2a. OPCION",ESPECIFIQUE:,En los �ltimos 12 meses �alguna persona de este hogar recibi� apoyo del programa de...   1a. OPCION,En los �ltimos 12 meses �alguna persona de este hogar recibi� apoyo del programa de...   2a. OPCION,En los �ltimos 12 meses �alguna persona de este hogar recibi� apoyo del programa de...   3a. OPCION,En los �ltimos 12 meses �alguna persona de este hogar recibi� apoyo del programa de...   4a. OPCION,En los �ltimos 12 meses �alguna persona de este hogar recibi� apoyo del programa de...   5a. OPCION,En los �ltimos 12 meses �alguna persona de este hogar recibi� apoyo del programa de...   6a. OPCION,ESPECIFIQUE:,UPM,Estrato de Dise�o,Estrato de Urbanidad,Estrato de Marginalidad,Ponderador, Estrato para calcular varianzas,afilia_1ra,afilia_tras
10001,1,1,1,1,41,10,20,1,1970,20/01/1970,1,1, ,2, ,2, ,1, , ,1, ,3, , , , ,2, , , , ,2,1,2,3,3, ,5,1,2,1, ,1,2,1,1,2,2,2,2,2,40,3,999999,2,2,2,2,2,1,2, , , , , , , , , , , , , , , , ,2,2,2,2,2,2,2,2,1, , , , , , , , ,2,20, , , ,2, , ,2, , , , , , , , , , , , , , , , , , , , ,88, , , , , , ,M0101,5,3,1,275.654006,15,1,1
10001,2,1,1,1,41,8,1,4,1970,01/04/1970,2,2, ,3, ,2, ,1, , ,1, ,1, , , , ,2, , , , ,2,1,2,8,3, ,5,1,1,1, ,1,1,1,1,1,2,2,2,2,40,3,999999,2,2,2,2,2,1,2, , , , , , , , , , , , , , , , ,2,2,2,2,2,2,2,2,1, , , , , , , , ,2,20, , , ,2, , ,2, , , , , , , , , , , , , , , , , , , , ,88, , , , , , ,M0101,5,3,1,264.538414,15,1,1
10001,3,1,1,1,19,1,6,11,1992,06/11/1992,1,3, ,1,2,1,1,1, , ,1, ,3, , , , ,2, , , , ,2,1,1,9,1, ,6, , ,1, ,1,2,2,2,2,2,2,1,2,8,1,350,2,2,2,2,2,1,1,31, ,1,1,0,4,12, , , , , , , ,1, ,2,2,2,2,2,2,2,2,1, , , , , , , , ,1,20, , , ,1,2, ,2, , , , , , , , , , , , , , , , , , , , ,88, , , , , , ,M0101,5,3,1,270.517139,15,1,1
10001,4,1,1,1,17,9,26,2,1994,26/02/1994,2,3, ,1,2,1,1,1, , ,1, ,3, , , , ,2, , , , ,2,1,2,4,1, ,6, , ,6,9, , , , , , , , , , , , ,2,2,2,2,2,1,2, , , , , , , , , , , , , , , , ,2,2,2,2,2,2,2,2,1, , , , , , , , ,2,20, , , , , , ,2, , , , , , , , , , , , , , , , , , , , ,88, , , , , , ,M0101,5,3,1,252.312714,15,1,1
10001,5,1,1,1,9,2,6,10,2002,06/10/2002,1,3, ,1,2,1,1,1, , ,1, ,3, , , , ,2, , , , ,2,1,1,2,3, , , , ,5,9, , , , , , , , , , , , ,2,2,2,2,2,1,2, , , , , , , , , , , , , , , , ,2,2,2,2,2,2,2,2,1, , , , , , , , ,2, , , , , , , ,2, , , , , , , , , , , , , , , , , , , , ,88, , , , , , ,M0101,5,3,1,297.620993,15,1,1
10003,1,1,1,1,32,9,23,2,1979,23/02/1979,1,1, ,1,3,3, ,1,9, ,1,7,1,1, , , ,2, , , , ,2,1,2,11,2, ,5,1,2,1, ,1,1,1,1,1,1,2,2,2,40,4,5000,2,2,2,2,2,1,1,5, ,1,1,0,4,11, , , , , , , ,1, ,2,2,2,2,2,2,2,2,1, , , , , , , , ,2,20, , , ,1,2, ,2, , , , , , , , , , , , , , , , , , , , ,88, , , , , , ,M0101,5,3,1,308.045928,15,1,14
10003,2,1,1,1,31,0,14,11,1980,14/11/1980,2,2, ,2, ,2, ,1,9, ,1,7,3,3, , , ,2, , , , ,2,1,2,10,4, ,5,1,1,6,9, , , , , , , , , , , , ,2,2,2,2,2,1,1,5, ,1,1,0,3,11, , , , , , , ,1, ,2,2,2,2,2,2,2,2,1, , , , , , , , ,2,20, , , ,2, , ,2, , , , , , , , , , , , , , , , , , , , ,88, , , , , , ,M0101,5,3,1,302.871898,15,1,14
10003,3,1,1,1,61,0,20,11,1950,20/11/1950,2,6, ,2, ,2, ,1,9, ,1, ,4, , , , ,2, , , , ,2,1,2,4,3, ,4, , ,6,9, , , , , , , , , , , , ,2,1,2,2,2,2,1,2, ,1,1,0,4,12, , , , , , , ,1, ,2,2,1,2,2,2,2,2,2, , ,2, , , , , ,1,20, , , , , , ,2, , , , , , , , , , , , , , , , , , , , ,88, , , , , , ,M0101,5,3,1,264.538414,15,1,1
10003,4,1,1,1,37,10,11,2,1974,11/02/1974,2,77,HERMANA,1,3,3, ,1,9, ,1, ,1, , , , ,2, , , , ,2,1,2,10,4, ,6, , ,1, ,1,1,1,1,1,1,2,2,2,40,4,12000,2,2,2,2,2,1,2, , , , , , , , , , , , , , , , ,2,2,2,2,2,2,2,2,1, , , , , , , , ,2,20, , , ,1,2, ,1,2, ,1, , ,2,8,1, ,1, , ,2,5,7, , , , , ,88, , , , , , ,M0101,5,3,1,264.538414,15,1,1
10003,5,1,1,1,2,2,13,10,2009,13/10/2009,1,3, ,1,2,1,1,1,9, ,1,7,3,3, , , , , , , , , , , , , , , , , , , , , , , , , , , , , , , , , , , , , ,1,5, ,1,1,0,2,11, , , , , , , ,1, , , , , , , , , , , , , , , , , , ,2, , , , , , , ,1,2, ,9, , ,1,5,1, ,1, , ,2,5, , , , , , ,88, , , , , , ,M0101,5,3,1,265.993098,15,1,14
10005,1,1,1,1,66,2,8,10,1945,08/10/1945,1,1, ,3, ,3, ,3, , ,3, ,1, ,SEP, , ,2, , , , ,1,1,2,7,3, ,5,1,2,1, ,1,1,1,1,2,1,2,2,2,40,1,999999,2,2,2,2,2,1,2, , , , , , , , , , , , , , , , ,2,2,2,2,2,2,2,2,1, , , , , , , , ,2,20, , , , , , ,2, , , , , , , , , , , , , , , , , , , , ,88, , , , , , ,M0101,5,3,1,211.808881,15,2,2
10005,2,1,1,1,64,9,7,3,1947,07/03/1947,2,2, ,3, ,3, ,3, , ,3, ,3, , , , ,2, , , , ,1,1,2,2,6, ,5,1,1,6,9, , , , , , , , , , , , ,2,2,2,2,2,1,2, , , , , , , , , , , , , , , , ,2,2,2,2,2,2,2,2,1, , , , , , , , ,2,20, , , , , , ,2, , , , , , , , , , , , , , , , , , , , ,88, , , , , , ,M0101,5,3,1,224.754145,15,2,2
10006,1,1,1,1,62,11,7,1,1949,07/01/1949,1,1, ,2, ,3, ,1, , ,1, ,1, , , , ,2, , , , ,2,1,2,4,3, ,5,1,2,1, ,1,1,1,1,2,2,2,2,2,45,4,10000,2,2,2,2,2,1,2, , , , , , , , , , , , , , , , ,1,2,2,2,2,2,2,2,2,2, , , , , , , ,1,20, , , , , , ,2, , , , , , , , , , , , , , , , , , , , ,88, , , , , , ,M0101,5,3,1,234.198049,15,1,1
10006,2,1,1,1,60,3,30,8,1951,30/08/1951,2,2, ,3, ,3, ,1, , ,1, ,3, , , , ,2, , , , ,2,1,2,7,3, ,5,1,1,6,9, , , , , , , , , , , , ,2,2,2,2,2,1,2, , , , , , , , , , , , , , , , ,2,2,2,2,2,2,2,2,1, , , , , , , , ,1,20, , , ,2, , ,2, , , , , , , , , , , , , , , , , , , , ,88, , , , , , ,M0101,5,3,1,224.754145,15,1,1
10007,1,1,1,1,43,3,29,8,1968,29/08/1968,1,1, ,2, ,2, ,2, , ,2, ,3, , , , ,2, , , , ,2,1,2,4,3, ,5,1,2,1, ,5,2,2,2,2,2,2,1,2,50,4,6000,2,2,2,2,2,1,2, , , , , , , , , , , , , , , , ,2,2,2,2,2,2,2,2,1, , , , , , , , ,2,20, , , ,2, , ,2, , , , , , , , , , , , , , , , , , , , ,88, , , , , , ,M0101,5,3,1,275.654006,15,2,2
10007,2,1,1,1,44,10,9,2,1967,09/02/1967,2,2, ,2, ,2, ,2, , ,2, ,1, ,INSTITUTO DE SALUD DEL ESTADO DE AGUASCALIENTES, , ,2, , , , ,2,1,2,10,4, ,5,1,1,1, ,1,1,1,2,2,1,2,2,2,37,4,5000,2,2,2,2,2,1,2, , , , , , , , , , , , , , , , ,2,2,2,2,2,2,2,2,1, , , , , , , , ,2,20, , , ,2, , ,2, , , , , , , , , , , , , , , , , , , , ,88, , , , , , ,M0101,5,3,1,264.538414,15,2,2
10007,3,1,1,1,17,1,2,11,1994,02/11/1994,2,3, ,1,2,1,1,2, , ,2, ,3, , , , ,2, , , , ,2,1,1,4,2, ,6, , ,5,9, , , , , , , , , , , , ,2,2,2,2,2,1,2, , , , , , , , , , , , , , , , ,2,2,2,2,2,2,2,2,1, , , , , , , , ,2,20, , , , , , ,2, , , , , , , , , , , , , , , , , , , , ,88, , , , , , ,M0101,5,3,1,252.312714,15,2,2
10007,4,1,1,1,15,0,24,11,1996,24/11/1996,1,3, ,1,2,1,1,2, , ,2, ,3, , , , ,2, , , , ,2,1,1,3,3, ,6, , ,5,9, , , , , , , , , , , , ,2,2,2,2,2,1,2, , , , , , , , , , , , , , , , ,2,2,2,2,2,2,2,2,1, , , , , , , , ,2,20, , , , , , ,2, , , , , , , , , , , , , , , , , , , , ,88, , , , , , ,M0101,5,3,1,270.517139,15,2,2
10007,5,1,1,1,4,9,25,2,2007,25/02/2007,2,3, ,1,2,1,1,2, , ,2, ,3, , , , ,2, , , , ,2, , , , , , , , , , , , , , , , , , , , , , , , , , , , ,2, , , , , , , , , , , , , , , , , , , , , , , , , , , , , , , , , ,2, , , , , , , ,2, , , , , , , , , , , , , , , , , , , , ,88, , , , , , ,M0101,5,3,1,285.231237,15,2,2
10008,1,1,1,1,36,4,29,7,1975,29/07/1975,2,1, ,3, ,2, ,1, , ,1, ,1, , , , ,2, , , , ,1,1,2,2,6, ,5,2, ,1, ,1,1,1,1,1,1,2,2,2,60,2,400,2,2,2,2,2,1,2, , , , , , , , , , , , , , , , ,2,2,2,2,2,2,2,2,1, , , , , , , , ,2,20, , , ,2, , ,2, , , , , , , , , , , , , , , , , , , , ,88, , , , , , ,M0101,5,3,1,264.538414,15,1,1
10008,2,1,1,1,17,4,25,7,1994,25/07/1994,2,3, ,1,1,2, ,8, , ,9, , , , , , ,2, , , , ,1,1,2,3,3, ,6, , ,6,9, , , , , , , , , , , , ,2,2,2,2,2,1,2, , , , , , , , , , , , , , , , ,2,2,2,2,2,2,2,2,1, , , , , , , , ,2,20, , , , , , ,2, , , , , , , , , , , , , , , , , , , , ,88, , , , , , ,M0101,5,3,1,252.312714,15,0,0
10008,3,1,1,1,14,3,28,8,1997,28/08/1997,1,3, ,1,1,2, ,1, , ,1, ,3, , , , ,2, , , , ,1,1,1,3,1, ,6, , ,5,9, , , , , , , , , , , , ,2,2,2,2,2,1,2, , , , , , , , , , , , , , , , ,2,2,2,2,2,2,2,2,1, , , , , , , , ,2,20, , , , , , ,2, , , , , , , , , , , , , , , , , , , , ,88, , , , , , ,M0101,5,3,1,308.140655,15,1,1
10008,4,1,1,1,9,0,3,12,2002,03/12/2002,2,3, ,1,1,2, ,1, , ,1, ,3, , , , ,2, , , , ,1,1,1,2,1, , , , ,5,9, , , , , , , , , , , , ,2,2,2,2,2,1,2, , , , , , , , , , , , , , , , ,2,2,2,2,2,2,2,2,1, , , , , , , , ,2, , , , , , , ,2, , , , , , , , , , , , , , , , , , , , ,88, , , , , , ,M0101,5,3,1,316.132519,15,1,1
10008,5,1,1,1,4,2,25,9,2007,25/09/2007,2,3, ,1,1,2, ,1, , ,1, ,3, , , , ,2, , , , ,1, , , , , , , , , , , , , , , , , , , , , , , , , , , , ,2, , , , , , , , , , , , , , , , , , , , , , , , , , , , , , , , , ,2, , , , , , , ,2, , , , , , , , , , , , , , , , , , , , ,88, , , , , , ,M0101,5,3,1,285.231237,15,1,1
10009,1,1,1,1,91,6,29,5,1920,29/05/1920,2,1, ,3, ,3, ,6, , ,6, ,3, , ,9,2008,2, , , , ,2,1,2,0,0,2,4, , ,7, , , , , , , , , , , , , ,2,2,2,2,2,1,2, , , , , , , , , , , , , , , , ,1,2,2,2,1,2,2,2,2,3, , , ,4, , , ,2,20, , , , , , ,1,3, ,6, ,1,1,8,3, ,1, , ,1,5, , , , , , ,88, , , , , , ,M0101,5,3,1,240.105522,15,6,6
10009,2,1,1,1,60,10,28,1,1951,28/01/1951,2,3, ,1,1,3, ,6, , ,6, ,6, , ,9,2008,2, , , , ,2,1,2,2,5, ,6, , ,1, ,5,2,2,2,2,2,2,1,2,70,1,54,2,2,2,2,2,1,2, , , , , , , , , , , , , , , , ,2,2,2,2,2,2,2,2,1, , , , , , , , ,2,3, , , ,2, , ,2, , , , , , , , , , , , , , , , , , , , ,88, , , , , , ,M0101,5,3,1,224.754145,15,6,6
10010,1,1,1,1,71,5,26,6,1940,26/06/1940,1,1, ,3, ,3, ,1,9, ,1, ,2, , , , ,2, , , , ,2,1,2,2,4, ,5,1,2,7, , , , , , , , , , , , , ,2,1,2,2,2,2,1,38, ,1,1,0,3,11, , , , , , , ,1, ,1,2,2,2,2,2,2,2,2,3, , , , , , , ,1,20, , , , , , ,1,3, ,1, , ,1,4,1, ,1, , ,2,5, , , , , , ,88, , , , , , ,M0101,5,3,1,211.808881,15,1,1
10010,2,1,1,1,75,4,2,8,1936,02/08/1936,2,2, ,3, ,3, ,1, , ,1, ,3, , , , ,2, , , , ,2,1,2,2,4, ,5,1,2,6,9, , , , , , , , , , , , ,2,2,2,2,2,1,2, , , , , , , , , , , , , , , , ,2,2,2,2,2,2,2,2,1, , , , , , , , ,2,6, , , , , , ,2, , , , , , , , , , , , , , , , , , , , ,88, , , , , , ,M0101,5,3,1,240.105522,15,1,1
10010,3,1,1,1,42,10,30,1,1969,30/01/1969,2,3, ,1,2,1,2,1, , ,1, ,1, , , , ,2, , , , ,2,1,2,3,3, ,6, , ,1, ,1,1,2,2,2,2,2,2,2,54,1,54,2,2,2,2,2,1,2, , , , , , , , , , , , , , , , ,2,2,2,2,2,2,2,2,1, , , , , , , , ,2,20, , , ,2, , ,2, , , , , , , , , , , , , , , , , , , , ,88, , , , , , ,M0101,5,3,1,224.754145,15,1,1
10010,4,1,1,1,35,3,18,8,1976,18/08/1976,1,3, ,1,2,1,2,1, , ,1, ,1, , , , ,2, , , , ,2,1,2,3,3, ,6, , ,1, ,1,1,2,2,2,2,2,2,2,54,1,54,2,2,2,2,2,1,2, , , , , , , , , , , , , , , , ,2,2,2,2,2,2,2,2,1, , , , , , , , ,2,20, , , ,2, , ,2, , , , , , , , , , , , , , , , , , , , ,88, , , , , , ,M0101,5,3,1,234.198049,15,1,1
10011,1,1,1,1,38,5,2,7,1973,02/07/1973,1,1, ,3, ,3, ,1, , ,1, ,1, , , , ,2, , , , ,2,1,2,4,3, ,5,1,2,1, ,5,2,2,2,2,2,2,1,2,70,1,200,2,2,2,2,2,1,2, , , , , , , , , , , , , , , , ,2,2,2,2,2,2,2,2,1, , , , , , , , ,2,20, , , ,1,2, ,2, , , , , , , , , , , , , , , , , , , , ,88, , , , , , ,M0101,5,3,1,275.654006,15,1,1
10011,2,1,1,1,31,3,13,8,1980,13/08/1980,2,2, ,2, ,2, ,1, , ,1, ,1, , , , ,2, , , , ,2,1,2,4,3, ,5,1,2,1, ,1,1,1,1,1,1,2,2,2,40,4,8000,2,2,2,2,2,1,2, , , , , , , , , , , , , , , , ,2,2,2,2,2,2,2,2,1, , , , , , , , ,1,20, , , ,2, , ,2, , , , , , , , , , , , , , , , , , , , ,88, , , , , , ,M0101,5,3,1,302.871898,15,1,1
10011,3,1,1,1,33,8,17,3,1978,17/03/1978,2,77,HERMANA,3, ,3, ,1, , ,1, ,1, , , , ,2, , , , ,2,1,2,10,4, ,6, , ,1, ,1,1,1,1,1,1,2,2,2,40,4,6000,2,2,2,2,2,1,2, , , , , , , , , , , , , , , , ,2,2,2,2,2,2,2,2,1, , , , , , , , ,1,20, , , ,2, , ,2, , , , , , , , , , , , , , , , , , , , ,88, , , , , , ,M0101,5,3,1,302.871898,15,1,1
10011,4,1,1,1,11,5,24,6,2000,24/06/2000,1,3, ,1,1,1,1,1, , ,1, ,3, , , , ,2, , , , ,2,1,1,2,4, , , , ,5,9, , , , , , , , , , , , ,2,2,2,2,2,1,2, , , , , , , , , , , , , , , , ,2,2,2,2,2,2,2,2,1, , , , , , , , ,2,20, , , , , , ,2, , , , , , , , , , , , , , , , , , , , ,17, , , , , , ,M0101,5,3,1,308.140655,15,1,1
10011,5,1,1,1,7,9,19,2,2004,19/02/2004,1,3, ,1,1,1,1,1, , ,1, ,3, , , , ,2, , , , ,2,1,1,2,1, , , , , , , , , , , , , , , , , , , , , , , , ,2, , , , , , , , , , , , , , , , ,2,2,2,2,2,2,2,2,1, , , , , , , , ,2, , , , , , , ,2, , , , , , , , , , , , , , , , , , , , ,88, , , , , , ,M0101,5,3,1,290.255128,15,1,1
10011,6,1,1,1,2,7,9,5,2009,09/05/2009,1,77,SOBRINO,1,3,2, ,1, , ,1, ,3, , , , , , , , , , , , , , , , , , , , , , , , , , , , , , , , , , , , , , ,2, , , , , , , , , , , , , , , , , , , , , , , , , , , , , , , , , ,2, , , , , , , ,2, , , , , , , , , , , , , , , , , , , , ,88, , , , , , ,M0101,5,3,1,265.993098,15,1,1
10012,1,1,1,1,40,10,6,2,1971,06/02/1971,1,1, ,2, ,2, ,6,8, ,6, ,3, , ,1,2010,2, , , , ,1,1,2,2,6, ,5,1,2,3,9, , , , , , , , , , , , ,2,2,2,2,2,1,2, , , , , , , , , , , , , , , , ,2,2,2,2,2,2,2,2,1, , , , , , , , ,2,20, , , ,2, , ,2, , , , , , , , , , , , , , , , , , , , ,88, , , , , , ,M0101,5,3,1,275.654006,15,6,6
10012,2,1,1,1,37,6,17,5,1974,17/05/1974,2,2, ,2, ,2, ,6, , ,6, ,6, , ,1,2010,2, , , , ,1,1,2,2,6, ,5,1,1,6,9, , , , , , , , , , , , ,2,2,2,2,2,1,2, , , , , , , , , , , , , , , , ,2,2,2,2,2,2,2,2,1, , , , , , , , ,2,20, , , ,2, , ,2, , , , , , , , , , , , , , , , , , , , ,88, , , , , , ,M0101,5,3,1,264.538414,15,6,6
10012,3,1,1,1,10,5,17,6,2001,17/06/2001,1,3, ,1,2,1,1,6, , ,6, ,3, , ,1,2010,2, , , , ,1,1,1,2,4, , , , ,5,9, , , , , , , , , , , , ,1,2,2,2,2,2,1,5, ,1,1,0,2,11, , , , , , , ,8, ,2,2,2,2,2,2,2,2,1, , , , , , , , ,1,20, , , , , , ,2, , , , , , , , , , , , , , , , , , , , ,17, , , , , , ,M0101,5,3,1,308.140655,15,6,6
10012,4,1,1,1,7,6,24,5,2004,24/05/2004,2,3, ,1,2,1,1,6, , ,6, ,3, , ,1,2010,2, , , , ,1,1,1,2,1, , , , , , , , , , , , , , , , , , , , , , , , ,2, , , , , , , , , , , , , , , , ,2,2,2,2,2,2,2,2,1, , , , , , , , ,2, , , , , , , ,2, , , , , , , , , , , , , , , , , , , , ,88, , , , , , ,M0101,5,3,1,287.766706,15,6,6
10014,1,1,1,1,26,11,5,1,1985,05/01/1985,2,1, ,2, ,3, ,1, , ,1, ,1, , , , ,2, , , , ,2,1,2,4,3, ,6, , ,1, ,1,1,1,1,2,1,2,2,2,51,2,900,2,2,2,2,2,1,2, , , , , , , , , , , , , , , , ,2,2,2,2,2,2,2,2,1, , , , , , , , ,2,20, , , ,2, , ,1,1, ,1, , ,1,1,1, ,1, , ,1,5, , , , , , ,88, , , , , , ,M0101,5,3,1,302.871898,15,1,1
10014,2,1,1,1,3,0,30,11,2008,30/11/2008,2,3, ,1,1,2, ,1, , ,1, ,3, , , , ,2, , , , ,2, , , , , , , , , , , , , , , , , , , , , , , , , , , , ,1,77,INFECCION EN EL ESTOMAGO,1,1,0,3,11, , , , , , , ,1, , , , , , , , , , , , , , , , , , ,1, , , , , , , ,2, , , , , , , , , , , , , , , , , , , , ,88, , , , , , ,M0101,5,3,1,285.231237,15,1,1
10015,1,1,1,1,35,1,18,10,1976,18/10/1976,1,1, ,2, ,2, ,1, , ,1, ,1, , , , ,2, , , , ,2,1,2,3,3, ,5,1,2,1, ,5,1,1,1,1,2,2,2,2,60,2,999999,2,2,2,2,2,1,2, , , , , , , , , , , , , , , , ,2,2,2,2,2,2,2,2,1, , , , , , , , ,2,20, , , ,1,2, ,2, , , , , , , , , , , , , , , , , , , , ,88, , , , , , ,M0101,5,3,1,275.654006,15,1,1
10015,2,1,1,1,36,8,12,4,1975,12/04/1975,2,2, ,2, ,2, ,1, , ,1, ,3, , , , ,2, , , , ,2,1,2,8,3, ,5,1,1,6,9, , , , , , , , , , , , ,2,2,2,2,2,1,2, , , , , , , , , , , , , , , , ,2,2,2,2,2,2,2,2,1, , , , , , , , ,2,20, , , ,2, , ,2, , , , , , , , , , , , , , , , , , , , ,88, , , , , , ,M0101,5,3,1,264.538414,15,1,1
10015,3,1,1,1,18,2,7,10,1993,07/10/1993,2,3, ,1,2,1,1,1, , ,1, ,3, , , , ,2, , , , ,2,1,2,4,3, ,6, , ,5,9, , , , , , , , , , , , ,2,2,2,2,2,1,2, , , , , , , , , , , , , , , , ,2,2,2,2,2,2,2,2,1, , , , , , , , ,2,20, , , ,2, , ,2, , , , , , , , , , , , , , , , , , , , ,88, , , , , , ,M0101,5,3,1,252.312714,15,1,1
10015,4,1,1,1,17,0,2,12,1994,02/12/1994,1,3, ,1,2,1,1,1, , ,1, ,3, , , , ,2, , , , ,2,1,1,3,3, ,6, , ,5,9, , , , , , , , , , , , ,2,2,2,2,2,1,2, , , , , , , , , , , , , , , , ,2,2,2,2,2,2,2,2,1, , , , , , , , ,2,20, , , , , , ,2, , , , , , , , , , , , , , , , , , , , ,88, , , , , , ,M0101,5,3,1,270.517139,15,1,1
10015,5,1,1,1,12,0,28,11,1999,28/11/1999,2,3, ,1,2,1,1,1, , ,1, ,3, , , , ,2, , , , ,2,1,1,2,6, ,6, , ,5,9, , , , , , , , , , , , ,2,2,2,2,2,1,2, , , , , , , , , , , , , , , , ,2,2,2,2,2,2,2,2,1, , , , , , , , ,2,20, , , , , , ,2, , , , , , , , , , , , , , , , , , , , ,88, , , , , , ,M0101,5,3,1,291.901699,15,1,1