folio_sel,numero1,est_var,region_h,code_upm,ponde_f,sexo,edad,rural,dias1,recomendable1,gpo_diversidad1,dias2,recomendable2,gpo_diversidad2,dias3,recomendable3,gpo_diversidad3,dias4,recomendable4,gpo_diversidad4,dias5,recomendable5,gpo_diversidad5,dias6,recomendable6,gpo_diversidad6,dias7,recomendable7,gpo_diversidad7,dias8,recomendable8,gpo_diversidad8,dias9,recomendable9,gpo_diversidad9,dias10,recomendable10,gpo_diversidad10,dias11,recomendable11,gpo_diversidad11,dias12,recomendable12,gpo_diversidad12,dias13,recomendable13,gpo_diversidad13,entidad,desc_ent,munici,locali,diversidad
010010001262A0130151,4,222,2,2o50,4556.344047651467,2,7,2,2,1,0,3,1,1,6,1,1,,,0,1,0,0,26,0,1,3,0,1,7,0,1,7,1,1,7,0,1,3,1,1,3,1,1,4,1,0,01,AGUASCALIENTES,001,0001,9
010010001262A0130261,7,222,2,2o50,13062.515849574896,1,10,2,,,0,3,1,1,6,1,1,3,0,1,2,0,0,3,0,1,6,0,1,9,0,1,7,1,1,10,0,1,3,1,1,1,1,0,,,0,01,AGUASCALIENTES,001,0001,9
010010001262A0170081,3,222,2,2o50,11785.194010680656,1,11,2,4,1,0,1,1,0,,,0,1,0,0,4,0,1,,,0,2,0,0,1,0,0,3,1,0,,,0,2,1,0,,,0,2,1,0,01,AGUASCALIENTES,001,0001,1
010010001262A0170191,4,222,2,2o50,4110.8006450939565,2,6,2,1,1,0,,,0,10,1,1,1,0,0,3,0,1,12.5,0,1,3,0,1,17,0,1,7,1,1,3,0,1,1,1,0,3,1,1,,,0,01,AGUASCALIENTES,001,0001,8
010010001262A0280211,3,222,2,2o50,7397.66287682373,2,6,2,17,1,1,,,0,7,1,1,,,0,1,0,0,19,0,1,3,0,1,4,0,1,7,1,1,9,0,1,10,1,1,,,0,17.5,1,1,01,AGUASCALIENTES,001,0001,9
01001000127230010191,5,223,2,2o71,1974.0997974561421,1,10,2,6,1,0,,,0,3,1,1,,,0,2,0,0,3,0,1,,,0,15,0,1,7,1,1,10,0,1,3,1,1,1,1,0,8,1,1,01,AGUASCALIENTES,001,0001,7
01001000127230070541,3,223,2,2o71,2858.124557800913,2,7,2,5.5,1,0,3,1,1,4,1,1,,,0,3,0,1,,,0,3,0,1,5.5,0,1,1,1,0,3,0,1,3,1,1,,,0,6,1,0,01,AGUASCALIENTES,001,0001,7
01001000127230130161,3,223,2,2o71,12035.716726454017,1,9,2,5,1,0,,,0,,,0,1,0,0,,,0,,,0,,,0,2,0,0,7,1,1,,,0,1,1,0,,,0,8,1,1,01,AGUASCALIENTES,001,0001,2
01001000127230320181,2,223,2,2o71,7845.741288769451,2,11,2,2,1,0,,,0,2,1,0,,,0,,,0,8,0,1,4,0,1,8,0,1,7,1,1,1,0,0,1,1,0,,,0,,,0,01,AGUASCALIENTES,001,0001,4
01001000127230320181,3,223,2,2o71,4590.367060574631,2,7,2,5,1,0,,,0,1,1,0,,,0,,,0,10,0,1,,,0,7,0,1,7,1,1,,,0,1,1,0,1,1,0,7,1,1,01,AGUASCALIENTES,001,0001,4
01001000127230320351,2,223,2,2o71,5959.601351370004,1,6,2,3,1,0,,,0,1,1,0,3,0,1,3,0,1,1,0,0,3,0,1,1,0,0,7,1,1,3,0,1,,,0,1,1,0,,,0,01,AGUASCALIENTES,001,0001,5
01001000127230320431,3,223,2,2o71,4590.367060574631,2,6,2,14,1,1,,,0,,,0,2,0,0,1,0,0,10,0,1,5,0,1,12.5,0,1,7,1,1,8,0,1,7,1,1,,,0,7,1,1,01,AGUASCALIENTES,001,0001,8
01001000127230380011,5,223,2,2o71,2385.612119547182,2,9,2,9,1,1,7,1,1,4,1,1,,,0,5.5,0,1,24,0,1,3,0,1,3,0,1,7,1,1,,,0,6,1,1,,,0,,,0,01,AGUASCALIENTES,001,0001,9
01001000127230380181,4,223,2,2o71,8667.278112714286,2,10,2,3,1,0,,,0,1,1,0,,,0,,,0,6,0,1,,,0,10,0,1,,,0,3,0,1,6,1,1,3,1,1,1,1,0,01,AGUASCALIENTES,001,0001,5
01001000127230380181,6,223,2,2o71,5071.029809559685,2,5,2,3,1,0,,,0,1,1,0,,,0,,,0,6,0,1,,,0,7,0,1,7,1,1,7,0,1,6,1,1,3,1,1,,,0,01,AGUASCALIENTES,001,0001,6
02002000143500020131,3,122,1,1a45,3007.033750974806,1,11,2,,,0,7,1,1,3,1,1,3,0,1,1,0,0,13,0,1,7,0,1,,,0,7,1,1,3,0,1,4,1,1,,,0,1,1,0,02,BAJA CALIFORNIA,002,0001,8
02002000143500020131,4,122,1,1a45,2982.9418296302874,1,9,2,8,1,1,7,1,1,6,1,1,3,0,1,,,0,7,0,1,14,0,1,5.5,0,1,7,1,1,3,0,1,,,0,3,1,1,,,0,02,BAJA CALIFORNIA,002,0001,10
02002000143500190021,3,122,1,1a45,2208.9327849739634,2,6,2,7,1,1,6,1,1,7,1,1,,,0,,,0,20,0,1,5.5,0,1,8.5,0,1,7,1,1,,,0,1,1,0,5.5,1,1,12,1,1,02,BAJA CALIFORNIA,002,0001,9
02002000143500340051,4,122,1,1a45,2734.3633438277634,1,8,2,6,1,0,3,1,1,1,1,0,3,0,1,1,0,0,,,0,7,0,1,14,0,1,7,1,1,,,0,6,1,1,3,1,1,6,1,0,02,BAJA CALIFORNIA,002,0001,7
02002012435799990061,5,111,1,1o01,613.1716384823914,1,11,1,,,0,1,1,0,2,1,0,1,0,0,4,0,1,4,0,1,2,0,0,12.5,0,1,3,1,0,,,0,1,1,0,3,1,1,,,0,02,BAJA CALIFORNIA,002,0124,4
02002012435799990081,3,111,1,1o01,204.3905461607971,1,10,1,10,1,1,7,1,1,1,1,0,,,0,,,0,1,0,0,3,0,1,6.5,0,1,7,1,1,,,0,7,1,1,3,1,1,5,1,0,02,BAJA CALIFORNIA,002,0124,7
02002012435799990101,4,111,1,1o01,1572.4005043023355,2,9,1,7.5,1,1,3,1,1,4,1,1,,,0,,,0,1,0,0,1,0,0,4,0,1,7,1,1,,,0,1,1,0,3,1,1,,,0,02,BAJA CALIFORNIA,002,0124,6
02002012435799990111,4,111,1,1o01,204.3905461607971,1,10,1,4,1,0,,,0,3,1,1,,,0,,,0,6,0,1,4,0,1,8,0,1,7,1,1,,,0,3,1,1,,,0,,,0,02,BAJA CALIFORNIA,002,0124,6
020020167348A9990011,4,112,1,1o31,334.0740595630897,1,7,1,2,1,0,3,1,1,,,0,3,0,1,2,0,0,3,0,1,1,0,0,10,0,1,7,1,1,1,0,0,3,1,1,3,1,1,4,1,0,02,BAJA CALIFORNIA,002,0167,7
020020167348A9990091,3,112,1,1o31,332.89852482297164,2,11,1,16.5,1,1,3,1,1,7,1,1,3,0,1,5,0,1,5,0,1,,,0,13,0,1,7,1,1,3,0,1,10,1,1,,,0,17,1,1,02,BAJA CALIFORNIA,002,0167,11
020020167348A9990121,4,112,1,1o31,665.7970496459433,2,11,1,1,1,0,3,1,1,3,1,1,,,0,1,0,0,3,0,1,,,0,3,0,1,7,1,1,,,0,3,1,1,3,1,1,13,1,1,02,BAJA CALIFORNIA,002,0167,8
020020167348A9990121,5,112,1,1o31,208.81032017524484,1,8,1,5,1,0,,,0,,,0,,,0,1,0,0,6,0,1,,,0,7,0,1,7,1,1,,,0,6,1,1,3,1,1,4,1,0,02,BAJA CALIFORNIA,002,0167,5
02002017035799990011,5,111,1,1o01,381.345828606225,1,6,1,4,1,0,7,1,1,2,1,0,3,0,1,,,0,10,0,1,10,0,1,7,0,1,7,1,1,,,0,7,1,1,3,1,1,7,1,1,02,BAJA CALIFORNIA,002,0170,9
02002017035799990071,4,111,1,1o01,381.345828606225,1,6,1,,,0,,,0,,,0,3,0,1,1,0,0,,,0,,,0,13,0,1,7,1,1,7,0,1,,,0,3,1,1,,,0,02,BAJA CALIFORNIA,002,0170,5
02002025535799990031,5,111,1,1o01,333.8327224518804,2,8,1,15.5,1,1,,,0,1,1,0,,,0,1,0,0,14.5,0,1,7,0,1,6,0,1,7,1,1,1,0,0,4,1,1,3,1,1,8.5,1,1,02,BAJA CALIFORNIA,002,0255,8
02002025535799990111,3,111,1,1o01,346.0151976488029,2,7,1,3,1,0,5.5,1,1,,,0,,,0,,,0,9,0,1,,,0,3,0,1,7,1,1,,,0,6,1,1,3,1,1,5,1,0,02,BAJA CALIFORNIA,002,0255,6
020020270348A9990091,3,112,1,1o31,1029.6159624569914,1,7,1,16,1,1,7,1,1,6,1,1,7,0,1,2,0,0,7,0,1,1,0,0,12.5,0,1,7,1,1,,,0,3,1,1,3,1,1,38,1,1,02,BAJA CALIFORNIA,002,0270,10
020020270348A9990101,5,112,1,1o31,1385.0122391582393,2,9,1,17,1,1,7,1,1,3,1,1,,,0,1,0,0,15,0,1,13.5,0,1,14,0,1,7,1,1,,,0,3,1,1,,,0,5,1,0,02,BAJA CALIFORNIA,002,0270,8
020020521348A9990031,3,112,1,1o31,704.6441865784487,1,5,1,8,1,1,14,1,1,,,0,,,0,,,0,3,0,1,,,0,13,0,1,7,1,1,8,0,1,,,0,,,0,,,0,02,BAJA CALIFORNIA,002,0521,6
020020521348A9990101,4,112,1,1o31,982.4591180228537,2,5,1,18,1,1,,,0,3,1,1,3,0,1,,,0,24,0,1,,,0,10,0,1,7,1,1,7,0,1,14,1,1,3,1,1,34,1,1,02,BAJA CALIFORNIA,002,0521,10
020020521348A9990111,3,112,1,1o31,1895.7375531240762,2,9,1,12.5,1,1,17,1,1,4,1,1,3,0,1,,,0,10,0,1,,,0,3,0,1,7,1,1,,,0,17,1,1,3,1,1,8,1,1,02,BAJA CALIFORNIA,002,0521,10
020020521348A9990131,5,112,1,1o31,704.6441865784487,1,6,1,14,1,1,7,1,1,4,1,1,,,0,3,0,1,15,0,1,6,0,1,13,0,1,3,1,0,3,0,1,10,1,1,3,1,1,6,1,0,02,BAJA CALIFORNIA,002,0521,10
020020521348A9990151,3,112,1,1o31,1895.7375531240762,2,8,1,16,1,1,9,1,1,,,0,,,0,,,0,9,0,1,4,0,1,10,0,1,7,1,1,1,0,0,4,1,1,3,1,1,4,1,0,02,BAJA CALIFORNIA,002,0521,8
020020521348A9990181,3,112,1,1o31,947.8687765620381,2,8,1,6,1,0,10,1,1,,,0,,,0,,,0,12.5,0,1,,,0,,,0,7,1,1,,,0,3,1,1,,,0,,,0,02,BAJA CALIFORNIA,002,0521,4
020040001393A0020111,4,123,1,1o61,22913.823371566228,2,10,2,7,1,1,1,1,0,,,0,1,0,0,1,0,0,3,0,1,2,0,0,12.5,0,1,7,1,1,3,0,1,,,0,5.5,1,1,,,0,02,BAJA CALIFORNIA,004,0001,6
020040001393A0020271,5,123,1,1o61,30754.359622690445,1,6,2,10,1,1,,,0,3,1,1,3,0,1,2,0,0,14.5,0,1,7,0,1,3,0,1,7,1,1,1,0,0,10,1,1,3,1,1,4,1,0,02,BAJA CALIFORNIA,004,0001,9
020040001393A0021031,5,123,1,1o61,30754.359622690445,1,5,2,2,1,0,7,1,1,,,0,,,0,,,0,1,0,0,3,0,1,1,0,0,7,1,1,7,0,1,,,0,5.5,1,1,3,1,0,02,BAJA CALIFORNIA,004,0001,5
020040001393A0060171,3,123,1,1o61,5193.022190370334,2,7,2,13,1,1,3,1,1,2,1,0,3,0,1,1,0,0,6,0,1,,,0,1,0,0,7,1,1,,,0,9.5,1,1,3,1,1,14.5,1,1,02,BAJA CALIFORNIA,004,0001,8
020040001393A0150051,5,123,1,1o61,3459.103488686725,1,9,2,4,1,0,3,1,1,4,1,1,,,0,4,0,1,5,0,1,1,0,0,5,0,1,7,1,1,3,0,1,6,1,1,3,1,1,1,1,0,02,BAJA CALIFORNIA,004,0001,9
020040001393A0600541,4,123,1,1o61,28546.706685583067,1,9,2,7,1,1,4,1,1,,,0,,,0,1,0,0,6,0,1,1,0,0,8.5,0,1,7,1,1,,,0,10,1,1,3,1,1,4,1,0,02,BAJA CALIFORNIA,004,0001,7
02004000139970100121,3,123,1,1o62,7881.262423203342,2,5,2,,,0,3,1,1,1,1,0,,,0,1,0,0,3,0,1,3,0,1,1,0,0,7,1,1,6,0,1,,,0,7,1,1,,,0,02,BAJA CALIFORNIA,004,0001,6
02004000139970130361,3,123,1,1o62,14886.612244438224,1,7,2,9,1,1,2,1,0,4,1,1,3,0,1,1,0,0,5,0,1,,,0,3,0,1,7,1,1,,,0,8.5,1,1,,,0,7,1,1,02,BAJA CALIFORNIA,004,0001,8
02004000153150030101,8,122,1,1o44,3068.6529245500287,2,6,2,3,1,0,7,1,1,7,1,1,5.5,0,1,4,0,1,3,0,1,4,0,1,3,0,1,7,1,1,1,0,0,3,1,1,5.5,1,1,9,1,1,02,BAJA CALIFORNIA,004,0001,11
02004000153150030381,5,122,1,1o44,4254.125801386728,1,7,2,14.5,1,1,3,1,1,4,1,1,,,0,,,0,15.5,0,1,1,0,0,4,0,1,7,1,1,,,0,7,1,1,,,0,7,1,1,02,BAJA CALIFORNIA,004,0001,8
02004000153150080091,2,122,1,1o44,3852.661641258884,2,6,2,10,1,1,6,1,1,,,0,,,0,1,0,0,19,0,1,4,0,1,7,0,1,7,1,1,7,0,1,,,0,7,1,1,,,0,02,BAJA CALIFORNIA,004,0001,8
02004000153150150071,5,122,1,1o44,9511.258426857872,2,7,2,16,1,1,6,1,1,1,1,0,3,0,1,3,0,1,18,0,1,8.5,0,1,11,0,1,7,1,1,4,0,1,,,0,1,1,0,13,1,1,02,BAJA CALIFORNIA,004,0001,10
02004000153150220101,4,122,1,1o44,3136.992887832257,1,11,2,7,1,1,3,1,1,,,0,3,0,1,,,0,9,0,1,6,0,1,2,0,0,7,1,1,,,0,6,1,1,3,1,1,,,0,02,BAJA CALIFORNIA,004,0001,8
02004000153150220121,5,122,1,1o44,1795.6358092003056,2,6,2,9,1,1,3,1,1,1,1,0,1,0,0,1,0,0,6,0,1,1,0,0,,,0,7,1,1,,,0,8,1,1,5.5,1,1,2,1,0,02,BAJA CALIFORNIA,004,0001,6
02004000153150290211,4,122,1,1o44,11569.250016294955,2,6,2,8,1,1,,,0,2,1,0,3,0,1,6,0,1,20.5,0,1,12,0,1,13,0,1,7,1,1,,,0,7,1,1,3,1,1,4,1,0,02,BAJA CALIFORNIA,004,0001,9
02004000153150290251,2,122,1,1o44,5580.960396985571,2,9,2,6,1,0,,,0,1,1,0,,,0,,,0,14,0,1,20,0,1,,,0,7,1,1,7,0,1,,,0,5.5,1,1,1,1,0,02,BAJA CALIFORNIA,004,0001,5
02004000153150360061,5,122,1,1o44,5335.273001683858,2,10,2,5,1,0,12.5,1,1,1,1,0,3,0,1,1,0,0,3,0,1,1,0,0,3,0,1,3,1,0,,,0,5.5,1,1,,,0,12,1,1,02,BAJA CALIFORNIA,004,0001,6
02004000153150360171,4,122,1,1o44,5335.273001683858,2,11,2,10.5,1,1,,,0,,,0,3,0,1,1,0,0,5,0,1,,,0,3,0,1,7,1,1,1,0,0,7,1,1,3,1,1,1,1,0,02,BAJA CALIFORNIA,004,0001,7
02004190382010010401,4,122,1,1o45,28284.57645095979,2,8,2,12.5,1,1,6,1,1,,,0,,,0,1,0,0,5.5,0,1,5,0,1,7,0,1,7,1,1,,,0,3,1,1,3,1,1,2,1,0,02,BAJA CALIFORNIA,004,1903,8
02004190382010040121,3,122,1,1o45,7862.6486038367575,1,7,2,3,1,0,,,0,1,1,0,,,0,6,0,1,14.5,0,1,13,0,1,3,0,1,7,1,1,4,0,1,,,0,3,1,1,,,0,02,BAJA CALIFORNIA,004,1903,7
02004190382010160081,5,122,1,1o45,4010.220291945037,1,9,2,4,1,0,,,0,3,1,1,1,0,0,3,0,1,8.5,0,1,4,0,1,6.5,0,1,7,1,1,9,0,1,1,1,0,1,1,0,,,0,02,BAJA CALIFORNIA,004,1903,7
02004190382010160141,3,122,1,1o45,8020.440583890074,1,9,2,5,1,0,1,1,0,1,1,0,,,0,1,0,0,6,0,1,7.5,0,1,,,0,7,1,1,,,0,7,1,1,3,1,1,2,1,0,02,BAJA CALIFORNIA,004,1903,5
02004190382010200311,5,122,1,1o45,11890.822342480173,2,7,2,15,1,1,,,0,3,1,1,,,0,3,0,1,3,0,1,,,0,6.5,0,1,7,1,1,,,0,3,1,1,1,1,0,6,1,0,02,BAJA CALIFORNIA,004,1903,7
02004190382010200441,3,122,1,1o45,20606.946733456578,1,8,2,1,1,0,3,1,1,4,1,1,,,0,,,0,4,0,1,,,0,2,0,0,7,1,1,,,0,,,0,1,1,0,,,0,02,BAJA CALIFORNIA,004,1903,4
02004190382010270011,3,122,1,1o45,4776.8800536404115,1,8,2,8,1,1,,,0,,,0,6,0,1,3,0,1,6,0,1,9,0,1,4,0,1,7,1,1,6,0,1,,,0,3,1,1,3,1,0,02,BAJA CALIFORNIA,004,1903,9
02004190382010350281,5,122,1,1o45,8522.209514107071,2,7,2,24.5,1,1,3,1,1,3,1,1,6,0,1,3,0,1,9,0,1,5,0,1,3,0,1,7,1,1,1,0,0,9,1,1,3,1,1,,,0,02,BAJA CALIFORNIA,004,1903,11
03001000128260080021,3,122,1,1o46,2870.637139944857,1,8,2,11,1,1,7,1,1,1,1,0,,,0,1,0,0,2,0,0,1,0,0,,,0,7,1,1,14,0,1,3,1,1,,,0,1,1,0,03,BAJA CALIFORNIA SUR,001,0001,5
03001000128260080111,4,122,1,1o46,3601.2007425301276,1,11,2,6,1,0,7,1,1,1,1,0,3,0,1,2,0,0,4,0,1,,,0,10,0,1,7,1,1,1,0,0,,,0,,,0,4,1,0,03,BAJA CALIFORNIA SUR,001,0001,5
03001000128260080111,5,122,1,1o46,2870.637139944857,1,9,2,4,1,0,7,1,1,1,1,0,3,0,1,2,0,0,3,0,1,3,0,1,10,0,1,7,1,1,,,0,3,1,1,7,1,1,2,1,0,03,BAJA CALIFORNIA SUR,001,0001,8
03001000128260130131,7,122,1,1o46,9903.786552410738,2,6,2,2,1,0,,,0,1,1,0,,,0,,,0,,,0,,,0,2,0,0,7,1,1,5.5,0,1,,,0,,,0,3,1,0,03,BAJA CALIFORNIA SUR,001,0001,2
03001000128260130181,3,122,1,1o46,6610.996057197599,2,11,2,1,1,0,5.5,1,1,,,0,,,0,1,0,0,8.5,0,1,,,0,8,0,1,7,1,1,,,0,,,0,3,1,1,,,0,03,BAJA CALIFORNIA SUR,001,0001,5
03001000128260230051,5,122,1,1o46,11701.523809307353,1,5,2,12,1,1,3,1,1,1,1,0,,,0,3,0,1,7,0,1,,,0,,,0,7,1,1,7,0,1,3,1,1,3,1,1,13,1,1,03,BAJA CALIFORNIA SUR,001,0001,9
03001000128260230111,3,122,1,1o46,5634.371639657043,2,10,2,9,1,1,,,0,2,1,0,1,0,0,1,0,0,9,0,1,3,0,1,2,0,0,7,1,1,1,0,0,3,1,1,5.5,1,1,2,1,0,03,BAJA CALIFORNIA SUR,001,0001,6
03001000128260340111,3,122,1,1o46,4000.7649785434264,1,11,2,3,1,0,3,1,1,,,0,3,0,1,3,0,1,1,0,0,,,0,1,0,0,7,1,1,3,0,1,3,1,1,,,0,10,1,1,03,BAJA CALIFORNIA SUR,001,0001,7
03003033625919990011,5,111,1,1o02,882.2173886312154,1,5,1,10,1,1,7,1,1,6,1,1,,,0,1,0,0,4,0,1,1,0,0,2,0,0,7,1,1,8.5,0,1,13,1,1,,,0,19.5,1,1,03,BAJA CALIFORNIA SUR,003,0336,8
03003033625919990041,3,111,1,1o02,441.1086943156077,1,7,1,4,1,0,7,1,1,6,1,1,3,0,1,3,0,1,5.5,0,1,6.5,0,1,5,0,1,7,1,1,3,0,1,6,1,1,3,1,1,3,1,0,03,BAJA CALIFORNIA SUR,003,0336,11
03003033625919990081,5,111,1,1o02,706.9477717014768,2,6,1,3,1,0,3,1,1,1,1,0,,,0,1,0,0,11.5,0,1,6,0,1,5,0,1,7,1,1,,,0,11.5,1,1,,,0,,,0,03,BAJA CALIFORNIA SUR,003,0336,6
03003033625919990101,4,111,1,1o02,441.1086943156077,1,6,1,6,1,0,5.5,1,1,9,1,1,3,0,1,1,0,0,8,0,1,8.5,0,1,13,0,1,7,1,1,10,0,1,6,1,1,,,0,,,0,03,BAJA CALIFORNIA SUR,003,0336,9
03003033625919990111,5,111,1,1o02,706.9477717014768,2,5,1,5,1,0,,,0,,,0,3,0,1,1,0,0,1,0,0,4,0,1,7,0,1,7,1,1,13,0,1,13,1,1,,,0,3,1,0,03,BAJA CALIFORNIA SUR,003,0336,6
03003033625919990131,3,111,1,1o02,664.9361629743146,1,11,1,,,0,,,0,3,1,1,3,0,1,1,0,0,3,0,1,,,0,9,0,1,7,1,1,3,0,1,6.5,1,1,,,0,,,0,03,BAJA CALIFORNIA SUR,003,0336,7
03003069725919990081,3,111,1,1o02,414.5228074503374,1,7,1,8,1,1,7,1,1,,,0,,,0,,,0,,,0,,,0,1,0,0,7,1,1,1,0,0,6,1,1,1,1,0,3,1,0,03,BAJA CALIFORNIA SUR,003,0697,4
03003069725919990091,3,111,1,1o02,664.3396034193458,2,6,1,6,1,0,,,0,1,1,0,,,0,,,0,,,0,,,0,13,0,1,7,1,1,6,0,1,10,1,1,,,0,1,1,0,03,BAJA CALIFORNIA SUR,003,0697,4
03003069725919990141,5,111,1,1o02,829.0456149006748,1,7,1,9,1,1,5.5,1,1,3,1,1,,,0,2,0,0,15,0,1,,,0,2,0,0,7,1,1,3,0,1,8.5,1,1,5.5,1,1,4,1,0,03,BAJA CALIFORNIA SUR,003,0697,8
03003102025919990021,3,111,1,1o02,1123.8204277568213,2,5,1,7,1,1,,,0,4,1,1,3,0,1,,,0,4,0,1,,,0,7,0,1,7,1,1,7,0,1,4,1,1,3,1,1,3,1,0,03,BAJA CALIFORNIA SUR,003,1020,9
03003102025919990041,2,111,1,1o02,1123.8204277568213,2,6,1,9,1,1,,,0,2,1,0,,,0,,,0,3,0,1,3,0,1,3,0,1,7,1,1,3,0,1,3,1,1,,,0,3,1,0,03,BAJA CALIFORNIA SUR,003,1020,7
03003102025919990061,6,111,1,1o02,2807.3400462217046,2,11,1,4,1,0,6,1,1,,,0,,,0,2,0,0,1,0,0,,,0,3,0,1,7,1,1,5.5,0,1,,,0,4,1,1,9,1,1,03,BAJA CALIFORNIA SUR,003,1020,6
03003102025919990081,3,111,1,1o02,1084.253048693783,2,8,1,3,1,0,5.5,1,1,3,1,1,,,0,,,0,14.5,0,1,5,0,1,13,0,1,7,1,1,7,0,1,7,1,1,,,0,,,0,03,BAJA CALIFORNIA SUR,003,1020,8
04003000111400010601,3,422,4,4o61,10826.874788536787,1,7,2,1,1,0,3,1,1,4,1,1,,,0,1,0,0,,,0,,,0,1,0,0,7,1,1,3,0,1,,,0,,,0,,,0,04,CAMPECHE,003,0001,4
04003000111400011051,7,422,4,4o61,11485.06623772406,2,7,2,4,1,0,10,1,1,,,0,,,0,,,0,1,0,0,,,0,2,0,0,7,1,1,3,0,1,2,1,0,2,1,0,,,0,04,CAMPECHE,003,0001,3
04003000111400020081,6,422,4,4o61,3407.860979741146,1,8,2,8.5,1,1,,,0,6,1,1,,,0,6,0,1,12,0,1,12,0,1,13,0,1,7,1,1,,,0,7,1,1,3,1,1,4,1,0,04,CAMPECHE,003,0001,9
04003000111400020311,2,422,4,4o61,8040.644920034412,2,9,2,,,0,,,0,1,1,0,6,0,1,4,0,1,6,0,1,1,0,0,14,0,1,7,1,1,,,0,,,0,4,1,1,,,0,04,CAMPECHE,003,0001,6
04003000111400020421,5,422,4,4o61,4318.651157877906,2,5,2,12,1,1,3,1,1,3,1,1,6,0,1,1,0,0,,,0,7,0,1,4,0,1,7,1,1,7,0,1,,,0,3,1,1,8.5,1,1,04,CAMPECHE,003,0001,10
04003000111400030161,2,422,4,4o61,2183.7420155050213,2,8,2,2,1,0,,,0,2,1,0,,,0,2,0,0,6,0,1,3,0,1,12,0,1,3,1,0,1,0,0,3,1,1,,,0,2,1,0,04,CAMPECHE,003,0001,4
04003000111400030221,3,422,4,4o61,2440.544085648493,2,11,2,,,0,,,0,1,1,0,1,0,0,1,0,0,1,0,0,1,0,0,4,0,1,7,1,1,1,0,0,3,1,1,,,0,,,0,04,CAMPECHE,003,0001,3
04003000111400030221,4,422,4,4o61,3702.135477177121,1,9,2,2,1,0,,,0,1,1,0,,,0,1,0,0,3,0,1,1,0,0,2,0,0,3,1,0,2,0,0,3,1,1,,,0,,,0,04,CAMPECHE,003,0001,2
04003000111400080591,3,422,4,4o61,10762.040396821978,2,10,2,6,1,0,3,1,1,4,1,1,3,0,1,2,0,0,10,0,1,8,0,1,13,0,1,7,1,1,,,0,7,1,1,3,1,1,7,1,1,04,CAMPECHE,003,0001,10
04003000111400120101,2,422,4,4o61,7598.168390790677,2,8,2,3,1,0,1,1,0,1,1,0,1,0,0,,,0,,,0,,,0,3,0,1,7,1,1,3,0,1,4,1,1,3,1,1,1,1,0,04,CAMPECHE,003,0001,5
04003000111400160191,3,422,4,4o61,3255.17979894298,1,11,2,,,0,,,0,,,0,,,0,,,0,,,0,,,0,1,0,0,7,1,1,,,0,,,0,1,1,0,,,0,04,CAMPECHE,003,0001,1
04011054601069990011,4,411,4,4o01,3041.9988129944713,2,7,1,9,1,1,10,1,1,3,1,1,,,0,,,0,,,0,3,0,1,15,0,1,7,1,1,,,0,1,1,0,,,0,4,1,0,04,CAMPECHE,011,0546,6
04011054601069990031,5,411,4,4o01,2639.4160832402363,2,10,1,5,1,0,5.5,1,1,3,1,1,,,0,,,0,,,0,3,0,1,8.5,0,1,7,1,1,1,0,0,3,1,1,3,1,1,6,1,0,04,CAMPECHE,011,0546,7
04011054601069990031,6,411,4,4o01,1257.453060446372,1,5,1,3,1,0,10,1,1,3,1,1,,,0,,,0,3,0,1,,,0,10,0,1,7,1,1,3,0,1,,,0,3,1,1,3,1,0,04,CAMPECHE,011,0546,7
04011054601069990041,5,411,4,4o01,2639.4160832402363,2,11,1,11,1,1,7,1,1,1,1,0,,,0,,,0,,,0,,,0,17,0,1,7,1,1,1,0,0,,,0,,,0,1,1,0,04,CAMPECHE,011,0546,4
04011054601069990041,6,411,4,4o01,1052.581946893124,1,9,1,1,1,0,3,1,1,2,1,0,,,0,,,0,,,0,1,0,0,11,0,1,7,1,1,,,0,1,1,0,,,0,3,1,0,04,CAMPECHE,011,0546,3
04011054601069990051,5,411,4,4o01,1520.9994064972357,2,6,1,,,0,7,1,1,3,1,1,,,0,,,0,,,0,,,0,12.5,0,1,7,1,1,,,0,,,0,3,1,1,9,1,1,04,CAMPECHE,011,0546,6
04011054601069990061,5,411,4,4o01,2639.4160832402363,2,10,1,2,1,0,3,1,1,1,1,0,,,0,,,0,,,0,,,0,8,0,1,7,1,1,,,0,,,0,,,0,1,1,0,04,CAMPECHE,011,0546,3
04011054601069990091,5,411,4,4o01,1257.453060446372,1,7,1,6,1,0,1,1,0,6,1,1,,,0,,,0,,,0,,,0,3,0,1,7,1,1,,,0,,,0,,,0,,,0,04,CAMPECHE,011,0546,3
04011054601069990101,6,411,4,4o01,1052.581946893124,1,8,1,13,1,1,3,1,1,6,1,1,,,0,,,0,,,0,,,0,10,0,1,7,1,1,,,0,,,0,,,0,,,0,04,CAMPECHE,011,0546,5
04011054601069990111,7,411,4,4o01,6220.621523245311,1,10,1,13,1,1,,,0,2,1,0,,,0,,,0,,,0,4,0,1,2,0,0,7,1,1,,,0,1,1,0,3,1,1,1,1,0,04,CAMPECHE,011,0546,4
04011054601069990111,8,411,4,4o01,1052.581946893124,1,8,1,10,1,1,,,0,2,1,0,,,0,,,0,,,0,6.5,0,1,7.5,0,1,7,1,1,,,0,1,1,0,2,1,0,,,0,04,CAMPECHE,011,0546,4
04011054601069990121,7,411,4,4o01,3041.9988129944713,2,7,1,2,1,0,,,0,,,0,,,0,,,0,1,0,0,1,0,0,3,0,1,7,1,1,,,0,,,0,,,0,,,0,04,CAMPECHE,011,0546,2
04011054601069990131,8,411,4,4o01,3041.9988129944713,2,7,1,12,1,1,3,1,1,6,1,1,,,0,,,0,,,0,4,0,1,17,0,1,3,1,0,,,0,,,0,3,1,1,,,0,04,CAMPECHE,011,0546,6
04011054601069990141,3,411,4,4o01,1415.9300791079434,2,8,1,9,1,1,3,1,1,1,1,0,3,0,1,,,0,1,0,0,,,0,8,0,1,7,1,1,,,0,,,0,3,1,1,,,0,04,CAMPECHE,011,0546,6
04011083501069990011,3,411,4,4o01,2669.730759844748,2,8,1,4,1,0,4,1,1,,,0,,,0,1,0,0,,,0,3,0,1,4,0,1,7,1,1,,,0,7,1,1,3,1,1,4,1,0,04,CAMPECHE,011,0835,6
04011083501069990041,2,411,4,4o01,1334.865379922374,2,9,1,10,1,1,3,1,1,3,1,1,,,0,2,0,0,10,0,1,3,0,1,10,0,1,7,1,1,7,0,1,,,0,3,1,1,,,0,04,CAMPECHE,011,0835,9
04011083501069990061,3,411,4,4o01,1334.865379922374,2,8,1,1,1,0,7,1,1,1,1,0,,,0,,,0,,,0,4,0,1,8,0,1,7,1,1,,,0,,,0,3,1,1,,,0,04,CAMPECHE,011,0835,5
04011083501069990081,5,411,4,4o01,1433.9192878046458,2,7,1,6,1,0,6,1,1,3,1,1,,,0,1,0,0,,,0,,,0,3,0,1,7,1,1,,,0,7,1,1,3,1,1,7,1,1,04,CAMPECHE,011,0835,7
04011083501069990091,4,411,4,4o01,1334.865379922374,2,9,1,10,1,1,3,1,1,3,1,1,,,0,,,0,,,0,3,0,1,17,0,1,7,1,1,,,0,,,0,3,1,1,,,0,04,CAMPECHE,011,0835,7
04011083501069990121,3,411,4,4o01,1172.8958139248791,1,10,1,1,1,0,3,1,1,,,0,,,0,,,0,,,0,4,0,1,7,0,1,7,1,1,3,0,1,,,0,3,1,1,6,1,0,04,CAMPECHE,011,0835,6
04011083501069990121,4,411,4,4o01,1433.9192878046458,2,7,1,1,1,0,3,1,1,,,0,,,0,,,0,6,0,1,2,0,0,4,0,1,7,1,1,3,0,1,3,1,1,3,1,1,4,1,0,04,CAMPECHE,011,0835,7
04011083501069990131,3,411,4,4o01,1984.639243378638,1,8,1,,,0,3,1,1,3,1,1,,,0,3,0,1,3,0,1,4,0,1,6,0,1,7,1,1,7,0,1,,,0,3,1,1,17,1,1,04,CAMPECHE,011,0835,10
04011083501069990141,4,411,4,4o01,1433.9192878046458,2,5,1,5,1,0,,,0,,,0,,,0,,,0,3,0,1,6,0,1,9,0,1,7,1,1,3,0,1,,,0,3,1,1,2,1,0,04,CAMPECHE,011,0835,6
04011127301069990031,3,411,4,4o01,1191.0802451485206,1,10,1,,,0,,,0,3,1,1,,,0,1,0,0,,,0,2,0,0,7,0,1,7,1,1,,,0,,,0,3,1,1,21,1,1,04,CAMPECHE,011,1273,5
04011127301069990091,4,411,4,4o01,2407.6814413197976,1,6,1,3,1,0,1,1,0,,,0,,,0,,,0,,,0,1,0,0,1,0,0,,,0,4,0,1,,,0,1,1,0,,,0,04,CAMPECHE,011,1273,1
04011127301069990101,3,411,4,4o01,1191.0802451485206,1,10,1,7,1,1,6,1,1,3,1,1,,,0,3,0,1,4,0,1,,,0,10,0,1,7,1,1,3,0,1,,,0,3,1,1,,,0,04,CAMPECHE,011,1273,9
04011127301069990111,3,411,4,4o01,842.2942797937185,2,11,1,,,0,,,0,,,0,,,0,,,0,,,0,,,0,1,0,0,7,1,1,3,0,1,,,0,,,0,,,0,04,CAMPECHE,011,1273,2
04011127301069990131,3,411,4,4o01,1456.1505945923145,2,6,1,2,1,0,1,1,0,1,1,0,,,0,,,0,,,0,,,0,7,0,1,7,1,1,,,0,1,1,0,,,0,,,0,04,CAMPECHE,011,1273,2
04011127301069990141,3,411,4,4o01,1456.1505945923145,2,7,1,3,1,0,3,1,1,,,0,,,0,,,0,,,0,,,0,11,0,1,7,1,1,,,0,1,1,0,3,1,1,,,0,04,CAMPECHE,011,1273,4
04011127301069990151,2,411,4,4o01,1355.5609672079925,2,8,1,1,1,0,3,1,1,6,1,1,,,0,2,0,0,,,0,3,0,1,4,0,1,7,1,1,3,0,1,1,1,0,3,1,1,,,0,04,CAMPECHE,011,1273,7
05004005502719990191,3,111,1,1o03,1227.0837297181517,1,6,1,3,1,0,,,0,,,0,,,0,1,0,0,8.5,0,1,7,0,1,13,0,1,7,1,1,,,0,7,1,1,,,0,,,0,05,COAHUILA DE ZARAGOZA,004,0055,5
05004006102719990121,3,111,1,1o03,19488.222199090207,1,7,1,13,1,1,7,1,1,1,1,0,,,0,,,0,9,0,1,10,0,1,14,0,1,7,1,1,3,0,1,7,1,1,,,0,6,1,0,05,COAHUILA DE ZARAGOZA,004,0061,8
05004009302719990011,2,111,1,1o03,245.07560973649944,2,9,1,8.5,1,1,5.5,1,1,4,1,1,3,0,1,,,0,,,0,,,0,14,0,1,7,1,1,,,0,,,0,5.5,1,1,9,1,1,05,COAHUILA DE ZARAGOZA,004,0093,8
05004009302719990071,3,111,1,1o03,254.01909351201792,2,7,1,,,0,3,1,1,,,0,,,0,,,0,1,0,0,4,0,1,6,0,1,7,1,1,,,0,7,1,1,3,1,1,,,0,05,COAHUILA DE ZARAGOZA,004,0093,6
05018000109870090021,3,123,1,1o66,2952.5720371862526,2,8,2,7,1,1,7,1,1,3,1,1,3,0,1,,,0,,,0,7,0,1,,,0,7,1,1,,,0,8,1,1,3,1,1,1,1,0,05,COAHUILA DE ZARAGOZA,018,0001,8
05018000109870090051,3,123,1,1o66,2745.3822971858103,2,11,2,7,1,1,14,1,1,3,1,1,3,0,1,3,0,1,,,0,6,0,1,10,0,1,7,1,1,,,0,7,1,1,7,1,1,6,1,0,05,COAHUILA DE ZARAGOZA,018,0001,10
05023041039779990041,4,112,1,1o32,1588.6317357745106,1,8,1,9,1,1,3,1,1,6,1,1,,,0,1,0,0,4,0,1,3,0,1,,,0,5.5,1,0,,,0,10,1,1,5.5,1,1,9,1,1,05,COAHUILA DE ZARAGOZA,023,0410,8
05023041039779990151,3,112,1,1o32,3526.9329948294962,1,10,1,6,1,0,3,1,1,4,1,1,3,0,1,,,0,,,0,3,0,1,3,0,1,,,0,3,0,1,3,1,1,3,1,1,4,1,0,05,COAHUILA DE ZARAGOZA,023,0410,8
05030000124560370071,3,123,1,1o64,25319.82654970451,1,10,2,14,1,1,10,1,1,1,1,0,,,0,,,0,6,0,1,7,0,1,1,0,0,7,1,1,3,0,1,1,1,0,3,1,1,9,1,1,05,COAHUILA DE ZARAGOZA,030,0001,8
05030000126910040101,3,123,1,1o65,5644.58933735906,2,6,2,13.5,1,1,7,1,1,8,1,1,3,0,1,,,0,10,0,1,6,0,1,11.5,0,1,5.5,1,0,3,0,1,8.5,1,1,5.5,1,1,1,1,0,05,COAHUILA DE ZARAGOZA,030,0001,10
05030000126910230411,2,123,1,1o65,14123.29335093782,1,8,2,9,1,1,7,1,1,,,0,3,0,1,,,0,,,0,,,0,2,0,0,7,1,1,,,0,7,1,1,7,1,1,3,1,0,05,COAHUILA DE ZARAGOZA,030,0001,6
05030000126910230701,3,123,1,1o65,22595.750728165163,1,5,2,5,1,0,7,1,1,,,0,,,0,,,0,3,0,1,,,0,8,0,1,7,1,1,6,0,1,3,1,1,,,0,1,1,0,05,COAHUILA DE ZARAGOZA,030,0001,6
05030000126910290331,3,123,1,1o65,6863.7988160268915,1,9,2,25.5,1,1,3,1,1,1,1,0,,,0,1,0,0,7,0,1,1,0,0,,,0,1,1,0,3,0,1,7,1,1,3,1,1,5,1,0,05,COAHUILA DE ZARAGOZA,030,0001,6
05030000126910440251,2,123,1,1o65,5643.421141336173,1,5,2,7,1,1,3,1,1,3,1,1,3,0,1,,,0,10,0,1,9,0,1,5.5,0,1,7,1,1,,,0,7,1,1,3,1,1,,,0,05,COAHUILA DE ZARAGOZA,030,0001,10
050300001312A0140111,2,122,1,1o47,4776.988718744116,1,7,2,26,1,1,7,1,1,1,1,0,3,0,1,,,0,14,0,1,3,0,1,8,0,1,7,1,1,8,0,1,,,0,7,1,1,11,1,1,05,COAHUILA DE ZARAGOZA,030,0001,10
050300001312A0140281,3,122,1,1o47,4776.988718744116,1,5,2,16,1,1,,,0,4,1,1,,,0,,,0,19.5,0,1,3,0,1,15.5,0,1,7,1,1,5.5,0,1,5.5,1,1,7,1,1,15,1,1,05,COAHUILA DE ZARAGOZA,030,0001,10
050300001312A0440061,4,122,1,1o47,3726.804535281859,2,8,2,1,1,0,3,1,1,1,1,0,,,0,,,0,7,0,1,1,0,0,11,0,1,7,1,1,3,0,1,2,1,0,3,1,1,,,0,05,COAHUILA DE ZARAGOZA,030,0001,6