folio,inte,idinsert,entidad,munici,locali,maq,edad,sexo,intsel,intsel2,su101,su102,su103,su104,su105,su106,su107,su107a,su107b,su107c,su108,su109,su110,su111,su112,su113,su114,su115,su116,tiempo_gen,est_var,region_h,code_upm,rural,c1,ponde_f,a301,a313g,a313h,a401,a502a,a502b,a502c,a502d,a1301,a1301a,a1312c,cintura,cintura2,rcintura,grupoednut,imc,imc_valid,imc_valid_clas,horasueno,calidad,volronquido,frecron,cat1,cat1c,cat2,cat2c,hta,saos,saosc,sexofem,insomnio,ronca,roncafuerte,roncahab,roncamol,apnea,catberlin1,noreparador,cansado,cabeceado,catberlin2,catberlin3,catberlin1a,catberlin2a,berlinscore,berlinriesgo,berlinscoresinbmi,berlinriesgosinbmi,malacalsueno,impactoinsom,insom3sem,insomhabi,horasueno1,horasueno2,horasueno3,clonazepam,diazepam,alprazolam,sedante,cinturaprom,padormir1,padormir2
010010001209A0020131,1,1076190,01,001,0001,MC036,67,1,1,,6,2,2,2,,,2,CLONAZEPAM,,,1,2,1,1,,1,,2,,2016/10/25,223,2,2o72,2,1,41460.01004164614,1,2,2,2,2,2,2,2,1,2,0,99.19999694824219,99.4000015258789,1,4,26.724699020385742,26.724699020385742,2,2,1,0,1,3,1,1,0,0,1,0,0,0,1,0,1,1,0,3,1,0,0,1,0,1,0,1,0,1,0,0,0,0,0,0,1,0,1,0,0,1,99.30000305175781,CLONAZEPAM,
010010001209A0020161,1,1076193,01,001,0001,MC036,55,1,1,10,8,1,3,2,,,1,,,,9,,,,,,,1,5,2016/10/25,223,2,2o72,2,1,10219.815906701093,3,,,2,2,2,2,2,2,2,30,98.5999984741211,98.5999984741211,1,4,27.32478904724121,27.32478904724121,2,1,1,,,,0,0,0,0,0,0,0,0,0,0,0,0,0,0,0,0,1,1,0,0,0,0,0,0,0,0,0,0,0,1,0,0,0,0,0,0,98.5999984741211,,
010010001209A0080071,2,1075466,01,001,0001,MC034,44,0,1,,6,2,3,2,,,1,,,,2,,,,,1,1,2,,2016/10/25,223,2,2o72,2,1,21001.34782701299,3,,,2,2,2,2,2,2,2,98,95.9000015258789,95.80000305175781,1,4,29.601348876953125,29.601348876953125,2,2,1,,,,0,2,1,0,1,0,1,0,0,0,0,0,0,0,1,1,0,2,0,0,1,1,0,1,0,0,0,0,0,0,1,0,0,0,0,0,95.85000610351562,,
010010001209A0080101,1,1075538,01,001,0001,MC034,47,0,1,,6,2,3,1,1,1,1,,,,1,1,1,2,,1,1,2,,2016/10/25,223,2,2o72,2,1,10500.673913506495,3,,,2,2,2,2,2,2,2,98,110.19999694824219,110.19999694824219,1,4,33.07558822631836,33.07558822631836,3,2,1,0,1,2,1,2,1,0,2,1,1,0,1,0,1,0,0,2,1,1,0,2,1,1,1,3,1,2,1,0,1,1,1,0,1,0,0,0,0,0,110.19999694824219,,
010010001209A0120041,1,1076278,01,001,0001,MC036,36,1,1,,8,1,2,1,1,1,1,,,,1,1,1,1,,,,2,,2016/10/25,223,2,2o72,2,1,4526.882233974644,3,,,2,2,2,1,2,1,2,1,188.3000030517578,188.39999389648438,1,4,37.03703689575195,37.03703689575195,3,1,1,0,1,3,1,0,0,0,1,0,0,0,1,0,1,1,0,3,0,0,0,0,1,1,0,2,1,1,0,0,1,1,1,1,0,0,0,0,0,0,188.35000610351562,,
010010001209A0120121,1,1076194,01,001,0001,MC036,86,0,1,,9,1,2,2,,,2,CLONAZEPAM,,,9,,,,,,,2,,2016/10/25,223,2,2o72,2,1,8113.034708459778,3,,,2,2,2,2,2,2,2,0,94.0999984741211,94,1,4,26.09676742553711,26.09676742553711,2,1,1,,,,0,0,0,0,0,0,1,0,0,0,0,0,0,0,0,0,0,0,0,0,0,0,0,0,0,0,0,0,0,1,0,0,1,0,0,1,94.05000305175781,CLONAZEPAM,
010010001209A0120171,2,1076196,01,001,0001,MC036,63,0,1,10,7,1,2,1,1,,1,,,,1,2,4,2,,,,1,5,2016/10/25,223,2,2o72,2,1,15290.52353795724,3,,,2,2,2,2,2,1,2,0,70,69.80000305175781,1,4,18.90203094482422,18.90203094482422,1,1,1,0,0,1,0,0,0,0,0,0,1,0,1,0,0,0,0,1,0,0,1,1,0,0,0,0,0,0,0,0,0,1,1,1,0,0,0,0,0,0,69.9000015258789,,
010010001209A0210011,1,1074849,01,001,0001,MC032,55,0,1,10,6,2,2,2,,,1,,,,1,2,1,1,,,1,2,,2016/10/25,223,2,2o72,2,1,3528.5823549132087,3,,,2,2,2,2,2,2,2,0,95.69999694824219,95.5999984741211,1,4,29.54355239868164,29.54355239868164,2,2,1,0,1,3,1,1,0,0,1,0,1,0,1,0,1,1,0,3,0,1,0,1,0,1,0,1,0,1,0,0,0,0,0,0,1,0,0,0,0,0,95.64999389648438,,
010010001209A0210051,1,1074897,01,001,0001,MC032,60,1,1,10,7,2,3,1,1,,1,,,,2,,,,,,,2,,2016/10/25,223,2,2o72,2,1,6936.5266335075285,3,,,2,2,2,2,2,3,,0,94.5999984741211,94.5999984741211,1,4,24.801555633544922,24.801555633544922,1,1,1,,,,0,0,0,0,0,0,0,0,0,0,0,0,0,0,0,0,0,0,0,0,0,0,0,0,0,0,0,1,1,1,0,0,0,0,0,0,94.5999984741211,,
010010001209A0210081,1,1074898,01,001,0001,MC032,56,0,1,,8,1,2,1,1,1,1,,,,9,,,,,,1,2,,2016/10/25,223,2,2o72,2,1,3528.5823549132087,3,,,2,2,2,2,2,3,,0,78.5,78.5,1,4,20.43035316467285,20.43035316467285,1,1,1,,,,0,1,0,0,0,0,1,0,0,0,0,0,0,0,0,1,0,1,0,0,0,0,0,0,0,0,1,1,1,1,0,0,0,0,0,0,78.5,,
010010001209A0210121,2,1074845,01,001,0001,MC032,44,0,1,10,8,1,2,2,,,1,,,,2,,,,,,,2,,2016/10/25,223,2,2o72,2,1,14029.240451243491,3,,,2,2,2,2,2,3,,0,79.19999694824219,79.4000015258789,1,4,20.777116775512695,20.777116775512695,1,1,1,,,,0,0,0,0,0,0,1,0,0,0,0,0,0,0,0,0,0,0,0,0,0,0,0,0,0,0,0,0,0,1,0,0,0,0,0,0,79.30000305175781,,
010010001209A0260041,1,1075452,01,001,0001,MC034,62,1,1,,8,1,2,2,,,1,,,,2,,,,,,,2,,2016/10/25,223,2,2o72,2,1,42269.4591729365,3,,,2,2,2,2,2,1,2,3,222.1999969482422,222.1999969482422,4,4,25.110668182373047,25.110668182373047,2,1,1,,,,0,0,0,0,0,0,0,0,0,0,0,0,0,0,0,0,0,0,0,0,0,0,0,0,0,0,0,0,0,1,0,0,0,0,0,0,222.1999969482422,,
010010001209A0260141,1,1075455,01,001,0001,MC034,68,1,1,10,6,2,3,1,2,,1,,,,9,,,,,,,2,,2016/10/25,223,2,2o72,2,1,19053.313438256504,1,2,2,1,2,2,2,2,1,2,98,87.80000305175781,87.69999694824219,1,4,24.268198013305664,24.268198013305664,1,2,1,,,,0,0,0,1,1,0,0,1,0,0,0,0,0,0,0,0,0,0,1,0,0,1,0,1,0,0,0,1,0,0,1,0,0,0,0,0,87.75,,
010010001209A0310011,2,1074899,01,001,0001,MC032,69,0,1,,7,1,1,2,,,1,,,,9,,,,,,,2,,2016/10/25,223,2,2o72,2,1,10874.918864531193,3,,,1,2,2,2,2,1,1,4,88.5,88.5,1,4,28.073354721069336,28.073354721069336,2,1,1,,,,0,0,0,1,1,0,1,0,0,0,0,0,0,0,0,0,0,0,1,0,0,1,0,1,0,0,0,0,0,1,0,0,0,0,0,0,88.5,,
010010001209A0310031,1,1074844,01,001,0001,MC032,87,0,1,,8,1,2,1,1,,1,,,,1,5,9,2,,,,2,,2016/10/25,223,2,2o72,2,1,3624.9729548437303,3,,,1,2,2,2,2,1,1,0,73.4000015258789,73.4000015258789,1,4,21.103199005126953,21.103199005126953,1,1,1,0,0,1,0,0,0,1,1,0,1,0,1,0,0,0,0,1,0,0,0,0,1,0,0,1,0,1,0,0,0,1,1,1,0,0,0,0,0,0,73.4000015258789,,
010010001209A0310071,2,1074841,01,001,0001,MC032,45,0,1,10,5,2,3,1,2,,1,,,,1,2,9,2,,,,2,,2016/10/25,223,2,2o72,2,1,27162.997469428887,3,,,2,2,2,2,2,2,2,0,92.19999694824219,92.0999984741211,1,4,28.822168350219727,28.822168350219727,2,2,1,0,0,1,0,0,0,0,0,0,1,1,1,0,0,0,0,1,0,0,0,0,0,0,0,0,0,0,0,0,0,1,0,0,1,0,0,0,0,0,92.14999389648438,,
010010001209A0310131,1,1074859,01,001,0001,MC032,83,0,1,,50,1,2,1,1,,2,PAXIPAX,,,1,5,9,1,,,1,2,,2016/10/25,223,2,2o72,2,1,3624.9729548437303,3,,,1,2,2,2,2,3,,0,85.4000015258789,85.5,1,4,24.41588592529297,24.41588592529297,1,3,1,0,0,2,1,1,0,1,2,1,1,0,1,0,0,1,0,2,0,1,0,1,1,1,0,2,1,2,1,0,0,1,1,0,0,1,0,0,0,1,85.44999694824219,PAXIPAX,
010010001262A0010211,1,1076240,01,001,0001,MC036,74,1,1,10,4,1,4,1,1,,1,,,,1,4,1,2,1,,,2,,2016/10/25,222,2,2o50,2,1,13094.452018825032,3,,,1,2,2,2,2,3,,98,119.5999984741211,119.4000015258789,1,4,32.937950134277344,32.937950134277344,3,2,2,1,1,4,1,0,0,1,2,1,0,0,1,1,1,0,1,4,0,0,0,0,1,1,0,2,1,2,1,1,0,1,1,0,1,0,0,0,0,0,119.5,,
010010001262A0080121,1,1075509,01,001,0001,MC034,41,0,1,,7,2,2,1,1,,1,,,,1,4,1,1,1,1,1,2,,2016/10/25,222,2,2o50,2,1,9708.234416350955,3,,,2,2,2,2,2,2,2,98,122.80000305175781,122.80000305175781,1,4,46.58982467651367,46.58982467651367,3,1,1,1,1,5,1,2,1,0,2,1,1,0,1,1,1,1,1,5,1,1,0,2,1,1,1,3,1,2,1,0,0,1,1,1,0,0,0,0,0,0,122.80000305175781,,
010010001262A0080251,2,1075535,01,001,0001,MC034,58,0,1,10,10,1,3,1,1,,1,,,,1,4,4,2,1,,,2,,2016/10/25,222,2,2o50,2,1,9968.282341328702,3,,,1,2,2,2,2,2,2,98,93.30000305175781,93.5,1,4,29.008739471435547,29.008739471435547,2,3,1,1,0,3,1,0,0,1,2,1,1,0,1,1,0,0,1,3,0,0,0,0,1,1,0,2,1,2,1,0,0,1,1,0,0,1,0,0,0,0,93.4000015258789,,
010010001262A0080311,2,1075544,01,001,0001,MC034,28,0,1,12,6,2,3,1,1,,1,,,,1,1,9,2,,,,2,,2016/10/25,222,2,2o50,2,1,14251.55278076848,3,,,2,2,2,2,2,1,2,98,,,,4,24.596967697143555,24.596967697143555,1,2,1,0,0,1,0,0,0,0,0,0,1,0,1,0,0,0,0,1,0,0,0,0,0,0,0,0,0,0,0,0,0,1,1,0,1,0,0,0,0,0,,,
010010001262A0080371,1,1075528,01,001,0001,MC034,25,1,1,,7,1,3,1,1,1,1,,,,2,,,,,1,,2,,2016/10/25,222,2,2o50,2,1,10366.350920988063,3,,,2,2,2,2,2,2,2,3,92.5,92.5,1,4,23.562257766723633,23.562257766723633,1,1,1,,,,0,1,0,0,0,0,0,0,0,0,0,0,0,0,1,0,0,1,0,0,0,0,0,0,0,0,1,1,1,1,0,0,0,0,0,0,92.5,,
010010001262A0080441,1,1075527,01,001,0001,MC034,76,0,1,10,5,2,4,1,1,,1,,,,9,,,,,1,1,2,,2016/10/25,222,2,2o50,2,1,5918.816711057817,3,,,2,2,2,2,1,2,2,98,80.5999984741211,80.5999984741211,1,4,22.84889793395996,22.84889793395996,1,2,2,,,,0,2,1,0,1,0,1,0,0,0,0,0,0,0,1,1,0,2,0,0,1,1,0,1,0,1,0,1,1,0,1,0,0,0,0,0,80.5999984741211,,
010010001262A0130041,1,1075526,01,001,0001,MC034,52,0,1,,5,2,4,1,1,,2,,,,9,,,,,1,1,2,,2016/10/25,222,2,2o50,2,1,3450.1551660962446,3,,,1,2,2,2,2,2,2,98,222.1999969482422,222.1999969482422,2,4,,,,2,2,,,,0,2,1,1,2,1,1,0,0,0,0,0,0,0,1,1,0,2,1,0,1,2,1,2,1,1,0,1,1,0,1,0,0,0,0,1,222.1999969482422,?,
010010001262A0130151,2,1075521,01,001,0001,MC034,28,0,1,,9,1,2,2,,,1,,,,1,1,4,2,,,1,2,,2016/10/25,222,2,2o50,2,1,9865.304125185454,3,,,2,2,2,2,2,1,1,3,81.30000305175781,81.19999694824219,1,4,22.822561264038086,22.822561264038086,1,1,1,0,0,1,0,1,0,0,0,0,1,0,1,0,0,0,0,1,0,1,0,1,0,0,0,0,0,0,0,0,0,0,0,1,0,0,0,0,0,0,81.25,,
010010001262A0130201,1,1075537,01,001,0001,MC034,56,1,1,10,7,1,2,2,,,1,,,,1,2,2,2,,,,2,,2016/10/25,222,2,2o50,2,1,5812.477362302071,3,,,2,2,2,2,2,1,2,98,102.30000305175781,102.4000015258789,1,4,29.073286056518555,29.073286056518555,2,1,1,0,1,2,1,0,0,0,1,0,0,0,1,0,1,0,0,2,0,0,0,0,0,1,0,1,0,1,0,0,0,0,0,1,0,0,0,0,0,0,102.35000610351562,,
010010001262A0130261,4,1075499,01,001,0001,MC034,29,0,1,10,6,2,3,1,1,,1,,,,1,1,3,2,,,,2,,2016/10/25,222,2,2o50,2,1,24663.260312963634,3,,,2,2,2,2,2,1,1,3,87.4000015258789,87.5999984741211,1,4,24.229312896728516,24.229312896728516,1,2,1,0,0,1,0,0,0,0,0,0,1,0,1,0,0,0,0,1,0,0,0,0,0,0,0,0,0,0,0,0,0,1,1,0,1,0,0,0,0,0,87.5,,
010010001262A0130311,1,1075525,01,001,0001,MC034,68,0,1,13,12,1,3,2,,,2,CLONAZEPAM,,,1,4,9,2,,,1,2,,2016/10/25,222,2,2o50,2,1,4097.162450579416,3,,,1,1,2,2,2,1,2,98,,,,,,,,3,1,1,0,2,1,1,0,1,2,1,1,0,1,1,0,0,0,2,0,1,0,1,1,1,0,2,1,2,1,0,0,0,0,0,0,1,1,0,0,1,,CLONAZEPAM,
010010001262A0170051,1,1074908,01,001,0001,MC032,64,0,1,,5,2,4,1,2,,1,,,,1,2,1,2,1,1,,2,,2016/10/25,222,2,2o50,2,1,3112.780758901022,3,,,2,2,2,2,1,3,,0,92.5999984741211,92.5999984741211,1,4,23.27438735961914,23.27438735961914,1,2,2,0,1,3,1,1,0,0,1,0,1,1,1,0,1,0,1,3,1,0,0,1,0,1,0,1,0,1,0,1,0,1,0,0,1,0,0,0,0,0,92.5999984741211,,
010010001262A0170081,1,1074893,01,001,0001,MC032,56,1,1,10,4,2,4,1,1,1,1,,,,1,5,9,2,,1,1,2,,2016/10/25,222,2,2o50,2,1,10488.205210430202,3,,,1,2,2,2,2,1,2,0,93.69999694824219,93.69999694824219,1,4,25.720108032226562,25.720108032226562,2,2,2,0,0,1,0,2,1,1,2,1,0,0,1,0,0,0,0,1,1,1,0,2,1,0,1,2,1,2,1,1,1,1,1,0,1,0,0,0,0,0,93.69999694824219,,
010010001262A0170131,2,1074874,01,001,0001,MC032,28,0,1,12,8,1,2,2,,,1,,,,9,,,,,,,2,,2016/10/25,222,2,2o50,2,1,8900.622546878092,3,,,2,2,2,2,2,1,1,0,119.5,119.5,1,4,43.416046142578125,43.416046142578125,3,1,1,,,,0,0,0,0,0,0,1,0,0,0,0,0,0,0,0,0,0,0,1,0,0,1,0,0,0,0,0,0,0,1,0,0,0,0,0,0,119.5,,
010010001262A0170161,1,1074888,01,001,0001,MC032,48,0,1,,6,2,4,1,1,,1,,,,9,,,,,1,,2,,2016/10/25,222,2,2o50,2,1,3031.5759786244066,3,,,2,2,2,2,2,3,,0,78,78,1,4,27.054397583007812,27.054397583007812,2,2,2,,,,0,1,0,0,0,0,1,0,0,0,0,0,0,0,1,0,0,1,0,0,0,0,0,0,0,1,0,1,1,0,1,0,0,0,0,0,78,,
010010001262A0170191,1,1074870,01,001,0001,MC032,49,1,1,,7,2,3,2,,,1,,,,1,1,4,2,,1,1,2,,2016/10/25,222,2,2o50,2,1,8542.012485685682,3,,,2,2,2,2,2,1,1,5,76.30000305175781,76.30000305175781,1,4,18.456022262573242,18.456022262573242,1,1,1,0,0,1,0,2,1,0,1,0,0,0,1,0,0,0,0,1,1,1,0,2,0,0,1,1,0,1,0,0,0,0,0,1,0,0,0,0,0,0,76.30000305175781,,
010010001262A0220031,1,1074883,01,001,0001,MC032,63,0,1,,3,2,4,1,2,,1,,,,1,2,1,2,,1,1,2,,2016/10/25,222,2,2o50,2,1,4905.1844788518465,1,2,2,2,2,2,2,2,3,,0,97.69999694824219,97.69999694824219,1,4,32.234962463378906,32.234962463378906,3,2,2,0,1,2,1,2,1,0,2,1,1,1,1,0,1,0,0,2,1,1,0,2,1,1,1,3,1,2,1,1,0,1,0,0,1,0,0,0,0,0,97.69999694824219,,
010010001262A0220121,3,1074884,01,001,0001,MC032,24,0,1,13,7,2,1,1,1,1,1,,,,1,1,3,2,,,,2,,2016/10/25,222,2,2o50,2,1,21038.67841200575,3,,,2,2,2,2,2,3,,0,73.5,73.5,1,4,20.56182098388672,20.56182098388672,1,1,1,0,0,1,0,0,0,0,0,0,1,0,1,0,0,0,0,1,0,0,0,0,0,0,0,0,0,0,0,0,1,1,1,1,0,0,0,0,0,0,73.5,,
010010001262A0220151,1,1074906,01,001,0001,MC032,45,0,1,12,6,2,3,1,2,,1,,,,2,,,,,1,1,2,,2016/10/25,222,2,2o50,2,1,4777.220301907351,3,,,1,2,2,2,1,3,,0,99.19999694824219,99.19999694824219,1,4,30.709829330444336,30.709829330444336,3,2,1,,,,0,2,1,1,2,1,1,1,0,0,0,0,0,0,1,1,0,2,1,0,1,2,1,2,1,0,0,1,0,0,1,0,0,0,0,0,99.19999694824219,,
010010001262A0280211,1,1076255,01,001,0001,MC036,39,1,1,12,10,1,1,2,,,2,CLONAZEPAM,,,1,4,1,2,1,,,2,,2016/10/25,222,2,2o50,2,1,15371.927299402636,3,,,2,1,2,2,2,1,2,3,98.9000015258789,98.69999694824219,1,4,27.855133056640625,27.855133056640625,2,3,1,1,1,4,1,0,0,0,1,0,0,0,1,1,1,0,1,4,0,0,0,0,0,1,0,1,0,1,0,0,0,0,0,0,0,1,1,0,0,1,98.80000305175781,CLONAZEPAM,
010010001262A0280291,1,1076277,01,001,0001,MC036,45,0,1,10,8,2,2,1,2,,1,,,,9,,,,,1,1,2,,2016/10/25,222,2,2o50,2,1,5455.525337164036,3,,,2,2,2,2,2,1,2,0,105.19999694824219,105.19999694824219,1,4,31.624303817749023,31.624303817749023,3,1,1,,,,0,2,1,0,1,0,1,1,0,0,0,0,0,0,1,1,0,2,1,0,1,2,1,1,0,0,0,1,0,1,0,0,0,0,0,0,105.19999694824219,,
010010001262A0280361,1,1076263,01,001,0001,MC036,56,1,1,10,8,1,3,1,2,,1,,,,1,1,1,1,,1,1,2,,2016/10/25,222,2,2o50,2,1,18874.232303701356,3,,,2,2,2,2,2,1,2,0,85.4000015258789,85.5,1,4,24.219594955444336,24.219594955444336,1,1,1,0,1,3,1,2,1,0,2,1,0,1,1,0,1,1,0,3,1,1,0,2,0,1,1,2,1,2,1,0,0,1,0,1,0,0,0,0,0,0,85.44999694824219,,
010010001262A0280431,2,1076258,01,001,0001,MC036,74,0,1,,5,2,3,2,,,1,,,,9,,,,,1,1,2,,2016/10/25,222,2,2o50,2,1,13304.274762389927,3,,,1,2,2,2,2,3,,0,94.19999694824219,94.5999984741211,1,4,29.069753646850586,29.069753646850586,2,2,1,,,,0,2,1,1,2,1,1,0,0,0,0,0,0,0,1,1,0,2,1,0,1,2,1,2,1,0,0,0,0,0,1,0,0,0,0,0,94.39999389648438,,
010010001262A0280511,3,1076265,01,001,0001,MC036,21,0,1,,6,1,3,1,1,,1,,,,2,,,,,,,2,,2016/10/25,222,2,2o50,2,1,32034.540558050056,3,,,2,2,2,2,2,2,1,0,64.9000015258789,65,1,4,19.513797760009766,19.513797760009766,1,2,1,,,,0,0,0,0,0,0,1,0,0,0,0,0,0,0,0,0,0,0,0,0,0,0,0,0,0,0,0,1,1,0,1,0,0,0,0,0,64.94999694824219,,
01001000127230010011,1,1075456,01,001,0001,MC034,60,1,1,10,5,2,2,2,,,1,,,,1,1,1,2,,1,1,1,1,2016/10/25,223,2,2o71,2,1,8622.224085120997,3,,,2,2,2,2,2,1,2,98,86.5,86.5,1,4,24.80381965637207,24.80381965637207,1,2,1,0,1,2,1,2,1,0,2,1,0,0,1,0,1,0,0,2,1,1,1,3,0,1,1,2,1,2,1,0,0,0,0,0,1,0,0,0,0,0,86.5,,
01001000127230010071,2,1075474,01,001,0001,MC034,32,0,1,,8,1,3,1,1,1,1,,,,1,1,4,2,,,,2,,2016/10/25,223,2,2o71,2,1,13704.542752230607,,,,,,,,,,,,,,,,,,,1,1,0,0,1,0,0,0,0,0,0,1,0,1,0,0,0,0,1,0,0,0,0,1,0,0,1,0,0,0,0,1,1,1,1,0,0,0,0,0,0,,,
01001000127230010131,1,1075484,01,001,0001,MC034,52,0,1,,6,2,3,1,1,1,1,,,,1,1,3,2,,1,1,2,,2016/10/25,223,2,2o71,2,1,1462.0298877874804,3,,,1,2,2,2,2,9,,98,112.9000015258789,112.9000015258789,1,4,32.40169143676758,32.40169143676758,3,2,1,0,0,1,0,2,1,1,2,1,1,0,1,0,0,0,0,1,1,1,0,2,1,0,1,2,1,2,1,0,1,1,1,0,1,0,0,0,0,0,112.9000015258789,,
01001000127230010191,4,1075461,01,001,0001,MC034,23,1,1,10,8,1,1,1,1,,1,,,,2,,,,,,,2,,2016/10/25,223,2,2o71,2,1,28043.658477462814,3,,,2,2,2,2,2,2,2,3,82.5,82.5999984741211,1,4,25.022014617919922,25.022014617919922,2,1,1,,,,0,0,0,0,0,0,0,0,0,0,0,0,0,0,0,0,0,0,0,0,0,0,0,0,0,0,0,1,1,1,0,0,0,0,0,0,82.55000305175781,,
01001000127230070011,2,1074866,01,001,0001,MC032,47,1,1,10,6,2,3,2,,,1,,,,2,,,,,,,2,,2016/10/25,223,2,2o71,2,1,3162.9296620639375,3,,,2,2,2,2,2,1,1,0,104.80000305175781,104.80000305175781,1,4,30.506465911865234,30.506465911865234,3,2,1,,,,0,0,0,0,0,0,0,0,0,0,0,0,0,0,0,0,0,0,1,0,0,1,0,0,0,0,0,0,0,0,1,0,0,0,0,0,104.80000305175781,,
01001000127230070101,3,1074879,01,001,0001,MC032,23,1,1,10,7,2,2,2,,,1,,,,2,,,,,,,2,,2016/10/25,223,2,2o71,2,1,34153.865315868345,3,,,2,2,2,2,2,3,,98,73.19999694824219,73.19999694824219,1,4,16.139789581298828,16.139789581298828,1,1,1,,,,0,0,0,0,0,0,0,0,0,0,0,0,0,0,0,0,0,0,0,0,0,0,0,0,0,0,0,0,0,1,0,0,0,0,0,0,73.19999694824219,,
01001000127230070191,2,1074860,01,001,0001,MC032,29,0,1,10,9,1,3,1,1,,1,,,,9,,,,,,,2,,2016/10/25,223,2,2o71,2,1,11127.010116539088,3,,,2,2,2,2,2,3,,0,,,,4,28.378433227539062,28.378433227539062,2,1,1,,,,0,0,0,0,0,0,1,0,0,0,0,0,0,0,0,0,0,0,0,0,0,0,0,0,0,0,0,1,1,1,0,0,0,0,0,0,,,
01001000127230070361,1,1074863,01,001,0001,MC032,65,0,1,,55,2,4,1,2,,1,,,,1,5,2,2,,1,1,2,,2016/10/25,223,2,2o71,2,1,2078.1565245116453,1,2,2,2,2,2,2,2,3,,0,116.5,116.5,1,4,33.42265319824219,33.42265319824219,3,3,2,0,1,2,1,2,1,0,2,1,1,1,1,0,1,0,0,2,1,1,0,2,1,1,1,3,1,2,1,1,0,1,0,0,0,1,0,0,0,0,116.5,,
01001000127230070541,1,1074890,01,001,0001,MC032,30,0,1,10,6,2,2,2,,,1,,,,2,,,,,,1,2,,2016/10/25,223,2,2o71,2,1,5563.505058269544,3,,,2,2,2,2,2,2,2,0,109.19999694824219,109.19999694824219,1,4,39.05287170410156,39.05287170410156,3,2,1,,,,0,1,0,0,0,0,1,0,0,0,0,0,0,0,0,1,0,1,1,0,0,1,0,0,0,0,0,0,0,0,1,0,0,0,0,0,109.19999694824219,,
01001000127230130011,1,1076242,01,001,0001,MC036,47,1,1,10,7,2,2,2,,,1,,,,1,4,1,1,,1,1,2,,2016/10/25,223,2,2o71,2,1,4044.4018629670018,3,,,2,2,2,2,2,2,2,1,111,111.19999694824219,1,4,32.663394927978516,32.663394927978516,3,1,1,1,1,4,1,2,1,0,2,1,0,0,1,1,1,1,0,4,1,1,0,2,1,1,1,3,1,2,1,0,0,0,0,1,0,0,0,0,0,0,111.0999984741211,,
01001000127230130051,1,1076260,01,001,0001,MC036,41,1,1,13,6,2,3,1,2,,1,,,,2,,,,,1,1,2,,2016/10/25,223,2,2o71,2,1,4044.4018629670018,1,2,2,2,2,2,2,2,1,1,1,107,106.80000305175781,1,4,29.692358016967773,29.692358016967773,2,2,1,,,,0,2,1,0,1,0,0,1,0,0,0,0,0,0,1,1,0,2,0,0,1,1,0,1,0,0,0,1,0,0,1,0,0,0,0,0,106.9000015258789,,
01001000127230130091,1,1076276,01,001,0001,MC036,47,1,1,10,7,1,2,2,,,1,,,,9,,,,,,1,2,,2016/10/25,223,2,2o71,2,1,2022.2009314835009,3,,,2,2,2,2,2,1,1,98,84.5999984741211,84.69999694824219,1,4,17.937313079833984,17.937313079833984,1,1,1,,,,0,1,0,0,0,0,0,0,0,0,0,0,0,0,0,1,0,1,0,0,0,0,0,0,0,0,0,0,0,1,0,0,0,0,0,0,84.64999389648438,,
01001000127230130161,1,1076236,01,001,0001,MC036,30,0,1,,5,1,3,1,2,,2,CLONAZEPAM,,,9,,,,,1,1,2,,2016/10/25,223,2,2o71,2,1,7113.990074508596,3,,,2,2,2,2,2,1,2,0,99.4000015258789,99.30000305175781,1,4,29.090381622314453,29.090381622314453,2,2,1,,,,0,2,1,0,1,0,1,1,0,0,0,0,0,0,1,1,0,2,0,0,1,1,0,1,0,0,0,1,0,0,1,0,1,0,0,1,99.35000610351562,CLONAZEPAM,
01001000127230130241,1,1076262,01,001,0001,MC036,79,0,1,,8,2,4,2,,,1,,,,9,,,,,,,2,,2016/10/25,223,2,2o71,2,1,1812.0845094528286,1,2,2,1,2,2,2,2,3,,0,100,99.80000305175781,1,4,28.642744064331055,28.642744064331055,2,1,2,,,,0,0,0,1,1,0,1,0,0,0,0,0,0,0,0,0,0,0,1,0,0,1,0,1,0,1,0,0,0,1,0,0,0,0,0,0,99.9000015258789,,
01001000127230220081,3,1075479,01,001,0001,MC034,26,1,1,13,5,1,2,2,,,1,,,,1,2,3,2,,,,1,4,2016/10/25,223,2,2o71,2,1,40312.7590613528,3,,,2,2,2,2,2,2,2,1,83.19999694824219,83.19999694824219,1,4,23.057018280029297,23.057018280029297,1,2,1,0,0,1,0,0,0,0,0,0,0,0,1,0,0,0,0,1,0,0,1,1,0,0,0,0,0,0,0,0,0,0,0,0,1,0,0,0,0,0,83.19999694824219,,
01001000127230220141,2,1075485,01,001,0001,MC034,34,0,1,10,5,1,2,2,,,1,,,,1,2,3,2,,1,,1,3,2016/10/25,223,2,2o71,2,1,13133.520137554331,,,,,,,,,,,,222.1999969482422,222.1999969482422,5,4,25.586013793945312,25.586013793945312,2,2,1,0,0,1,0,1,0,0,0,0,1,0,1,0,0,0,0,1,1,0,1,2,0,0,1,1,0,1,0,0,0,0,0,0,1,0,0,0,0,0,222.1999969482422,,
01001000127230220271,1,1075519,01,001,0001,MC034,36,0,1,12,8,1,3,2,,,1,,,,9,,,,,,,2,,2016/10/25,223,2,2o71,2,1,4177.995898308952,3,,,2,2,2,2,2,2,2,98,94.4000015258789,94.30000305175781,1,4,29.69452476501465,29.69452476501465,2,1,1,,,,0,0,0,0,0,0,1,0,0,0,0,0,0,0,0,0,0,0,0,0,0,0,0,0,0,0,0,0,0,1,0,0,0,0,0,0,94.35000610351562,,
01001000127230220331,1,1075496,01,001,0001,MC034,47,0,1,10,6,2,3,1,1,,1,,,,2,,,,,1,1,2,,2016/10/25,223,2,2o71,2,1,4177.995898308952,3,,,2,2,2,2,2,3,,3,,,,,,,,2,1,,,,0,2,1,0,1,0,1,0,0,0,0,0,0,0,1,1,0,2,1,0,1,2,1,1,0,0,0,1,1,0,1,0,0,0,0,0,,,
01001000127230220391,2,1075469,01,001,0001,MC034,67,0,1,12,7,2,2,2,,,1,,,,1,2,4,2,,,1,2,,2016/10/25,223,2,2o71,2,1,8363.466966705362,1,2,2,1,2,2,2,2,2,2,98,78.4000015258789,78.5,1,4,21.45633316040039,21.45633316040039,1,1,1,0,0,1,0,1,0,1,1,0,1,0,1,0,0,0,0,1,0,1,0,1,1,0,0,1,0,1,0,0,0,0,0,1,0,0,0,0,0,0,78.44999694824219,,
01001000127230320011,1,1074889,01,001,0001,MC032,45,0,1,,9,2,3,1,2,,1,,,,2,,,,,1,1,2,,2016/10/25,223,2,2o71,2,1,5685.014946672593,1,2,2,1,2,2,1,2,3,,0,89.5,89.5,1,4,26.3377685546875,26.3377685546875,2,1,1,,,,0,2,1,1,2,1,1,1,0,0,0,0,0,0,1,1,0,2,1,0,1,2,1,2,1,0,0,1,0,1,0,0,0,0,0,0,89.5,,
01001000127230320101,1,1074853,01,001,0001,MC032,61,1,1,15,7,2,3,1,2,,1,,,,1,2,1,2,,1,1,2,,2016/10/25,223,2,2o71,2,1,11243.447633970101,1,2,2,1,2,2,2,2,1,2,98,114.4000015258789,114.5,1,4,30.099102020263672,30.099102020263672,3,1,1,0,1,2,1,2,1,1,3,1,0,1,1,0,1,0,0,2,1,1,0,2,1,1,1,3,1,3,1,0,0,1,0,1,0,0,0,0,0,0,114.44999694824219,,
01001000127230320181,1,1074855,01,001,0001,MC032,30,0,1,,9,2,3,1,1,1,1,,,,2,,,,,,1,2,,2016/10/25,223,2,2o71,2,1,8935.415460154269,3,,,2,2,2,2,2,1,1,8,104.5,104.5,1,4,34.29202651977539,34.29202651977539,3,1,1,,,,0,1,0,0,0,0,1,0,0,0,0,0,0,0,0,1,0,1,1,0,0,1,0,0,0,0,1,1,1,1,0,0,0,0,0,0,104.5,,
01001000127230320261,1,1074877,01,001,0001,MC032,36,0,1,,7,1,3,1,1,,1,,,,1,1,2,2,,,,2,,2016/10/25,223,2,2o71,2,1,5685.014946672593,3,,,2,2,2,2,2,2,2,0,84.19999694824219,84.19999694824219,1,4,26.101457595825195,26.101457595825195,2,1,1,0,1,2,1,0,0,0,1,0,1,0,1,0,1,0,0,2,0,0,0,0,0,1,0,1,0,1,0,0,0,1,1,1,0,0,0,0,0,0,84.19999694824219,,
01001000127230320351,1,1074903,01,001,0001,MC032,34,0,1,,9,2,3,1,2,,1,,,,1,1,1,1,,,1,2,,2016/10/25,223,2,2o71,2,1,8935.415460154269,3,,,2,2,2,2,2,3,,0,89.19999694824219,89.19999694824219,1,4,24.27871322631836,24.27871322631836,1,1,1,0,1,3,1,1,0,0,1,0,1,1,1,0,1,1,0,3,0,1,0,1,0,1,0,1,0,1,0,0,0,1,0,1,0,0,0,0,0,0,89.19999694824219,,
01001000127230320431,1,1074850,01,001,0001,MC032,46,0,1,12,5,2,4,1,2,1,2,CLONAZEPAM,,,1,1,9,1,,1,1,2,,2016/10/25,223,2,2o71,2,1,5685.014946672593,3,,,2,2,2,2,2,1,2,0,97.19999694824219,97.19999694824219,1,4,26.4501953125,26.4501953125,2,2,2,0,0,2,1,2,1,0,2,1,1,1,1,0,0,1,0,2,1,1,0,2,0,1,1,2,1,2,1,1,1,1,0,0,1,0,1,0,0,1,97.19999694824219,CLONAZEPAM,
01001000127230320511,1,1074868,01,001,0001,MC032,29,0,1,10,6,2,2,1,1,,1,,,,1,2,1,2,,,1,2,,2016/10/25,223,2,2o71,2,1,8935.415460154269,3,,,2,2,2,2,2,2,2,7,119.69999694824219,119.69999694824219,1,4,44.44509506225586,44.44509506225586,3,2,1,0,1,2,1,1,0,0,1,0,1,0,1,0,1,0,0,2,0,1,0,1,1,1,0,2,1,1,0,0,0,1,1,0,1,0,0,0,0,0,119.69999694824219,,
01001000127230380011,1,1076199,01,001,0001,MC036,47,1,1,10,8,1,2,1,1,,1,,,,1,5,1,1,,,,1,5,2016/10/25,223,2,2o71,2,1,2805.9152562279637,3,,,1,2,2,2,2,1,1,5,96.9000015258789,96.80000305175781,1,4,27.494380950927734,27.494380950927734,2,1,1,0,1,3,1,0,0,1,2,1,0,0,1,0,1,1,0,3,0,0,1,1,1,1,0,2,1,2,1,0,0,1,1,1,0,0,0,0,0,0,96.85000610351562,,
01001000127230380101,4,1076208,01,001,0001,MC036,25,0,1,,7,2,2,2,,,1,,,,9,,,,,,,2,,2016/10/25,223,2,2o71,2,1,24677.633379481074,3,,,2,2,2,2,2,1,2,0,86.5,86.30000305175781,1,4,24.59884262084961,24.59884262084961,1,1,1,,,,0,0,0,0,0,0,1,0,0,0,0,0,0,0,0,0,0,0,0,0,0,0,0,0,0,0,0,0,0,1,0,0,0,0,0,0,86.4000015258789,,
01001000127230380181,2,1076221,01,001,0001,MC036,32,0,1,,5,2,4,1,2,1,1,,,,1,3,1,1,1,1,1,2,,2016/10/25,223,2,2o71,2,1,9871.053351792429,3,,,2,2,2,2,2,2,2,1,117.4000015258789,117.5999984741211,1,4,39.64320755004883,39.64320755004883,3,2,2,1,1,5,1,2,1,0,2,1,1,1,1,1,1,1,1,5,1,1,0,2,1,1,1,3,1,2,1,1,1,1,0,0,1,0,0,0,0,0,117.5,,
01001000127230380271,2,1076216,01,001,0001,MC036,48,0,1,12,7,1,3,1,2,1,2,CLONAZEPAM,,,1,2,9,2,,1,1,2,,2016/10/25,223,2,2o71,2,1,9420.449350327193,3,,,2,2,2,2,1,3,,0,97.80000305175781,97.69999694824219,1,4,27.767654418945312,27.767654418945312,2,1,1,0,0,1,0,2,1,0,1,0,1,1,1,0,0,0,0,1,1,1,0,2,0,0,1,1,0,1,0,0,1,1,0,1,0,0,1,0,0,1,97.75,CLONAZEPAM,
01001000127230380351,2,1076232,01,001,0001,MC036,50,0,1,,7,1,2,2,,,2,FLUOXETINA,,,1,1,3,2,,,,2,,2016/10/25,223,2,2o71,2,1,3159.1951556172157,3,,,2,2,2,2,2,1,1,0,109.9000015258789,109.9000015258789,1,4,30.469223022460938,30.469223022460938,3,1,1,0,0,1,0,0,0,0,0,0,1,0,1,0,0,0,0,1,0,0,0,0,1,0,0,1,0,0,0,0,0,0,0,1,0,0,0,0,0,1,109.9000015258789,FLUOXETINA,