idinsert,folio,int,entidad,desc_ent,munici,desc_mun,locali,desc_loc,inth,maq,completa,sexo,edad_i,edad,meses,intsel,intsel2,peso,peso2,ropa,rpeso,talla,talla2,rtalla,emb,temb,cintura,cintura2,rcintura,cadera,cadera2,rcadera,amputa,ppeso,panto,panto2,rpanto,rodilla,rodilla2,rrodilla,hemien,hemien2,rhemien,brazo,brazo2,rbrazo,sistol3,diastol3,sistol4,diastol4,tbrazo,htension,rtension,tiempo_gen,origen,est_var,region_h,code_upm,rural,ponde_f,pesoprom,tallaprom,grupoednut,imc,edadmeses,imc_valid,imc_valid_clas,imc_valid_clas_sp_mas_ob,prom_peso,prom_talla,talla_m,talla_m2,imc2,imc_cat,prom_cintura,ob_ab_idf,edad_decil
1083390,010010001209A0020131,1,01,AGUASCALIENTES,001,AGUASCALIENTES,0001,AGUASCALIENTES,1,MC036,1,1,67,67,6,1,,78.05000305175781,78.1500015258789,2,1,171,170.89999389648438,1,,,99.19999694824219,99.4000015258789,1,,,,4,3,34,34.099998474121094,1,54.79999923706055,54.900001525878906,1,,,,,,,97,53,103,55,1,19:30,1,2016/09/29,0,223,2,2o72,2,43631.61721191897,78.0999984741211,170.9499969482422,4,26.724699020385742,810,26.724699020385742,2,5,78.10000610351562,170.9499969482422,1.7094999551773071,2.9223899841308594,26.724702835083008,3,99.30000305175781,1,5
1083393,010010001209A0020161,1,01,AGUASCALIENTES,001,AGUASCALIENTES,0001,AGUASCALIENTES,1,MC036,1,1,55,55,3,1,10,77.94999694824219,77.94999694824219,2,1,168.89999389648438,168.89999389648438,1,,,98.5999984741211,98.5999984741211,1,,,,,,,,,,,,,,,,,,128,78,126,76,1,20:40,1,2016/09/29,0,223,2,2o72,2,10382.290205380154,77.94999694824219,168.89999389648438,4,27.32478904724121,663,27.32478904724121,2,5,77.94999694824219,168.89999389648438,1.688999891281128,2.8527207374572754,27.324790954589844,3,98.5999984741211,1,4
1082667,010010001209A0080071,2,01,AGUASCALIENTES,001,AGUASCALIENTES,0001,AGUASCALIENTES,2,MC034,1,2,44,44,0,1,,76.75,76.9000015258789,2,1,161.10000610351562,161.10000610351562,1,4,,95.9000015258789,95.80000305175781,1,,,,,,,,,,,,,,,,,,113,69,112,70,1,20:37,1,2016/09/29,0,223,2,2o72,2,21597.966180859727,76.82499694824219,161.10000610351562,4,29.601348876953125,528,29.601348876953125,2,5,76.82499694824219,161.10000610351562,1.6110000610351562,2.5953211784362793,29.60134506225586,3,95.85000610351562,1,3
1082738,010010001209A0080101,1,01,AGUASCALIENTES,001,AGUASCALIENTES,0001,AGUASCALIENTES,1,MC034,2,2,47,47,1,1,,86.75,86.75,2,1,162,161.89999389648438,1,4,,110.19999694824219,110.19999694824219,1,,,,,,,,,,,,,,,,,,101,65,95,62,1,12:45,1,2016/09/29,0,223,2,2o72,2,10798.983090429863,86.75,161.9499969482422,4,33.07558822631836,565,33.07558822631836,3,5,86.75,161.9499969482422,1.619499921798706,2.6227800846099854,33.075592041015625,4,110.19999694824219,1,3
1083478,010010001209A0120041,1,01,AGUASCALIENTES,001,AGUASCALIENTES,0001,AGUASCALIENTES,1,MC036,1,1,36,36,3,1,,102.69999694824219,102.6500015258789,2,1,166.39999389648438,166.60000610351562,1,,,188.3000030517578,188.39999389648438,1,,,,,,,,,,,,,,,,,,138,100,148,104,1,09:04,1,2016/09/29,0,223,2,2o72,2,4470.168996268715,102.67500305175781,166.5,4,37.03703689575195,435,37.03703689575195,3,5,102.67500305175781,166.5,1.6649999618530273,2.7722249031066895,37.03704071044922,4,188.35000610351562,1,2
1083394,010010001209A0120121,1,01,AGUASCALIENTES,001,AGUASCALIENTES,0001,AGUASCALIENTES,1,MC036,1,2,86,86,2,1,,61.04999923706055,61.04999923706055,2,1,153,152.89999389648438,1,,,94.0999984741211,94,1,,,,4,1,33,33.099998474121094,1,49,49.20000076293945,1,,,,,,,131,75,130,79,1,12:50,1,2016/09/29,0,223,2,2o72,2,9877.056183398372,61.04999923706055,152.9499969482422,4,26.09676742553711,1034,26.09676742553711,2,5,61.04999923706055,152.9499969482422,1.5295000076293945,2.3393702507019043,26.09676742553711,3,94.05000305175781,1,7
1083397,010010001209A0120171,2,01,AGUASCALIENTES,001,AGUASCALIENTES,0001,AGUASCALIENTES,2,MC036,1,2,63,63,3,1,10,54.04999923706055,54.04999923706055,2,1,169,169.1999969482422,1,,,70,69.80000305175781,1,,,,4,1,33.900001525878906,34.099998474121094,1,54.20000076293945,54.099998474121094,1,,,,,,,125,68,116,67,1,13:30,1,2016/09/29,0,223,2,2o72,2,16814.67538728165,54.04999923706055,169.10000610351562,4,18.90203094482422,759,18.90203094482422,1,1,54.04999923706055,169.10000610351562,1.6910001039505005,2.8594813346862793,18.902029037475586,2,69.9000015258789,0,5
1082049,010010001209A0210011,1,01,AGUASCALIENTES,001,AGUASCALIENTES,0001,AGUASCALIENTES,1,MC032,1,2,55,55,5,1,10,76.6500015258789,76.69999694824219,1,1,161.10000610351562,161.10000610351562,1,,,95.69999694824219,95.5999984741211,1,,,,,,,,,,,,,,,,,,114,61,110,66,1,11:35,1,2016/09/29,0,223,2,2o72,2,3880.309704757303,76.67500305175781,161.10000610351562,4,29.54355239868164,665,29.54355239868164,2,5,76.67500305175781,161.10000610351562,1.6110000610351562,2.5953211784362793,29.543550491333008,3,95.64999389648438,1,4
1082097,010010001209A0210051,1,01,AGUASCALIENTES,001,AGUASCALIENTES,0001,AGUASCALIENTES,1,MC032,1,1,60,60,5,1,10,77,77,1,1,176.1999969482422,176.1999969482422,1,,,94.5999984741211,94.5999984741211,1,,,,4,1,37.5,37.5,1,52,52.099998474121094,1,,,,,,,102,56,101,57,1,19:34,1,2016/09/29,0,223,2,2o72,2,7046.803306819106,77,176.1999969482422,4,24.801555633544922,725,24.801555633544922,1,1,77,176.1999969482422,1.7619999647140503,3.1046438217163086,24.801557540893555,2,94.5999984741211,1,5
1082098,010010001209A0210081,1,01,AGUASCALIENTES,001,AGUASCALIENTES,0001,AGUASCALIENTES,1,MC032,1,2,56,56,7,1,,57.79999923706055,57.79999923706055,1,1,168.1999969482422,168.1999969482422,1,,,78.5,78.5,1,,,,,,,,,,,,,,,,,,90,58,91,59,1,20:34,1,2016/09/29,0,223,2,2o72,2,3880.309704757303,57.79999923706055,168.1999969482422,4,20.43035316467285,679,20.43035316467285,1,1,57.79999923706055,168.1999969482422,1.681999921798706,2.8291237354278564,20.43035316467285,2,78.5,0,4
1082046,010010001209A0210121,2,01,AGUASCALIENTES,001,AGUASCALIENTES,0001,AGUASCALIENTES,2,MC032,1,2,44,44,5,1,10,57.150001525878906,57.150001525878906,1,1,165.8000030517578,165.89999389648438,1,4,,79.19999694824219,79.4000015258789,1,,,,,,,,,,,,,,,,,,84,50,83,46,1,17:05,1,2016/09/29,0,223,2,2o72,2,14427.791173448804,57.150001525878906,165.85000610351562,4,20.777116775512695,533,20.777116775512695,1,1,57.150001525878906,165.85000610351562,1.658500075340271,2.750622510910034,20.777114868164062,2,79.30000305175781,0,3
1082652,010010001209A0260041,1,01,AGUASCALIENTES,001,AGUASCALIENTES,0001,AGUASCALIENTES,1,MC034,1,1,62,62,2,1,,76.44999694824219,76.30000305175781,2,1,174.39999389648438,174.39999389648438,1,,,,,4,,,,4,1,34.70000076293945,34.599998474121094,1,54.70000076293945,54.5,1,,,,,,,115,66,115,63,1,11:50,1,2016/09/29,0,223,2,2o72,2,42941.45765092893,76.375,174.39999389648438,4,25.110668182373047,746,25.110668182373047,2,5,76.375,174.39999389648438,1.74399995803833,3.0415358543395996,25.110668182373047,3,,,5
1082655,010010001209A0260141,1,01,AGUASCALIENTES,001,AGUASCALIENTES,0001,AGUASCALIENTES,1,MC034,1,1,68,68,10,1,10,60.79999923706055,60.75,2,1,158.1999969482422,158.3000030517578,1,,,87.80000305175781,87.69999694824219,1,,,,4,1,32.79999923706055,32.599998474121094,1,49.099998474121094,49,1,,,,,,,149,72,147,69,1,19:14,1,2016/09/29,0,223,2,2o72,2,20051.29467459512,60.775001525878906,158.25,4,24.268198013305664,826,24.268198013305664,1,1,60.775001525878906,158.25,1.5824999809265137,2.5043060779571533,24.268199920654297,2,87.75,0,5
1082100,010010001209A0310011,2,01,AGUASCALIENTES,001,AGUASCALIENTES,0001,AGUASCALIENTES,2,MC032,1,2,0,69,8,1,,61.54999923706055,61.599998474121094,1,1,148.10000610351562,148.10000610351562,1,,,88.5,88.5,1,,,,4,1,35.5,35.5,1,41,41,1,,,,,,,102,59,93,57,1,15:40,1,2016/09/29,0,223,2,2o72,2,13239.45828838505,61.57500076293945,148.10000610351562,4,28.073354721069336,836,28.073354721069336,2,5,61.57499694824219,148.10000610351562,1.4810000658035278,2.193361282348633,28.073348999023438,3,88.5,1,5
1082044,010010001209A0310031,1,01,AGUASCALIENTES,001,AGUASCALIENTES,0001,AGUASCALIENTES,1,MC032,1,2,87,87,5,1,,46.599998474121094,46.599998474121094,1,1,148.60000610351562,148.60000610351562,1,,,73.4000015258789,73.4000015258789,1,,,,4,2,30,30.100000381469727,1,40.20000076293945,40.099998474121094,1,,,,,,,125,71,115,75,1,12:50,1,2016/09/29,0,223,2,2o72,2,4413.152762795016,46.599998474121094,148.60000610351562,4,21.103199005126953,1049,21.103199005126953,1,1,46.599998474121094,148.60000610351562,1.4860000610351562,2.2081961631774902,21.10319709777832,2,73.4000015258789,0,7
1082042,010010001209A0310071,2,01,AGUASCALIENTES,001,AGUASCALIENTES,0001,AGUASCALIENTES,2,MC032,1,2,45,45,0,1,10,65.55000305175781,65.44999694824219,1,1,150.8000030517578,150.6999969482422,1,4,,92.19999694824219,92.0999984741211,1,,,,,,,,,,,,,,,,,,104,66,101,67,1,18:10,1,2016/09/29,0,223,2,2o72,2,27934.659506039177,65.5,150.75,4,28.822168350219727,540,28.822168350219727,2,5,65.5,150.75,1.5075000524520874,2.2725563049316406,28.822168350219727,3,92.14999389648438,1,3
1082059,010010001209A0310131,1,01,AGUASCALIENTES,001,AGUASCALIENTES,0001,AGUASCALIENTES,1,MC032,1,2,83,83,8,1,,59.79999923706055,59.79999923706055,1,1,156.5,156.5,1,,,85.4000015258789,85.5,1,,,,4,1,36.5,36.599998474121094,1,46.5,46.5,1,,,,,,,128,57,119,56,1,19:30,1,2016/09/29,0,223,2,2o72,2,4413.152762795016,59.79999923706055,156.5,4,24.41588592529297,1004,24.41588592529297,1,1,59.79999923706055,156.5,1.565000057220459,2.4492251873016357,24.415884017944336,2,85.44999694824219,1,7
1083440,010010001262A0010211,1,01,AGUASCALIENTES,001,AGUASCALIENTES,0001,AGUASCALIENTES,1,MC036,1,1,74,74,2,1,10,76.19999694824219,76.19999694824219,2,1,152,152.1999969482422,1,,,119.5999984741211,119.4000015258789,1,,,,4,1,36.900001525878906,37,1,53.099998474121094,53,1,,,,,,,157,97,159,92,1,14:00,1,2016/09/29,0,222,2,2o50,2,16565.341747736424,76.19999694824219,152.10000610351562,4,32.937950134277344,890,32.937950134277344,3,5,76.19999694824219,152.10000610351562,1.5210000276565552,2.313441038131714,32.93794631958008,4,119.5,1,6
1082709,010010001262A0080121,1,01,AGUASCALIENTES,001,AGUASCALIENTES,0001,AGUASCALIENTES,1,MC034,1,2,41,41,10,1,,118.5999984741211,118.5999984741211,2,1,159.60000610351562,159.5,1,4,,122.80000305175781,122.80000305175781,1,,,,,,,,,,,,,,,,,,109,70,108,77,1,13:52,1,2016/09/29,0,222,2,2o50,2,10005.448905781243,118.5999984741211,159.5500030517578,4,46.58982467651367,502,46.58982467651367,3,5,118.5999984741211,159.5500030517578,1.5954999923706055,2.5456202030181885,46.58982467651367,4,122.80000305175781,1,3
1082736,010010001262A0080251,2,01,AGUASCALIENTES,001,AGUASCALIENTES,0001,AGUASCALIENTES,2,MC034,1,2,58,58,2,1,10,67.4000015258789,67.3499984741211,2,1,152.39999389648438,152.39999389648438,1,,,93.30000305175781,93.5,1,,,,,,,,,,,,,,,,,,127,77,213,84,1,19:12,1,2016/09/29,0,222,2,2o50,2,10580.129024292684,67.375,152.39999389648438,4,29.008739471435547,698,29.008739471435547,2,5,67.375,152.39999389648438,1.5239999294281006,2.322575807571411,29.00874137878418,3,93.4000015258789,1,4
1082745,010010001262A0080311,2,01,AGUASCALIENTES,001,AGUASCALIENTES,0001,AGUASCALIENTES,2,MC034,1,2,28,28,8,1,12,64.05000305175781,64.0999984741211,2,1,161.3000030517578,161.5,1,2,,,,,,,,,,,,,,,,,,,,,,144,77,147,74,1,09:13,1,2016/09/29,0,222,2,2o50,2,14827.819697208866,64.07499694824219,161.39999389648438,4,24.596967697143555,344,24.596967697143555,1,1,64.07499694824219,161.39999389648438,1.6139999628067017,2.6049959659576416,24.596965789794922,2,,,1
1082728,010010001262A0080371,1,01,AGUASCALIENTES,001,AGUASCALIENTES,0001,AGUASCALIENTES,1,MC034,1,1,25,25,8,1,,69.1500015258789,69.05000305175781,2,1,171.3000030517578,171.1999969482422,1,,,92.5,92.5,1,,,,,,,,,,,,,,,,,,121,79,116,77,1,20:24,1,2016/09/29,0,222,2,2o50,2,11811.922741423183,69.0999984741211,171.25,4,23.562257766723633,308,23.562257766723633,1,1,69.10000610351562,171.25,1.712499976158142,2.9326560497283936,23.562259674072266,2,92.5,1,1
1082727,010010001262A0080441,1,01,AGUASCALIENTES,001,AGUASCALIENTES,0001,AGUASCALIENTES,1,MC034,1,2,76,76,8,1,10,49.45000076293945,49.5,2,1,147.10000610351562,147.1999969482422,1,,,80.5999984741211,80.5999984741211,1,,,,4,4,31.700000762939453,31.700000762939453,1,47.400001525878906,47.400001525878906,1,,,,,,,144,68,144,63,1,18:11,1,2016/09/29,0,222,2,2o50,2,6173.532451262419,49.474998474121094,147.14999389648438,4,22.84889793395996,920,22.84889793395996,1,1,49.474998474121094,147.14999389648438,1.4714999198913574,2.1653120517730713,22.848899841308594,2,80.5999984741211,1,6
1082726,010010001262A0130041,1,01,AGUASCALIENTES,001,AGUASCALIENTES,0001,AGUASCALIENTES,1,MC034,1,2,52,52,0,1,,,,4,2,,,2,,,,,2,,,,,,,,,,,,,,,,,,120,77,122,71,1,13:52,1,2016/09/29,0,222,2,2o50,2,3661.9234449034097,,,4,,624,,,,,,,,,,,,4
1082722,010010001262A0130151,2,01,AGUASCALIENTES,001,AGUASCALIENTES,0001,AGUASCALIENTES,2,MC034,1,2,28,28,10,1,,51.650001525878906,51.599998474121094,2,1,150.3000030517578,150.5,1,4,,81.30000305175781,81.19999694824219,1,,,,,,,,,,,,,,,,,,94,68,90,63,1,16:01,1,2016/09/29,0,222,2,2o50,2,10264.211421493463,51.625,150.39999389648438,4,22.822561264038086,346,22.822561264038086,1,1,51.625,150.39999389648438,1.503999948501587,2.2620158195495605,22.82256317138672,2,81.25,1,1
1082737,010010001262A0130201,1,01,AGUASCALIENTES,001,AGUASCALIENTES,0001,AGUASCALIENTES,1,MC034,1,1,56,56,2,1,10,79.1500015258789,79.25,2,1,165.10000610351562,165,1,,,102.30000305175781,102.4000015258789,1,,,,,,,,,,,,,,,,,,136,88,135,95,1,17:07,1,2016/09/29,0,222,2,2o50,2,5822.859040476992,79.19999694824219,165.0500030517578,4,29.073286056518555,674,29.073286056518555,2,5,79.19999694824219,165.0500030517578,1.6505000591278076,2.7241504192352295,29.073284149169922,3,102.35000610351562,1,4
1082702,010010001262A0130261,4,01,AGUASCALIENTES,001,AGUASCALIENTES,0001,AGUASCALIENTES,4,MC034,1,2,29,29,6,1,10,63,63,2,1,161.1999969482422,161.3000030517578,1,4,,87.4000015258789,87.5999984741211,1,,,,,,,,,,,,,,,,,,110,59,106,48,1,07:25,1,2016/09/29,0,222,2,2o50,2,25660.52855373366,63,161.25,4,24.229312896728516,354,24.229312896728516,1,1,63,161.25,1.6124999523162842,2.60015606880188,24.22931480407715,2,87.5,1,1
1082108,010010001262A0170051,1,01,AGUASCALIENTES,001,AGUASCALIENTES,0001,AGUASCALIENTES,1,MC032,1,2,64,64,11,1,,57.150001525878906,57.150001525878906,1,1,156.6999969482422,156.6999969482422,1,,,92.5999984741211,92.5999984741211,1,,,,4,2,31.5,31.5,1,42,42,1,,,,,,,161,85,157,91,1,20:05,1,2016/09/29,0,222,2,2o50,2,3303.841216150655,57.150001525878906,156.6999969482422,4,23.27438735961914,779,23.27438735961914,1,1,57.150001525878906,156.6999969482422,1.566999912261963,2.455488681793213,23.274389266967773,2,92.5999984741211,1,5
1082093,010010001262A0170081,1,01,AGUASCALIENTES,001,AGUASCALIENTES,0001,AGUASCALIENTES,1,MC032,1,1,56,56,8,1,10,74.19999694824219,74.19999694824219,1,1,169.8000030517578,169.89999389648438,1,,,93.69999694824219,93.69999694824219,1,,,,,,,,,,,,,,,,,,126,93,124,89,1,08:08,1,2016/09/29,0,222,2,2o50,2,10506.938216055894,74.19999694824219,169.85000610351562,4,25.720108032226562,680,25.720108032226562,2,5,74.19999694824219,169.85000610351562,1.6985000371932983,2.8849024772644043,25.72010612487793,3,93.69999694824219,1,4
1082075,010010001262A0170131,2,01,AGUASCALIENTES,001,AGUASCALIENTES,0001,AGUASCALIENTES,2,MC032,1,2,28,28,11,1,12,127.19999694824219,127.30000305175781,1,1,171.1999969482422,171.1999969482422,1,4,,119.5,119.5,1,,,,,,,,,,,,,,,,,,117,67,119,67,1,12:23,1,2016/09/29,0,222,2,2o50,2,9260.52257941424,127.25,171.1999969482422,4,43.416046142578125,347,43.416046142578125,3,5,127.25,171.1999969482422,1.7120000123977661,2.9309439659118652,43.416046142578125,4,119.5,1,1
1082088,010010001262A0170161,1,01,AGUASCALIENTES,001,AGUASCALIENTES,0001,AGUASCALIENTES,1,MC032,1,2,48,48,0,1,,56.099998474121094,56.099998474121094,1,1,144,144,1,4,,78,78,1,,,,,,,,,,,,,,,,,,136,93,137,97,1,03:55,1,2016/09/29,0,222,2,2o50,2,3124.3867069210405,56.099998474121094,144,4,27.054397583007812,576,27.054397583007812,2,5,56.099998474121094,144,1.440000057220459,2.0736000537872314,27.054397583007812,3,78,0,3
1082070,010010001262A0170191,1,01,AGUASCALIENTES,001,AGUASCALIENTES,0001,AGUASCALIENTES,1,MC032,1,1,49,49,7,1,,46.599998474121094,46.599998474121094,1,1,158.89999389648438,158.89999389648438,1,,,76.30000305175781,76.30000305175781,1,,,,,,,,,,,,,,,,,,166,94,144,95,1,20:40,1,2016/09/29,0,222,2,2o50,2,9594.62915189982,46.599998474121094,158.89999389648438,4,18.456022262573242,595,18.456022262573242,1,1,46.599998474121094,158.89999389648438,1.5889999866485596,2.52492094039917,18.456022262573242,1,76.30000305175781,0,3
1082083,010010001262A0220031,1,01,AGUASCALIENTES,001,AGUASCALIENTES,0001,AGUASCALIENTES,1,MC032,1,2,0,63,6,1,,76.25,76.25,1,1,153.8000030517578,153.8000030517578,1,,,97.69999694824219,97.69999694824219,1,,,,4,3,37.099998474121094,37.099998474121094,1,47,47,1,,,,,,,114,69,111,66,1,12:00,1,2016/09/29,0,222,2,2o50,2,5206.261509973727,76.25,153.8000030517578,4,32.234962463378906,762,32.234962463378906,3,5,76.25,153.8000030517578,1.5379999876022339,2.3654439449310303,32.234962463378906,4,97.69999694824219,1,5
1082086,010010001262A0220121,3,01,AGUASCALIENTES,001,AGUASCALIENTES,0001,AGUASCALIENTES,3,MC032,1,2,0,24,5,1,13,55,55,1,1,163.5,163.60000610351562,1,4,,73.5,73.5,1,,,,,,,,,,,,,,,,,,93,63,91,64,1,21:55,1,2016/09/29,0,222,2,2o50,2,21889.385315384578,55,163.5500030517578,4,20.56182098388672,293,20.56182098388672,1,1,55,163.5500030517578,1.6355000734329224,2.6748604774475098,20.56182098388672,2,73.5,0,1
1082106,010010001262A0220151,1,01,AGUASCALIENTES,001,AGUASCALIENTES,0001,AGUASCALIENTES,1,MC032,1,2,45,45,5,1,12,77.1500015258789,77.1500015258789,1,1,158.5,158.5,1,4,,99.19999694824219,99.19999694824219,1,,,,,,,,,,,,,,,,,,91,57,95,64,1,12:19,1,2016/09/29,0,222,2,2o50,2,4923.47337244879,77.1500015258789,158.5,4,30.709829330444336,545,30.709829330444336,3,5,77.1500015258789,158.5,1.5850000381469727,2.5122251510620117,30.709827423095703,4,99.19999694824219,1,3
1083455,010010001262A0280211,1,01,AGUASCALIENTES,001,AGUASCALIENTES,0001,AGUASCALIENTES,1,MC036,1,1,39,39,2,1,12,92.80000305175781,92.75,1,1,182.5,182.5,1,,,98.9000015258789,98.69999694824219,1,,,,,,,,,,,,,,,,,,117,67,115,65,1,18:42,1,2016/09/29,0,222,2,2o50,2,17266.181948912723,92.7750015258789,182.5,4,27.855133056640625,470,27.855133056640625,2,5,92.7750015258789,182.5,1.8250000476837158,3.330625057220459,27.855133056640625,3,98.80000305175781,1,2
1083477,010010001262A0280291,1,01,AGUASCALIENTES,001,AGUASCALIENTES,0001,AGUASCALIENTES,1,MC036,1,2,45,45,7,1,10,80,80.0999984741211,1,1,159.10000610351562,159.10000610351562,1,4,,105.19999694824219,105.19999694824219,1,,,,,,,,,,,,,,,,,,108,74,103,72,1,16:05,1,2016/09/29,0,222,2,2o50,2,5622.544499260934,80.05000305175781,159.10000610351562,4,31.624303817749023,547,31.624303817749023,3,5,80.05000305175781,159.10000610351562,1.5910000801086426,2.5312812328338623,31.62430191040039,4,105.19999694824219,1,3
1083463,010010001262A0280361,1,01,AGUASCALIENTES,001,AGUASCALIENTES,0001,AGUASCALIENTES,1,MC036,1,1,56,56,2,1,10,65.25,65.3499984741211,1,1,164.1999969482422,164.1999969482422,1,,,85.4000015258789,85.5,1,,,,,,,,,,,,,,,,,,122,73,116,67,1,22:45,1,2016/09/29,0,222,2,2o50,2,18907.943610148166,65.30000305175781,164.1999969482422,4,24.219594955444336,674,24.219594955444336,1,1,65.30000305175781,164.1999969482422,1.6419999599456787,2.6961638927459717,24.21959686279297,2,85.44999694824219,0,4
1083459,010010001262A0280431,2,01,AGUASCALIENTES,001,AGUASCALIENTES,0001,AGUASCALIENTES,2,MC036,1,2,74,74,5,1,,62.04999923706055,62.04999923706055,2,1,146,146.1999969482422,1,,,94.19999694824219,94.5999984741211,1,,,,4,1,35.400001525878906,35.5,1,48,47.900001525878906,1,,,,,,,127,71,126,71,1,14:21,1,2016/09/29,0,222,2,2o50,2,13876.823019823956,62.04999923706055,146.10000610351562,4,29.069753646850586,893,29.069753646850586,2,5,62.04999923706055,146.10000610351562,1.4610000848770142,2.134521245956421,29.06974983215332,3,94.39999389648438,1,6
1083467,010010001262A0280511,3,01,AGUASCALIENTES,001,AGUASCALIENTES,0001,AGUASCALIENTES,3,MC036,1,2,21,21,8,1,,45.650001525878906,45.650001525878906,2,1,152.89999389648438,153,1,4,,64.9000015258789,65,1,,,,,,,,,,,,,,,,,,107,77,101,73,1,14:20,1,2016/09/29,0,222,2,2o50,2,33329.86929807922,45.650001525878906,152.9499969482422,4,19.513797760009766,260,19.513797760009766,1,1,45.650001525878906,152.9499969482422,1.5295000076293945,2.3393702507019043,19.5137996673584,2,64.94999694824219,0,1
1082656,01001000127230010011,1,01,AGUASCALIENTES,001,AGUASCALIENTES,0001,AGUASCALIENTES,1,MC034,1,1,60,60,9,1,10,61.150001525878906,61.04999923706055,2,1,157,156.89999389648438,1,,,86.5,86.5,1,,,,4,3,34.29999923706055,34.400001525878906,1,52.29999923706055,52.20000076293945,1,,,,,,,134,43,127,76,1,17:21,1,2016/09/29,0,223,2,2o71,2,8494.15982207352,61.099998474121094,156.9499969482422,4,24.80381965637207,729,24.80381965637207,1,1,61.099998474121094,156.9499969482422,1.5694999694824219,2.4633302688598633,24.80381965637207,2,86.5,0,5
1082684,01001000127230010131,1,01,AGUASCALIENTES,001,AGUASCALIENTES,0001,AGUASCALIENTES,1,MC034,1,2,52,52,9,1,,75.75,75.75,2,1,152.89999389648438,152.89999389648438,1,,,112.9000015258789,112.9000015258789,1,,,,,,,,,,,,,,,,,,150,84,141,80,1,10:32,1,2016/09/29,0,223,2,2o71,2,1559.0979983532147,75.75,152.89999389648438,4,32.40169143676758,633,32.40169143676758,3,5,75.75,152.89999389648438,1.528999924659729,2.3378407955169678,32.40169143676758,4,112.9000015258789,1,4
1082664,01001000127230010191,4,01,AGUASCALIENTES,001,AGUASCALIENTES,0001,AGUASCALIENTES,4,MC034,1,1,23,23,4,1,10,69.30000305175781,69.3499984741211,2,1,166.60000610351562,166.3000030517578,1,,,82.5,82.5999984741211,1,,,,,,,,,,,,,,,,,,117,54,110,58,1,08:12,1,2016/09/29,0,223,2,2o71,2,28228.99067992894,69.32499694824219,166.4499969482422,4,25.022014617919922,280,25.022014617919922,2,5,69.32499694824219,166.45001220703125,1.664500117301941,2.7705607414245605,25.022008895874023,3,82.55000305175781,0,1
1082067,01001000127230070011,2,01,AGUASCALIENTES,001,AGUASCALIENTES,0001,AGUASCALIENTES,2,MC032,1,1,47,47,11,1,10,95.25,95.25,1,1,176.6999969482422,176.6999969482422,1,,,104.80000305175781,104.80000305175781,1,,,,,,,,,,,,,,,,,,120,76,116,76,1,08:50,1,2016/09/29,0,223,2,2o71,2,3028.7631369394603,95.25,176.6999969482422,4,30.506465911865234,575,30.506465911865234,3,5,95.25,176.6999969482422,1.7669999599456787,3.122288942337036,30.506465911865234,4,104.80000305175781,1,3
1082081,01001000127230070101,3,01,AGUASCALIENTES,001,AGUASCALIENTES,0001,AGUASCALIENTES,3,MC032,1,1,23,23,8,1,10,51.45000076293945,51.400001525878906,1,1,178.5,178.5,1,,,73.19999694824219,73.19999694824219,1,,,,,,,,,,,,,,,,,,120,88,126,92,1,21:50,1,2016/09/29,0,223,2,2o71,2,34379.57805897596,51.42499923706055,178.5,4,16.139789581298828,284,16.139789581298828,1,1,51.42500305175781,178.5,1.784999966621399,3.186224937438965,16.139789581298828,1,73.19999694824219,0,1
1082063,01001000127230070361,1,01,AGUASCALIENTES,001,AGUASCALIENTES,0001,AGUASCALIENTES,1,MC032,1,2,65,65,1,1,,78.69999694824219,78.69999694824219,1,1,153.39999389648438,153.5,1,,,116.5,116.5,1,,,,4,2,35.20000076293945,35.20000076293945,1,47,47.099998474121094,1,,,,,,,190,92,190,90,1,02:55,1,2016/09/29,0,223,2,2o71,2,2216.1309455403903,78.69999694824219,153.4499969482422,4,33.42265319824219,781,33.42265319824219,3,5,78.69999694824219,153.4499969482422,1.534500002861023,2.3546903133392334,33.42265319824219,4,116.5,1,5
1082090,01001000127230070541,1,01,AGUASCALIENTES,001,AGUASCALIENTES,0001,AGUASCALIENTES,1,MC032,1,2,30,30,2,1,10,95.0999984741211,95.0999984741211,1,1,156,156.10000610351562,1,4,,109.19999694824219,109.19999694824219,1,,,,,,,,,,,,,,,,,,134,89,143,91,1,21:05,1,2016/09/29,0,223,2,2o71,2,5901.90981036006,95.0999984741211,156.0500030517578,4,39.05287170410156,362,39.05287170410156,3,5,95.0999984741211,156.0500030517578,1.5605000257492065,2.4351603984832764,39.0528678894043,4,109.19999694824219,1,2