idinsert,folio,int,entidad,desc_ent,munici,desc_mun,locali,desc_loc,inth,maq,completa,sexo,edad_i,edad,meses,intsel,intsel2,peso,peso2,ropa,rpeso,talla,talla2,rtalla,emb,temb,cintura,cintura2,rcintura,cadera,cadera2,rcadera,amputa,ppeso,panto,panto2,rpanto,rodilla,rodilla2,rrodilla,hemien,hemien2,rhemien,brazo,brazo2,rbrazo,sistol3,diastol3,sistol4,diastol4,tbrazo,htension,rtension,TIEMPO_GEN,origen,c1,est_var,region_h,code_upm,rural,ponde_f,pesoprom,tallaprom,GRUPOEDNUT,IMC,edadmeses,WAZ,HAZ,BAZ,WHZ,WAZ_VALID,HAZ_VALID,BAZ_VALID,WHZ_VALID,WAZ_VALID_CLAS,HAZ_VALID_CLAS,WHZ_VALID_CLAS,BAZ_VALID_CLAS,IMC_VALID,IMC_VALID_CLAS,SET_VALID_PREESC,filter_$,BAZ_VALID_CLAS_SP_MAS_OB,IMC_VALID_CLAS_SP_MAS_OB
1083390,010010001209A0020131,1,01,AGUASCALIENTES,001,AGUASCALIENTES,0001,AGUASCALIENTES,1,MC036,1,1,67,67,6,1,,78.05,78.15,2,1,171,170.9,1,,,99.2,99.4,1,,,,4,3,34,34.1,1,54.8,54.9,1,,,,,,,97,53,103,55,1,19:30,1,2016/09/29,0,1,223,2,2o72,2,43631.61721191897,78.1,170.95,4,26.724699071248274,810,,,,,,,,,,,,,26.724699071248274,2,,0,,5
1083393,010010001209A0020161,1,01,AGUASCALIENTES,001,AGUASCALIENTES,0001,AGUASCALIENTES,1,MC036,1,1,55,55,3,1,10,77.95,77.95,2,1,168.9,168.9,1,,,98.6,98.6,1,,,,,,,,,,,,,,,,,,128,78,126,76,1,20:40,1,2016/09/29,0,1,223,2,2o72,2,10382.290205380154,77.95,168.9,4,27.32478921002089,663,,,,,,,,,,,,,27.32478921002089,2,,0,,5
1082668,010010001209A0080071,3,01,AGUASCALIENTES,001,AGUASCALIENTES,0001,AGUASCALIENTES,3,MC034,1,1,16,16,6,2,20,68.4,68.5,2,1,177.7,177.6,1,,,,,,,,,,,,,,,,,,,,,,,,,,,,,,2016/09/29,0,1,223,2,2o72,2,20291.228764435837,68.45,177.64999999999998,3,21.689174796608544,198,,0.44,0.31,,,0.44,0.31,,,2,,1,21.689174796608544,,,1,1,
1082667,010010001209A0080071,2,01,AGUASCALIENTES,001,AGUASCALIENTES,0001,AGUASCALIENTES,2,MC034,1,2,44,44,0,1,,76.75,76.9,2,1,161.1,161.1,1,4,,95.9,95.8,1,,,,,,,,,,,,,,,,,,113,69,112,70,1,20:37,1,2016/09/29,0,1,223,2,2o72,2,21597.966180859727,76.825,161.1,4,29.601347964278798,528,,,,,,,,,,,,,29.601347964278798,2,,0,,5
1082738,010010001209A0080101,1,01,AGUASCALIENTES,001,AGUASCALIENTES,0001,AGUASCALIENTES,1,MC034,2,2,47,47,1,1,,86.75,86.75,2,1,162,161.9,1,4,,110.2,110.2,1,,,,,,,,,,,,,,,,,,101,65,95,62,1,12:45,1,2016/09/29,0,1,223,2,2o72,2,10798.983090429863,86.75,161.95,4,33.07558839517722,565,,,,,,,,,,,,,33.07558839517722,3,,0,,5
1083478,010010001209A0120041,1,01,AGUASCALIENTES,001,AGUASCALIENTES,0001,AGUASCALIENTES,1,MC036,1,1,36,36,3,1,,102.7,102.65,2,1,166.4,166.6,1,,,188.3,188.4,1,,,,,,,,,,,,,,,,,,138,100,148,104,1,09:04,1,2016/09/29,0,1,223,2,2o72,2,4470.168996268715,102.67500000000001,166.5,4,37.03703703703704,435,,,,,,,,,,,,,37.03703703703704,3,,0,,5
1083394,010010001209A0120121,1,01,AGUASCALIENTES,001,AGUASCALIENTES,0001,AGUASCALIENTES,1,MC036,1,2,86,86,2,1,,61.05,61.05,2,1,153,152.9,1,,,94.1,94,1,,,,4,1,33,33.1,1,49,49.2,1,,,,,,,131,75,130,79,1,12:50,1,2016/09/29,0,1,223,2,2o72,2,9877.056183398372,61.05,152.95,4,26.09676685424208,1034,,,,,,,,,,,,,26.09676685424208,2,,0,,5
1083397,010010001209A0120171,2,01,AGUASCALIENTES,001,AGUASCALIENTES,0001,AGUASCALIENTES,2,MC036,1,2,63,63,3,1,10,54.05,54.05,2,1,169,169.2,1,,,70,69.8,1,,,,4,1,33.9,34.1,1,54.2,54.1,1,,,,,,,125,68,116,67,1,13:30,1,2016/09/29,0,1,223,2,2o72,2,16814.67538728165,54.05,169.1,4,18.902031522503563,759,,,,,,,,,,,,,18.902031522503563,1,,0,,1
1082049,010010001209A0210011,1,01,AGUASCALIENTES,001,AGUASCALIENTES,0001,AGUASCALIENTES,1,MC032,1,2,55,55,5,1,10,76.65,76.7,1,1,161.1,161.1,1,,,95.7,95.6,1,,,,,,,,,,,,,,,,,,114,61,110,66,1,11:35,1,2016/09/29,0,1,223,2,2o72,2,3880.309704757303,76.67500000000001,161.1,4,29.543551645441937,665,,,,,,,,,,,,,29.543551645441937,2,,0,,5
1082097,010010001209A0210051,1,01,AGUASCALIENTES,001,AGUASCALIENTES,0001,AGUASCALIENTES,1,MC032,1,1,60,60,5,1,10,77,77,1,1,176.2,176.2,1,,,94.6,94.6,1,,,,4,1,37.5,37.5,1,52,52.1,1,,,,,,,102,56,101,57,1,19:34,1,2016/09/29,0,1,223,2,2o72,2,7046.803306819106,77,176.2,4,24.8015553474086,725,,,,,,,,,,,,,24.8015553474086,1,,0,,1
1082098,010010001209A0210081,1,01,AGUASCALIENTES,001,AGUASCALIENTES,0001,AGUASCALIENTES,1,MC032,1,2,56,56,7,1,,57.8,57.8,1,1,168.2,168.2,1,,,78.5,78.5,1,,,,,,,,,,,,,,,,,,90,58,91,59,1,20:34,1,2016/09/29,0,1,223,2,2o72,2,3880.309704757303,57.8,168.2,4,20.43035229279452,679,,,,,,,,,,,,,20.43035229279452,1,,0,,1
1082048,010010001209A0210121,4,01,AGUASCALIENTES,001,AGUASCALIENTES,0001,AGUASCALIENTES,4,MC032,1,1,4,4,4,4,40,14.5,14.45,1,1,98.5,98.5,1,,,,,,,,,,,,,,,,,,,,,,,,,,,,,,2016/09/29,0,1,223,2,2o72,2,25030.22365965718,14.475,98.5,1,14.919219768610374,52,-1.25,-1.63,-0.28,-0.39,-1.25,-1.63,-0.28,-0.39,2,2,2,1,14.919219768610374,,1,0,1,
1082047,010010001209A0210121,3,01,AGUASCALIENTES,001,AGUASCALIENTES,0001,AGUASCALIENTES,3,MC032,1,2,19,19,1,2,,49.55,49.6,1,1,157.5,157.7,1,4,,,,,,,,,,,,,,,,,,,,,,,,,,,,,2016/09/29,0,1,223,2,2o72,2,6672.8119729652235,49.575,157.6,3,19.959529361745993,229,,-0.85,-0.5,,,-0.85,-0.5,,,2,,1,19.959529361745993,,,1,1,
1082046,010010001209A0210121,2,01,AGUASCALIENTES,001,AGUASCALIENTES,0001,AGUASCALIENTES,2,MC032,1,2,44,44,5,1,10,57.15,57.15,1,1,165.8,165.9,1,4,,79.2,79.4,1,,,,,,,,,,,,,,,,,,84,50,83,46,1,17:05,1,2016/09/29,0,1,223,2,2o72,2,14427.791173448804,57.15,165.85000000000002,4,20.777116886915305,533,,,,,,,,,,,,,20.777116886915305,1,,0,,1
1082652,010010001209A0260041,1,01,AGUASCALIENTES,001,AGUASCALIENTES,0001,AGUASCALIENTES,1,MC034,1,1,62,62,2,1,,76.45,76.3,2,1,174.4,174.4,1,,,222.2,222.2,4,,,,4,1,34.7,34.6,1,54.7,54.5,1,,,,,,,115,66,115,63,1,11:50,1,2016/09/29,0,1,223,2,2o72,2,42941.45765092893,76.375,174.4,4,25.11066776786466,746,,,,,,,,,,,,,25.11066776786466,2,,0,,5
1082655,010010001209A0260141,1,01,AGUASCALIENTES,001,AGUASCALIENTES,0001,AGUASCALIENTES,1,MC034,1,1,68,68,10,1,10,60.8,60.75,2,1,158.2,158.3,1,,,87.8,87.7,1,,,,4,1,32.8,32.6,1,49.1,49,1,,,,,,,149,72,147,69,1,19:14,1,2016/09/29,0,1,223,2,2o72,2,20051.29467459512,60.775,158.25,4,24.268198028895227,826,,,,,,,,,,,,,24.268198028895227,1,,0,,1
1082102,010010001209A0310011,4,01,AGUASCALIENTES,001,AGUASCALIENTES,0001,AGUASCALIENTES,4,MC032,1,1,0,14,9,2,20,64.1,64.1,1,1,168.5,168.5,1,,,,,,,,,,,,,,,,,,,,,,,,,,,,,,2016/09/29,0,1,223,2,2o72,2,9113.078706394153,64.1,168.5,3,22.576583398638707,177,,0.1,1.03,,,0.1,1.03,,,2,,2,22.576583398638707,,,1,5,
1082100,010010001209A0310011,2,01,AGUASCALIENTES,001,AGUASCALIENTES,0001,AGUASCALIENTES,2,MC032,1,2,0,69,8,1,,61.55,61.6,1,1,148.1,148.1,1,,,88.5,88.5,1,,,,4,1,35.5,35.5,1,41,41,1,,,,,,,102,59,93,57,1,15:40,1,2016/09/29,0,1,223,2,2o72,2,13239.45828838505,61.575,148.1,4,28.073354089910424,836,,,,,,,,,,,,,28.073354089910424,2,,0,,5
1082044,010010001209A0310031,1,01,AGUASCALIENTES,001,AGUASCALIENTES,0001,AGUASCALIENTES,1,MC032,1,2,87,87,5,1,,46.6,46.6,1,1,148.6,148.6,1,,,73.4,73.4,1,,,,4,2,30,30.1,1,40.2,40.1,1,,,,,,,125,71,115,75,1,12:50,1,2016/09/29,0,1,223,2,2o72,2,4413.152762795016,46.6,148.6,4,21.10319917253722,1049,,,,,,,,,,,,,21.10319917253722,1,,0,,1
1082042,010010001209A0310071,2,01,AGUASCALIENTES,001,AGUASCALIENTES,0001,AGUASCALIENTES,2,MC032,1,2,45,45,0,1,10,65.55,65.45,1,1,150.8,150.7,1,4,,92.2,92.1,1,,,,,,,,,,,,,,,,,,104,66,101,67,1,18:10,1,2016/09/29,0,1,223,2,2o72,2,27934.659506039177,65.5,150.75,4,28.82216886820733,540,,,,,,,,,,,,,28.82216886820733,2,,0,,5
1082059,010010001209A0310131,1,01,AGUASCALIENTES,001,AGUASCALIENTES,0001,AGUASCALIENTES,1,MC032,1,2,83,83,8,1,,59.8,59.8,1,1,156.5,156.5,1,,,85.4,85.5,1,,,,4,1,36.5,36.6,1,46.5,46.5,1,,,,,,,128,57,119,56,1,19:30,1,2016/09/29,0,1,223,2,2o72,2,4413.152762795016,59.8,156.5,4,24.41588665802448,1004,,,,,,,,,,,,,24.41588665802448,1,,0,,1
1083440,010010001262A0010211,1,01,AGUASCALIENTES,001,AGUASCALIENTES,0001,AGUASCALIENTES,1,MC036,1,1,74,74,2,1,10,76.2,76.2,2,1,152,152.2,1,,,119.6,119.4,1,,,,4,1,36.9,37,1,53.1,53,1,,,,,,,157,97,159,92,1,14:00,1,2016/09/29,0,1,222,2,2o50,2,16565.341747736424,76.2,152.1,4,32.937948277047056,890,,,,,,,,,,,,,32.937948277047056,3,,0,,5
1082712,010010001262A0080121,4,01,AGUASCALIENTES,001,AGUASCALIENTES,0001,AGUASCALIENTES,4,MC034,1,2,4,4,4,4,,18.2,18.2,2,1,102.2,102.2,1,,,,,,,,,,,,,,,,,,,,,,,,,,,,,,2016/09/29,0,1,222,2,2o50,2,8426.636944171392,18.2,102.2,1,17.42487199420958,52,0.56,-0.64,1.37,1.45,0.56,-0.64,1.37,1.45,2,2,2,2,17.42487199420958,,1,0,5,
1082711,010010001262A0080121,3,01,AGUASCALIENTES,001,AGUASCALIENTES,0001,AGUASCALIENTES,3,MC034,1,2,16,16,8,2,20,59.05,59.1,2,1,158.5,158.7,1,4,,,,,,,,,,,,,,,,,,,,,,,,,,,,,2016/09/29,0,1,222,2,2o50,2,7670.49609169431,59.075,158.6,3,23.485367711485594,200,,-0.62,0.77,,,-0.62,0.77,,,2,,1,23.485367711485594,,,1,1,
1082709,010010001262A0080121,1,01,AGUASCALIENTES,001,AGUASCALIENTES,0001,AGUASCALIENTES,1,MC034,1,2,41,41,10,1,,118.6,118.6,2,1,159.6,159.5,1,4,,122.8,122.8,1,,,,,,,,,,,,,,,,,,109,70,108,77,1,13:52,1,2016/09/29,0,1,222,2,2o50,2,10005.448905781243,118.6,159.55,4,46.58982422849598,502,,,,,,,,,,,,,46.58982422849598,3,,0,,5
1082734,010010001262A0080181,4,01,AGUASCALIENTES,001,AGUASCALIENTES,0001,AGUASCALIENTES,4,MC034,1,1,0,0,9,4,,9.15,9.15,2,1,76.6,76.7,1,,,,,,,,,,,,,,,,,,,,,,,,,,,,,,2016/09/29,0,1,222,2,2o50,2,13206.177024237819,9.15,76.65,1,15.573878265886949,9,0.25,2.09,-1.22,-0.87,0.25,2.09,-1.22,-0.87,2,2,2,1,15.573878265886949,,1,0,1,
1082732,010010001262A0080181,2,01,AGUASCALIENTES,001,AGUASCALIENTES,0001,AGUASCALIENTES,2,MC034,1,2,19,19,3,2,20,49.4,49.4,2,1,154.5,154.4,1,2,,,,,,,,,,,,,,,,,,,,,,,,,,,,,2016/09/29,0,1,222,2,2o50,2,15340.99218338862,49.4,154.45,3,20.708618317003463,231,,-1.33,-0.24,,,-1.33,-0.24,,,2,,1,20.708618317003463,,,1,1,
1082736,010010001262A0080251,2,01,AGUASCALIENTES,001,AGUASCALIENTES,0001,AGUASCALIENTES,2,MC034,1,2,58,58,2,1,10,67.4,67.35,2,1,152.4,152.4,1,,,93.3,93.5,1,,,,,,,,,,,,,,,,,,127,77,213,84,1,19:12,1,2016/09/29,0,1,222,2,2o50,2,10580.129024292684,67.375,152.4,4,29.008738573032698,698,,,,,,,,,,,,,29.008738573032698,2,,0,,5
1082747,010010001262A0080311,4,01,AGUASCALIENTES,001,AGUASCALIENTES,0001,AGUASCALIENTES,4,MC034,1,1,1,1,1,4,,9.95,10,1,1,76.5,76.4,1,,,,,,,,,,,,,,,,,,,,,,,,,,,,,,2016/09/29,0,1,222,2,2o50,2,6603.088512118909,9.975,76.45,1,17.06702893823831,13,0.09,-0.2,0.3,0.23,0.09,-0.2,0.3,0.23,2,2,2,1,17.06702893823831,,1,0,1,
1082746,010010001262A0080311,3,01,AGUASCALIENTES,001,AGUASCALIENTES,0001,AGUASCALIENTES,3,MC034,1,1,5,5,4,3,,19.65,19.7,1,1,112.6,112.8,1,,,,,,,,,,,,,,,,,,,,,,,,,,,,,,2016/09/29,0,1,222,2,2o50,2,6132.708804368297,19.674999999999997,112.69999999999999,2,15.49055253442761,64,0.25,0.18,0.17,,0.25,0.18,0.17,,2,2,,1,15.49055253442761,,,0,1,
1082745,010010001262A0080311,2,01,AGUASCALIENTES,001,AGUASCALIENTES,0001,AGUASCALIENTES,2,MC034,1,2,28,28,8,1,12,64.05,64.1,2,1,161.3,161.5,1,2,,,,,,,,,,,,,,,,,,,,,,144,77,147,74,1,09:13,1,2016/09/29,0,1,222,2,2o50,2,14827.819697208866,64.07499999999999,161.4,4,24.596966751580418,344,,,,,,,,,,,,,24.596966751580418,1,,0,,1
1082730,010010001262A0080371,3,01,AGUASCALIENTES,001,AGUASCALIENTES,0001,AGUASCALIENTES,3,MC034,1,2,1,1,3,4,,10.15,10.05,2,1,80.5,80.4,1,,,,,,,,,,,,,,,,,,,,,,,,,,,,,,2016/09/29,0,1,222,2,2o50,2,7566.506658043915,10.100000000000001,80.45,1,15.605197766911655,15,0.41,1.07,-0.29,-0.09,0.41,1.07,-0.29,-0.09,2,2,2,1,15.605197766911655,,1,0,1,
1082729,010010001262A0080371,2,01,AGUASCALIENTES,001,AGUASCALIENTES,0001,AGUASCALIENTES,2,MC034,1,2,19,19,5,2,20,54.45,54.4,2,1,151.7,151.7,1,1,7,,,,,,,,,,,,,,,,,,,,,,,,,,,,2016/09/29,0,1,222,2,2o50,2,7670.49609169431,54.425,151.7,3,23.649789313728093,233,,-1.75,0.66,,,-1.75,0.66,,,2,,1,23.649789313728093,,,0,1,
1082728,010010001262A0080371,1,01,AGUASCALIENTES,001,AGUASCALIENTES,0001,AGUASCALIENTES,1,MC034,1,1,25,25,8,1,,69.15,69.05,2,1,171.3,171.2,1,,,92.5,92.5,1,,,,,,,,,,,,,,,,,,121,79,116,77,1,20:24,1,2016/09/29,0,1,222,2,2o50,2,11811.922741423183,69.1,171.25,4,23.562256912994833,308,,,,,,,,,,,,,23.562256912994833,1,,0,,1
1082727,010010001262A0080441,1,01,AGUASCALIENTES,001,AGUASCALIENTES,0001,AGUASCALIENTES,1,MC034,1,2,76,76,8,1,10,49.45,49.5,2,1,147.1,147.2,1,,,80.6,80.6,1,,,,4,4,31.7,31.7,1,47.4,47.4,1,,,,,,,144,68,144,63,1,18:11,1,2016/09/29,0,1,222,2,2o50,2,6173.532451262419,49.475,147.14999999999998,4,22.848898582640917,920,,,,,,,,,,,,,22.848898582640917,1,,0,,1
1082726,010010001262A0130041,1,01,AGUASCALIENTES,001,AGUASCALIENTES,0001,AGUASCALIENTES,1,MC034,1,2,52,52,0,1,,,,4,2,,,2,,,222.2,222.2,2,,,,,,,,,,,,,,,,,,120,77,122,71,1,13:52,1,2016/09/29,0,1,222,2,2o50,2,3661.9234449034097,,,4,,624,,,,,,,,,,,,,,,,0,,
1082724,010010001262A0130151,4,01,AGUASCALIENTES,001,AGUASCALIENTES,0001,AGUASCALIENTES,4,MC034,1,2,7,7,0,3,,17.9,17.9,2,1,110.6,110.4,1,,,,,,,,,,,,,,,,,,,,,,,,,,,,,,2016/09/29,0,1,222,2,2o50,2,4987.491225277304,17.9,110.5,2,14.659814500112608,84,-1.52,-1.89,-0.48,,-1.52,-1.89,-0.48,,2,2,,1,14.659814500112608,,,0,1,
1082723,010010001262A0130151,3,01,AGUASCALIENTES,001,AGUASCALIENTES,0001,AGUASCALIENTES,3,MC034,1,1,12,12,1,2,20,38.6,38.6,2,1,144.5,144.2,1,,,,,,,,,,,,,,,,,,,,,,,,,,,,,,2016/09/29,0,1,222,2,2o50,2,4549.398870584767,38.6,144.35,3,18.5248085459837,145,,-0.74,0.43,,,-0.74,0.43,,,2,,1,18.5248085459837,,,1,1,
1082722,010010001262A0130151,2,01,AGUASCALIENTES,001,AGUASCALIENTES,0001,AGUASCALIENTES,2,MC034,1,2,28,28,10,1,,51.65,51.6,2,1,150.3,150.5,1,4,,81.3,81.2,1,,,,,,,,,,,,,,,,,,94,68,90,63,1,16:01,1,2016/09/29,0,1,222,2,2o50,2,10264.211421493463,51.625,150.4,4,22.82256182095971,346,,,,,,,,,,,,,22.82256182095971,1,,0,,1
1082737,010010001262A0130201,1,01,AGUASCALIENTES,001,AGUASCALIENTES,0001,AGUASCALIENTES,1,MC034,1,1,56,56,2,1,10,79.15,79.25,2,1,165.1,165,1,,,102.3,102.4,1,,,,,,,,,,,,,,,,,,136,88,135,95,1,17:07,1,2016/09/29,0,1,222,2,2o50,2,5822.859040476992,79.2,165.05,4,29.07328624770238,674,,,,,,,,,,,,,29.07328624770238,2,,0,,5
1082706,010010001262A0130261,8,01,AGUASCALIENTES,001,AGUASCALIENTES,0001,AGUASCALIENTES,8,MC034,1,1,4,4,5,4,40,17.15,17.1,1,1,104.1,104.3,1,,,,,,,,,,,,,,,,,,,,,,,,,,,,,,2016/09/29,0,1,222,2,2o50,2,4626.118797593689,17.125,104.19999999999999,1,15.772304110285484,53,-0.02,-0.44,0.39,0.37,-0.02,-0.44,0.39,0.37,2,2,2,1,15.772304110285484,,1,0,1,
1082705,010010001262A0130261,7,01,AGUASCALIENTES,001,AGUASCALIENTES,0001,AGUASCALIENTES,7,MC034,1,1,10,10,1,2,,47.45,47.4,2,1,143,143.2,1,,,,,,,,,,,,,,,,,,,,,,,,,,,,,,2016/09/29,0,1,222,2,2o50,2,9098.797741169534,47.425,143.1,2,23.159440969917874,121,2.24,0.76,2.42,,2.24,0.76,2.42,,2,2,,3,23.159440969917874,,,0,5,
1082702,010010001262A0130261,4,01,AGUASCALIENTES,001,AGUASCALIENTES,0001,AGUASCALIENTES,4,MC034,1,2,29,29,6,1,10,63,63,2,1,161.2,161.3,1,4,,87.4,87.6,1,,,,,,,,,,,,,,,,,,110,59,106,48,1,07:25,1,2016/09/29,0,1,222,2,2o50,2,25660.52855373366,63,161.25,4,24.22931314223905,354,,,,,,,,,,,,,24.22931314223905,1,,0,,1
1082108,010010001262A0170051,1,01,AGUASCALIENTES,001,AGUASCALIENTES,0001,AGUASCALIENTES,1,MC032,1,2,64,64,11,1,,57.15,57.15,1,1,156.7,156.7,1,,,92.6,92.6,1,,,,4,2,31.5,31.5,1,42,42,1,,,,,,,161,85,157,91,1,20:05,1,2016/09/29,0,1,222,2,2o50,2,3303.841216150655,57.15,156.7,4,23.274386486764957,779,,,,,,,,,,,,,23.274386486764957,1,,0,,1
1082095,010010001262A0170081,3,01,AGUASCALIENTES,001,AGUASCALIENTES,0001,AGUASCALIENTES,3,MC032,1,1,11,11,6,2,,36.05,36,1,1,144.3,144.5,1,,,,,,,,,,,,,,,,,,,,,,,,,,,,,,2016/09/29,0,1,222,2,2o50,2,8209.069208296165,36.025,144.4,2,17.277050513731478,138,,-0.23,0.03,,,-0.23,0.03,,,2,,1,17.277050513731478,,,0,1,
1082093,010010001262A0170081,1,01,AGUASCALIENTES,001,AGUASCALIENTES,0001,AGUASCALIENTES,1,MC032,1,1,56,56,8,1,10,74.2,74.2,1,1,169.8,169.9,1,,,93.7,93.7,1,,,,,,,,,,,,,,,,,,126,93,124,89,1,08:08,1,2016/09/29,0,1,222,2,2o50,2,10506.938216055894,74.2,169.85000000000002,4,25.72010888757149,680,,,,,,,,,,,,,25.72010888757149,2,,0,,5
1082076,010010001262A0170131,3,01,AGUASCALIENTES,001,AGUASCALIENTES,0001,AGUASCALIENTES,3,MC032,1,1,2,2,3,4,,18.4,18.4,1,1,98.3,98.4,1,,,,,,,,,,,,,,,,,,,,,,,,,,,,,,2016/09/29,0,1,222,2,2o50,2,1559.00479861889,18.4,98.35,1,19.022565777111875,27,3.16,2.7,2.19,2.49,3.16,2.7,2.19,2.49,2,2,2,3,19.022565777111875,,1,0,5,
1082075,010010001262A0170131,2,01,AGUASCALIENTES,001,AGUASCALIENTES,0001,AGUASCALIENTES,2,MC032,1,2,28,28,11,1,12,127.2,127.3,1,1,171.2,171.2,1,4,,119.5,119.5,1,,,,,,,,,,,,,,,,,,117,67,119,67,1,12:23,1,2016/09/29,0,1,222,2,2o50,2,9260.52257941424,127.25,171.2,4,43.41604616123679,347,,,,,,,,,,,,,43.41604616123679,3,,0,,5
1082088,010010001262A0170161,1,01,AGUASCALIENTES,001,AGUASCALIENTES,0001,AGUASCALIENTES,1,MC032,1,2,48,48,0,1,,56.1,56.1,1,1,144,144,1,4,,78,78,1,,,,,,,,,,,,,,,,,,136,93,137,97,1,03:55,1,2016/09/29,0,1,222,2,2o50,2,3124.3867069210405,56.1,144,4,27.05439814814815,576,,,,,,,,,,,,,27.05439814814815,2,,0,,5
1082073,010010001262A0170191,4,01,AGUASCALIENTES,001,AGUASCALIENTES,0001,AGUASCALIENTES,4,MC032,1,2,6,6,5,3,30,26.1,26.1,1,1,119,119,1,,,,,,,,,,,,,,,,,,,,,,,,,,,,,,2016/09/29,0,1,222,2,2o50,2,3495.5351496644635,26.1,119,2,18.430901772473696,77,1.34,0.28,1.6,,1.34,0.28,1.6,,2,2,,2,18.430901772473696,,,0,5,
1082072,010010001262A0170191,3,01,AGUASCALIENTES,001,AGUASCALIENTES,0001,AGUASCALIENTES,3,MC032,1,1,12,12,9,2,20,45.55,45.6,1,1,156,156,1,,,,,,,,,,,,,,,,,,,,,,,,,,,,,,2016/09/29,0,1,222,2,2o50,2,4104.5346041480825,45.575,156,3,18.727399737015123,153,,0.24,0.3,,,0.24,0.3,,,2,,1,18.727399737015123,,,1,1,
1082070,010010001262A0170191,1,01,AGUASCALIENTES,001,AGUASCALIENTES,0001,AGUASCALIENTES,1,MC032,1,1,49,49,7,1,,46.6,46.6,1,1,158.9,158.9,1,,,76.3,76.3,1,,,,,,,,,,,,,,,,,,166,94,144,95,1,20:40,1,2016/09/29,0,1,222,2,2o50,2,9594.62915189982,46.6,158.9,4,18.456022980520977,595,,,,,,,,,,,,,18.456022980520977,1,,0,,1
1082083,010010001262A0220031,1,01,AGUASCALIENTES,001,AGUASCALIENTES,0001,AGUASCALIENTES,1,MC032,1,2,0,63,6,1,,76.25,76.25,1,1,153.8,153.8,1,,,97.7,97.7,1,,,,4,3,37.1,37.1,1,47,47,1,,,,,,,114,69,111,66,1,12:00,1,2016/09/29,0,1,222,2,2o50,2,5206.261509973727,76.25,153.8,4,32.234963076699344,762,,,,,,,,,,,,,32.234963076699344,3,,0,,5
1082087,010010001262A0220121,4,01,AGUASCALIENTES,001,AGUASCALIENTES,0001,AGUASCALIENTES,4,MC032,1,1,0,18,9,2,,74,74,1,1,178.9,178.9,1,,,,,,,,,,,,,,,,,,,,,,,,,,,,,,2016/09/29,0,1,222,2,2o50,2,14380.26037957624,74,178.9,3,23.121235573833133,225,,0.33,0.35,,,0.33,0.35,,,2,,1,23.121235573833133,,,1,1,
1082086,010010001262A0220121,3,01,AGUASCALIENTES,001,AGUASCALIENTES,0001,AGUASCALIENTES,3,MC032,1,2,0,24,5,1,13,55,55,1,1,163.5,163.6,1,4,,73.5,73.5,1,,,,,,,,,,,,,,,,,,93,63,91,64,1,21:55,1,2016/09/29,0,1,222,2,2o50,2,21889.385315384578,55,163.55,4,20.561821874619426,293,,,,,,,,,,,,,20.561821874619426,1,,0,,1
1082107,010010001262A0220151,2,01,AGUASCALIENTES,001,AGUASCALIENTES,0001,AGUASCALIENTES,2,MC032,1,1,17,17,9,2,,77.2,77.2,1,1,158.5,158.4,1,,,,,,,,,,,,,,,,,,,,,,,,,,,,,,2016/09/29,0,1,222,2,2o50,2,14380.26037957624,77.2,158.45,3,30.749128633622448,213,,-2.33,2.3,,,-2.33,2.3,,,1,,3,30.749128633622448,,,1,5,
1082106,010010001262A0220151,1,01,AGUASCALIENTES,001,AGUASCALIENTES,0001,AGUASCALIENTES,1,MC032,1,2,45,45,5,1,12,77.15,77.15,1,1,158.5,158.5,1,4,,99.2,99.2,1,,,,,,,,,,,,,,,,,,91,57,95,64,1,12:19,1,2016/09/29,0,1,222,2,2o50,2,4923.47337244879,77.15,158.5,4,30.709828936500514,545,,,,,,,,,,,,,30.709828936500514,3,,0,,5
1083457,010010001262A0280211,3,01,AGUASCALIENTES,001,AGUASCALIENTES,0001,AGUASCALIENTES,3,MC036,1,2,6,6,4,3,,19.75,19.75,2,1,119.4,119.2,1,,,,,,,,,,,,,,,,,,,,,,,,,,,,,,2016/09/29,0,1,222,2,2o50,2,6290.4511417177355,19.75,119.30000000000001,2,13.876700422765094,76,-0.37,0.43,-1,,-0.37,0.43,-1,,2,2,,1,13.876700422765094,,,0,1,
1083455,010010001262A0280211,1,01,AGUASCALIENTES,001,AGUASCALIENTES,0001,AGUASCALIENTES,1,MC036,1,1,39,39,2,1,12,92.8,92.75,1,1,182.5,182.5,1,,,98.9,98.7,1,,,,,,,,,,,,,,,,,,117,67,115,65,1,18:42,1,2016/09/29,0,1,222,2,2o50,2,17266.181948912723,92.775,182.5,4,27.85513229498968,470,,,,,,,,,,,,,27.85513229498968,2,,0,,5
1083477,010010001262A0280291,1,01,AGUASCALIENTES,001,AGUASCALIENTES,0001,AGUASCALIENTES,1,MC036,1,2,45,45,7,1,10,80,80.1,1,1,159.1,159.1,1,4,,105.2,105.2,1,,,,,,,,,,,,,,,,,,108,74,103,72,1,16:05,1,2016/09/29,0,1,222,2,2o50,2,5622.544499260934,80.05,159.1,4,31.62430405790586,547,,,,,,,,,,,,,31.62430405790586,3,,0,,5
1083463,010010001262A0280361,1,01,AGUASCALIENTES,001,AGUASCALIENTES,0001,AGUASCALIENTES,1,MC036,1,1,56,56,2,1,10,65.25,65.35,1,1,164.2,164.2,1,,,85.4,85.5,1,,,,,,,,,,,,,,,,,,122,73,116,67,1,22:45,1,2016/09/29,0,1,222,2,2o50,2,18907.943610148166,65.3,164.2,4,24.219594950455537,674,,,,,,,,,,,,,24.219594950455537,1,,0,,1
1083459,010010001262A0280431,2,01,AGUASCALIENTES,001,AGUASCALIENTES,0001,AGUASCALIENTES,2,MC036,1,2,74,74,5,1,,62.05,62.05,2,1,146,146.2,1,,,94.2,94.6,1,,,,4,1,35.4,35.5,1,48,47.9,1,,,,,,,127,71,126,71,1,14:21,1,2016/09/29,0,1,222,2,2o50,2,13876.823019823956,62.05,146.1,4,29.069753822988865,893,,,,,,,,,,,,,29.069753822988865,2,,0,,5
1083469,010010001262A0280511,5,01,AGUASCALIENTES,001,AGUASCALIENTES,0001,AGUASCALIENTES,5,MC036,1,2,17,17,9,2,20,64.1,64.1,2,1,153.5,153.4,1,4,,,,,,,,,,,,,,,,,,,,,,,,,,,,,2016/09/29,0,1,222,2,2o50,2,8620.843704881398,64.1,153.45,3,27.22226415979766,213,,-1.44,1.57,,,-1.44,1.57,,,2,,2,27.22226415979766,,,1,5,
1083467,010010001262A0280511,3,01,AGUASCALIENTES,001,AGUASCALIENTES,0001,AGUASCALIENTES,3,MC036,1,2,21,21,8,1,,45.65,45.65,2,1,152.9,153,1,4,,64.9,65,1,,,,,,,,,,,,,,,,,,107,77,101,73,1,14:20,1,2016/09/29,0,1,222,2,2o50,2,33329.86929807922,45.65,152.95,4,19.513798638757592,260,,,,,,,,,,,,,19.513798638757592,1,,0,,1
1082660,01001000127230010011,5,01,AGUASCALIENTES,001,AGUASCALIENTES,0001,AGUASCALIENTES,5,MC034,1,1,1,1,9,4,40,11.3,11.3,1,1,84.7,84.7,1,,,,,,,,,,,,,,,,,,,,,,,,,,,,,,2016/09/29,0,1,223,2,2o71,2,1732.8937262068803,11.3,84.7,1,15.751126623725101,21,-0.19,-0.15,-0.12,-0.14,-0.19,-0.15,-0.12,-0.14,2,2,2,1,15.751126623725101,,1,0,1,
1082659,01001000127230010011,4,01,AGUASCALIENTES,001,AGUASCALIENTES,0001,AGUASCALIENTES,4,MC034,1,2,19,19,5,2,,68.7,68.7,2,1,154.9,154.8,1,2,,,,,,,,,,,,,,,,,,,,,,,,,,,,,2016/09/29,0,1,223,2,2o71,2,1940.934883567815,68.7,154.85000000000002,3,28.650639337765696,233,,-1.27,1.81,,,-1.27,1.81,,,2,,2,28.650639337765696,,,1,5,
1082656,01001000127230010011,1,01,AGUASCALIENTES,001,AGUASCALIENTES,0001,AGUASCALIENTES,1,MC034,1,1,60,60,9,1,10,61.15,61.05,2,1,157,156.9,1,,,86.5,86.5,1,,,,4,3,34.3,34.4,1,52.3,52.2,1,,,,,,,134,43,127,76,1,17:21,1,2016/09/29,0,1,223,2,2o71,2,8494.15982207352,61.099999999999994,156.95,4,24.8038199506542,729,,,,,,,,,,,,,24.8038199506542,1,,0,,1
1082684,01001000127230010131,1,01,AGUASCALIENTES,001,AGUASCALIENTES,0001,AGUASCALIENTES,1,MC034,1,2,52,52,9,1,,75.75,75.75,2,1,152.9,152.9,1,,,112.9,112.9,1,,,,,,,,,,,,,,,,,,150,84,141,80,1,10:32,1,2016/09/29,0,1,223,2,2o71,2,1559.0979983532147,75.75,152.9,4,32.40169027748251,633,,,,,,,,,,,,,32.40169027748251,3,,0,,5
1082665,01001000127230010191,5,01,AGUASCALIENTES,001,AGUASCALIENTES,0001,AGUASCALIENTES,5,MC034,1,1,10,10,7,2,,35.1,35.15,2,1,133.7,133.8,1,,,,,,,,,,,,,,,,,,,,,,,,,,,,,,2016/09/29,0,1,223,2,2o71,2,2053.5955938567186,35.125,133.75,2,19.6349026115818,127,,-1.08,1.29,,,-1.08,1.29,,,2,,2,19.6349026115818,,,0,5,
1082664,01001000127230010191,4,01,AGUASCALIENTES,001,AGUASCALIENTES,0001,AGUASCALIENTES,4,MC034,1,1,23,23,4,1,10,69.3,69.35,2,1,166.6,166.3,1,,,82.5,82.6,1,,,,,,,,,,,,,,,,,,117,54,110,58,1,08:12,1,2016/09/29,0,1,223,2,2o71,2,28228.99067992894,69.32499999999999,166.45,4,25.02201495166907,280,,,,,,,,,,,,,25.02201495166907,2,,0,,5
1082067,01001000127230070011,2,01,AGUASCALIENTES,001,AGUASCALIENTES,0001,AGUASCALIENTES,2,MC032,1,1,47,47,11,1,10,95.25,95.25,1,1,176.7,176.7,1,,,104.8,104.8,1,,,,,,,,,,,,,,,,,,120,76,116,76,1,08:50,1,2016/09/29,0,1,223,2,2o71,2,3028.7631369394603,95.25,176.7,4,30.506464968489464,575,,,,,,,,,,,,,30.506464968489464,3,,0,,5
1082081,01001000127230070101,3,01,AGUASCALIENTES,001,AGUASCALIENTES,0001,AGUASCALIENTES,3,MC032,1,1,23,23,8,1,10,51.45,51.4,1,1,178.5,178.5,1,,,73.2,73.2,1,,,,,,,,,,,,,,,,,,120,88,126,92,1,21:50,1,2016/09/29,0,1,223,2,2o71,2,34379.57805897596,51.425,178.5,4,16.139789249032948,284,,,,,,,,,,,,,16.139789249032948,1,,0,,1