﻿entidad,FOLIO,INT,desc_ent,munici,desc_mun,locali,desc_loc,ageb,maq,var_num,integrante,completa,n_comp,ob_ser,d801,d802a,d802b,d803,d804a,d804b,d804c,d804d,d804e,d804f,d805,d806a,d806b,d807,d808a,d808b,d808c,d808d,d808e,d808f,d808g,d809,d810a,d810b,d810c,d810d,d811,ID_SQL_R,ID_SQL_1,ID_SQL_2,ORIGEN,c1,est_var,region,code_upm,rural,ponde_f,sexo,edad
01,010010001209A0020041,3,01 AGUASCALIENTES,001,001 AGUASCALIENTES,0001,0001 AGUASCALIENTES,209A,MC036,16,1,1,ENTREVISTA COMPLETA, ,2, , , , , , , , , ,2, , , , , , , , , , ,3, , , , ,3,138417,137829,137829,0,1,223,2,2o72,2,11515.9499720973,2,19
01,010010001209A0080071,3,01 AGUASCALIENTES,001,001 AGUASCALIENTES,0001,0001 AGUASCALIENTES,209A,MC034,16,1,1,ENTREVISTA COMPLETA, ,2, , , , , , , , , ,2, , , , , , , , , , ,3, , , , ,3,138313,137725,137725,0,1,223,2,2o72,2,11797.9316637295,1,16
01,010010001209A0080101,2,01 AGUASCALIENTES,001,001 AGUASCALIENTES,0001,0001 AGUASCALIENTES,209A,MC034,16,1,1,ENTREVISTA COMPLETA, ,2, , , , , , , , , ,2, , , , , , , , , , ,1,0,0,0,1,1,138324,137736,137736,0,1,223,2,2o72,2,16536.1466435596,2,13
01,010010001209A0210121,3,01 AGUASCALIENTES,001,001 AGUASCALIENTES,0001,0001 AGUASCALIENTES,209A,MC032,16,1,1,ENTREVISTA COMPLETA, ,2, , , , , , , , , ,2, , , , , , , , , , ,3, , , , ,3,138210,137622,137622,0,1,223,2,2o72,2,3908.12781858506,2,19
01,010010001209A0310011,4,01 AGUASCALIENTES,001,001 AGUASCALIENTES,0001,0001 AGUASCALIENTES,209A,MC032,16,1,1,ENTREVISTA COMPLETA, ,2, , , , , , , , , ,2, , , , , , , , , , ,3, , , , ,3,138219,137631,137631,0,1,223,2,2o72,2,5967.59020808664,1,14
01,010010001262A0080121,3,01 AGUASCALIENTES,001,001 AGUASCALIENTES,0001,0001 AGUASCALIENTES,262A,MC034,16,1,1,ENTREVISTA COMPLETA, ,2, , , , , , , , , ,2, , , , , , , , , , ,3, , , , ,3,138317,137729,137729,0,1,222,2,2o50,2,7823.04665983397,2,16
01,010010001262A0080181,2,01 AGUASCALIENTES,001,001 AGUASCALIENTES,0001,0001 AGUASCALIENTES,262A,MC034,16,1,1,ENTREVISTA COMPLETA, ,2, , , , , , , , , ,2, , , , , , , , , , ,3, , , , ,3,138322,137734,137734,0,1,222,2,2o50,2,15646.0933196679,2,19
01,010010001262A0080371,2,01 AGUASCALIENTES,001,001 AGUASCALIENTES,0001,0001 AGUASCALIENTES,262A,MC034,16,1,1,ENTREVISTA COMPLETA, ,2, , , , , , , , , ,2, , , , , , , , , , ,3, , , , ,3,138321,137733,137733,0,1,222,2,2o50,2,7823.04665983397,2,19
01,010010001262A0130151,3,01 AGUASCALIENTES,001,001 AGUASCALIENTES,0001,0001 AGUASCALIENTES,262A,MC034,16,1,1,ENTREVISTA COMPLETA, ,2, , , , , , , , , ,2, , , , , , , , , , ,3, , , , ,3,138320,137732,137732,0,1,222,2,2o50,2,4640.22680021972,1,12
01,010010001262A0130261,7,01 AGUASCALIENTES,001,001 AGUASCALIENTES,0001,0001 AGUASCALIENTES,262A,MC034,16,1,1,ENTREVISTA COMPLETA, ,2, , , , , , , , , ,2, , , , , , , , , , ,3, , , , ,3,138318,137730,137730,0,1,222,2,2o50,2,9280.45360043944,1,10
01,010010001262A0170081,3,01 AGUASCALIENTES,001,001 AGUASCALIENTES,0001,0001 AGUASCALIENTES,262A,MC032,16,1,1,ENTREVISTA COMPLETA, ,2, , , , , , , , , ,2, , , , , , , , , , ,3, , , , ,3,138218,137630,137630,0,1,222,2,2o50,2,8372.96179754362,1,11
01,010010001262A0170191,3,01 AGUASCALIENTES,001,001 AGUASCALIENTES,0001,0001 AGUASCALIENTES,262A,MC032,16,1,1,ENTREVISTA COMPLETA, ,2, , , , , , , , , ,2, , , , , , , , , , ,3, , , , ,3,138215,137627,137627,0,1,222,2,2o50,2,4186.48089877181,1,12
01,010010001262A0220121,4,01 AGUASCALIENTES,001,001 AGUASCALIENTES,0001,0001 AGUASCALIENTES,262A,MC032,16,1,1,ENTREVISTA COMPLETA, ,2, , , , , , , , , ,2, , , , , , , , , , ,3, , , , ,3,138216,137628,137628,0,1,222,2,2o50,2,11880.5459723651,1,18
01,010010001262A0220151,2,01 AGUASCALIENTES,001,001 AGUASCALIENTES,0001,0001 AGUASCALIENTES,262A,MC032,16,1,1,ENTREVISTA COMPLETA, ,2, , , , , , , , , ,2, , , , , , , , , , ,3, , , , ,3,138220,137632,137632,0,1,222,2,2o50,2,11880.5459723651,1,17
01,010010001262A0280511,5,01 AGUASCALIENTES,001,001 AGUASCALIENTES,0001,0001 AGUASCALIENTES,262A,MC036,16,1,1,ENTREVISTA COMPLETA, ,2, , , , , , , , , ,2, , , , , , , , , , ,3, , , , ,3,138416,137828,137828,0,1,222,2,2o50,2,8792.29475437048,2,17
01,01001000127230010011,4,01 AGUASCALIENTES,001,001 AGUASCALIENTES,0001,0001 AGUASCALIENTES,2723,MC034,16,1,1,ENTREVISTA COMPLETA, ,1,10,1,4,0,0,0,0,0,1,2, , , , , , , , , , ,3, , , , ,3,138323,137735,137735,0,1,223,2,2o71,2,1894.60896027685,2,19
01,01001000127230010041,3,01 AGUASCALIENTES,001,001 AGUASCALIENTES,0001,0001 AGUASCALIENTES,2723,MC034,16,1,1,ENTREVISTA COMPLETA, ,2, , , , , , , , , ,2, , , , , , , , , , ,3, , , , ,3,138316,137728,137728,0,1,223,2,2o71,2,5683.82688083055,2,18
01,01001000127230010191,5,01 AGUASCALIENTES,001,001 AGUASCALIENTES,0001,0001 AGUASCALIENTES,2723,MC034,16,1,1,ENTREVISTA COMPLETA, ,2, , , , , , , , , ,2, , , , , , , , , , ,3, , , , ,3,138312,137724,137724,0,1,223,2,2o71,2,2241.28737610751,1,10
01,01001000127230070361,2,01 AGUASCALIENTES,001,001 AGUASCALIENTES,0001,0001 AGUASCALIENTES,2723,MC032,16,1,1,ENTREVISTA COMPLETA, ,2, , , , , , , , , ,2, , , , , , , , , , ,3, , , , ,3,138213,137625,137625,0,1,223,2,2o71,2,4614.82008900767,2,16
01,01001000127230070541,2,01 AGUASCALIENTES,001,001 AGUASCALIENTES,0001,0001 AGUASCALIENTES,2723,MC032,16,1,1,ENTREVISTA COMPLETA, ,2, , , , , , , , , ,2, , , , , , , , , , ,3, , , , ,3,138217,137629,137629,0,1,223,2,2o71,2,6521.94790577192,2,12
01,01001000127230130011,3,01 AGUASCALIENTES,001,001 AGUASCALIENTES,0001,0001 AGUASCALIENTES,2723,MC036,16,1,1,ENTREVISTA COMPLETA, ,2, , , , , , , , , ,2, , , , , , , , , , ,1,0,0,0,1,1,138414,137826,137826,0,1,223,2,2o71,2,2950.45874543114,2,19
01,01001000127230130131,4,01 AGUASCALIENTES,001,001 AGUASCALIENTES,0001,0001 AGUASCALIENTES,2723,MC036,16,1,1,ENTREVISTA COMPLETA, ,2, , , , , , , , , ,2, , , , , , , , , , ,3, , , , ,3,138412,137824,137824,0,1,223,2,2o71,2,2950.45874543114,2,18
01,01001000127230130161,2,01 AGUASCALIENTES,001,001 AGUASCALIENTES,0001,0001 AGUASCALIENTES,2723,MC036,16,1,1,ENTREVISTA COMPLETA, ,2, , , , , , , , , ,2, , , , , , , , , , ,3, , , , ,3,138415,137827,137827,0,1,223,2,2o71,2,8339.53994508541,2,12
01,01001000127230220081,5,01 AGUASCALIENTES,001,001 AGUASCALIENTES,0001,0001 AGUASCALIENTES,2723,MC034,16,1,1,ENTREVISTA COMPLETA, ,2, , , , , , , , , ,2, , , , , , , , , , ,3, , , , ,3,138314,137726,137726,0,1,223,2,2o71,2,2723.50038039797,2,15
01,01001000127230220201,1,01 AGUASCALIENTES,001,001 AGUASCALIENTES,0001,0001 AGUASCALIENTES,2723,MC034,16,1,1,ENTREVISTA COMPLETA, ,2, , , , , , , , , ,2, , , , , , , , , , ,3, , , , ,3,138315,137727,137727,0,1,223,2,2o71,2,5492.26581760262,1,19
01,01001000127230220271,2,01 AGUASCALIENTES,001,001 AGUASCALIENTES,0001,0001 AGUASCALIENTES,2723,MC034,16,1,1,ENTREVISTA COMPLETA, ,2, , , , , , , , , ,2, , , , , , , , , , ,3, , , , ,3,138319,137731,137731,0,1,223,2,2o71,2,2723.50038039797,2,16
01,01001000127230320181,2,01 AGUASCALIENTES,001,001 AGUASCALIENTES,0001,0001 AGUASCALIENTES,2723,MC032,16,1,1,ENTREVISTA COMPLETA, ,2, , , , , , , , , ,2, , , , , , , , , , ,3, , , , ,3,138212,137624,137624,0,1,223,2,2o71,2,10474.748119611,2,11
01,01001000127230320431,2,01 AGUASCALIENTES,001,001 AGUASCALIENTES,0001,0001 AGUASCALIENTES,2723,MC032,16,1,1,ENTREVISTA COMPLETA, ,2, , , , , , , , , ,2, , , , , , , , , , ,3, , , , ,3,138211,137623,137623,0,1,223,2,2o71,2,10474.748119611,2,12
01,01001000127230320511,2,01 AGUASCALIENTES,001,001 AGUASCALIENTES,0001,0001 AGUASCALIENTES,2723,MC032,16,1,1,ENTREVISTA COMPLETA, ,2, , , , , , , , , ,2, , , , , , , , , , ,3, , , , ,3,138214,137626,137626,0,1,223,2,2o71,2,3705.87735045354,2,16
01,01001000127230380011,3,01 AGUASCALIENTES,001,001 AGUASCALIENTES,0001,0001 AGUASCALIENTES,2723,MC036,16,1,1,ENTREVISTA COMPLETA, ,2, , , , , , , , , ,2, , , , , , , , , , ,3, , , , ,3,138408,137820,137820,0,1,223,2,2o71,2,4093.9241386874,2,15
01,01001000127230380101,6,01 AGUASCALIENTES,001,001 AGUASCALIENTES,0001,0001 AGUASCALIENTES,2723,MC036,16,1,1,ENTREVISTA COMPLETA, ,2, , , , , , , , , ,2, , , , , , , , , , ,3, , , , ,3,138409,137821,137821,0,1,223,2,2o71,2,2046.9620693437,2,19
01,01001000127230380181,4,01 AGUASCALIENTES,001,001 AGUASCALIENTES,0001,0001 AGUASCALIENTES,2723,MC036,16,1,1,ENTREVISTA COMPLETA, ,2, , , , , , , , , ,2, , , , , , , , , , ,3, , , , ,3,138411,137823,137823,0,1,223,2,2o71,2,11571.5713495747,2,10
01,01001000127230380271,4,01 AGUASCALIENTES,001,001 AGUASCALIENTES,0001,0001 AGUASCALIENTES,2723,MC036,16,1,1,ENTREVISTA COMPLETA, ,2, , , , , , , , , ,2, , , , , , , , , , ,3, , , , ,3,138410,137822,137822,0,1,223,2,2o71,2,4093.9241386874,2,16
01,01001000127230380351,3,01 AGUASCALIENTES,001,001 AGUASCALIENTES,0001,0001 AGUASCALIENTES,2723,MC036,16,1,1,ENTREVISTA COMPLETA, ,2, , , , , , , , , ,2, , , , , , , , , , ,2,0,0,0,1,3,138413,137825,137825,0,1,223,2,2o71,2,2046.9620693437,2,16
02,02002000143500020021,4,02 BAJA CALIFORNIA,002,002 MEXICALI,0001,0001 MEXICALI,4350,MC006,16,1,1,ENTREVISTA COMPLETA, ,2, , , , , , , , , ,2, , , , , , , , , , ,1,0,0,0,1,1,137213,136625,136625,0,1,122,1,1a45,2,7007.60246145738,2,17
02,02002000143500020111,2,02 BAJA CALIFORNIA,002,002 MEXICALI,0001,0001 MEXICALI,4350,MC006,16,1,1,ENTREVISTA COMPLETA, ,2, , , , , , , , , ,2, , , , , , , , , , ,3, , , , ,3,137226,136638,136638,0,1,122,1,1a45,2,3503.80123072869,2,18
02,02002000143500020131,3,02 BAJA CALIFORNIA,002,002 MEXICALI,0001,0001 MEXICALI,4350,MC006,16,1,1,ENTREVISTA COMPLETA, ,2, , , , , , , , , ,2, , , , , , , , , , ,3, , , , ,3,137227,136639,136639,0,1,122,1,1a45,2,5313.44766167257,1,11
02,02002000143500070241,4,02 BAJA CALIFORNIA,002,002 MEXICALI,0001,0001 MEXICALI,4350,MC006,16,1,1,ENTREVISTA COMPLETA, ,2, , , , , , , , , ,2, , , , , , , , , , ,3, , , , ,3,137214,136626,136626,0,1,122,1,1a45,2,3548.29394476969,2,18
02,02002000143500130021,5,02 BAJA CALIFORNIA,002,002 MEXICALI,0001,0001 MEXICALI,4350,MC004,16,1,1,ENTREVISTA COMPLETA, ,2, , , , , , , , , ,2, , , , , , , , , , ,3, , , , ,3,137151,136563,136563,0,1,122,1,1a45,2,8244.5982134612,1,17
02,02002000143500130131,4,02 BAJA CALIFORNIA,002,002 MEXICALI,0001,0001 MEXICALI,4350,MC004,16,1,1,ENTREVISTA COMPLETA, ,2, , , , , , , , , ,2, , , , , , , , , , ,3, , , , ,3,137160,136572,136572,0,1,122,1,1a45,2,2976.806736676,2,17
02,02002000143500270031,6,02 BAJA CALIFORNIA,002,002 MEXICALI,0001,0001 MEXICALI,4350,MC004,16,1,1,ENTREVISTA COMPLETA, ,2, , , , , , , , , ,2, , , , , , , , , , ,3, , , , ,3,137152,136564,136564,0,1,122,1,1a45,2,16365.4187979515,1,12
02,02002012435799990021,4,02 BAJA CALIFORNIA,002,002 MEXICALI,0124,0124 CAMPO LA CURVA (COLONIA SILVA),3579,MC002,16,1,1,ENTREVISTA COMPLETA, ,2, , , , , , , , , ,2, , , , , , , , , , ,3, , , , ,3,137081,136493,136493,0,1,111,1,1o01,1,188.796857170774,2,19
02,02002012435799990031,4,02 BAJA CALIFORNIA,002,002 MEXICALI,0124,0124 CAMPO LA CURVA (COLONIA SILVA),3579,MC002,16,1,1,ENTREVISTA COMPLETA, ,2, , , , , , , , , ,2, , , , , , , , , , ,3, , , , ,3,137079,136491,136491,0,1,111,1,1o01,1,842.707148592739,1,13
02,02002012435799990041,4,02 BAJA CALIFORNIA,002,002 MEXICALI,0124,0124 CAMPO LA CURVA (COLONIA SILVA),3579,MC002,16,1,1,ENTREVISTA COMPLETA, ,2, , , , , , , , , ,2, , , , , , , , , , ,3, , , , ,3,137082,136494,136494,0,1,111,1,1o01,1,188.796857170774,2,18
02,02002012435799990051,4,02 BAJA CALIFORNIA,002,002 MEXICALI,0124,0124 CAMPO LA CURVA (COLONIA SILVA),3579,MC002,16,1,1,ENTREVISTA COMPLETA, ,2, , , , , , , , , ,2, , , , , , , , , , ,3, , , , ,3,137080,136492,136492,0,1,111,1,1o01,1,756.460024165295,2,14
02,02002012435799990061,5,02 BAJA CALIFORNIA,002,002 MEXICALI,0124,0124 CAMPO LA CURVA (COLONIA SILVA),3579,MC004,16,1,1,ENTREVISTA COMPLETA, ,2, , , , , , , , , ,2, , , , , , , , , , ,9,0,0,0,0,9,137145,136557,136557,0,1,111,1,1o01,1,1264.06072288911,1,11
02,02002012435799990081,3,02 BAJA CALIFORNIA,002,002 MEXICALI,0124,0124 CAMPO LA CURVA (COLONIA SILVA),3579,MC004,16,1,1,ENTREVISTA COMPLETA, ,2, , , , , , , , , ,2, , , , , , , , , , ,3, , , , ,3,137144,136556,136556,0,1,111,1,1o01,1,421.35357429637,1,10
02,02002012435799990091,2,02 BAJA CALIFORNIA,002,002 MEXICALI,0124,0124 CAMPO LA CURVA (COLONIA SILVA),3579,MC004,16,1,1,ENTREVISTA COMPLETA, ,2, , , , , , , , , ,2, , , , , , , , , , ,3, , , , ,3,137146,136558,136558,0,1,111,1,1o01,1,188.796857170774,2,18
02,02002012435799990111,4,02 BAJA CALIFORNIA,002,002 MEXICALI,0124,0124 CAMPO LA CURVA (COLONIA SILVA),3579,MC006,16,1,1,ENTREVISTA COMPLETA, ,2, , , , , , , , , ,2, , , , , , , , , , ,3, , , , ,3,137209,136621,136621,0,1,111,1,1o01,1,421.35357429637,1,10
02,02002012435799990141,3,02 BAJA CALIFORNIA,002,002 MEXICALI,0124,0124 CAMPO LA CURVA (COLONIA SILVA),3579,MC006,16,1,1,ENTREVISTA COMPLETA, ,2, , , , , , , , , ,2, , , , , , , , , , ,3, , , , ,3,137208,136620,136620,0,1,111,1,1o01,1,548.972111802195,1,18
02,02002012435799990151,4,02 BAJA CALIFORNIA,002,002 MEXICALI,0124,0124 CAMPO LA CURVA (COLONIA SILVA),3579,MC006,16,1,1,ENTREVISTA COMPLETA, ,2, , , , , , , , , ,2, , , , , , , , , , ,3, , , , ,3,137210,136622,136622,0,1,111,1,1o01,1,274.486055901097,1,16
02,020020167348A9990011,2,02 BAJA CALIFORNIA,002,002 MEXICALI,0167,0167 EJIDO DISTRITO FEDERAL,348A,MC002,16,1,1,ENTREVISTA COMPLETA, ,2, , , , , , , , , ,2, , , , , , , , , , ,3, , , , ,3,137078,136490,136490,0,1,112,1,1o31,1,922.794539852063,2,19
02,020020167348A9990041,7,02 BAJA CALIFORNIA,002,002 MEXICALI,0167,0167 EJIDO DISTRITO FEDERAL,348A,MC002,16,1,1,ENTREVISTA COMPLETA, ,2, , , , , , , , , ,2, , , , , , , , , , ,3, , , , ,3,137077,136489,136489,0,1,112,1,1o31,1,1086.10807062546,1,15
02,020020167348A9990091,3,02 BAJA CALIFORNIA,002,002 MEXICALI,0167,0167 EJIDO DISTRITO FEDERAL,348A,MC006,16,1,1,ENTREVISTA COMPLETA, ,2, , , , , , , , , ,2, , , , , , , , , , ,3, , , , ,3,137207,136619,136619,0,1,112,1,1o31,1,407.887563655776,2,11
02,020020167348A9990121,4,02 BAJA CALIFORNIA,002,002 MEXICALI,0167,0167 EJIDO DISTRITO FEDERAL,348A,MC006,16,1,1,ENTREVISTA COMPLETA, ,2, , , , , , , , , ,2, , , , , , , , , , ,9,0,0,0,0,9,137206,136618,136618,0,1,112,1,1o31,1,815.775127311553,2,11
02,020020167348A9990141,4,02 BAJA CALIFORNIA,002,002 MEXICALI,0167,0167 EJIDO DISTRITO FEDERAL,348A,MC004,16,1,1,ENTREVISTA COMPLETA, ,2, , , , , , , , , ,2, , , , , , , , , , ,3, , , , ,3,137143,136555,136555,0,1,112,1,1o31,1,1086.10807062546,1,17
02,020020167348A9990151,5,02 BAJA CALIFORNIA,002,002 MEXICALI,0167,0167 EJIDO DISTRITO FEDERAL,348A,MC004,16,1,1,ENTREVISTA COMPLETA, ,2, , , , , , , , , ,2, , , , , , , , , , ,3, , , , ,3,137153,136565,136565,0,1,112,1,1o31,1,922.794539852063,2,18
02,02002017035799990041,6,02 BAJA CALIFORNIA,002,002 MEXICALI,0170,0170 EL NACAY ELÍAS (COLONIA ELÍAS),3579,MC006,16,1,1,ENTREVISTA COMPLETA, ,2, , , , , , , , , ,2, , , , , , , , , , ,3, , , , ,3,137212,136624,136624,0,1,111,1,1o01,1,472.787515103309,2,13
02,02002017035799990051,5,02 BAJA CALIFORNIA,002,002 MEXICALI,0170,0170 EL NACAY ELÍAS (COLONIA ELÍAS),3579,MC006,16,1,1,ENTREVISTA COMPLETA, ,2, , , , , , , , , ,2, , , , , , , , , , ,3, , , , ,3,137211,136623,136623,0,1,111,1,1o01,1,514.661354814557,1,15
02,02002017035799990071,3,02 BAJA CALIFORNIA,002,002 MEXICALI,0170,0170 EL NACAY ELÍAS (COLONIA ELÍAS),3579,MC004,16,1,1,ENTREVISTA COMPLETA, ,2, , , , , , , , , ,2, , , , , , , , , , ,3, , , , ,3,137150,136562,136562,0,1,111,1,1o01,1,790.037951805693,1,12
02,02002017035799990091,5,02 BAJA CALIFORNIA,002,002 MEXICALI,0170,0170 EL NACAY ELÍAS (COLONIA ELÍAS),3579,MC004,16,1,1,ENTREVISTA COMPLETA, ,2, , , , , , , , , ,2, , , , , , , , , , ,3, , , , ,3,137149,136561,136561,0,1,111,1,1o01,1,945.575030206618,2,11
02,02002025535799990041,4,02 BAJA CALIFORNIA,002,002 MEXICALI,0255,0255 COLONIA PESCADEROS (CAMPO LA CATORCE),3579,MC004,16,1,1,ENTREVISTA COMPLETA, ,2, , , , , , , , , ,2, , , , , , , , , , ,3, , , , ,3,137148,136560,136560,0,1,111,1,1o01,1,200.41512530436,2,17
02,02002025535799990051,3,02 BAJA CALIFORNIA,002,002 MEXICALI,0255,0255 COLONIA PESCADEROS (CAMPO LA CATORCE),3579,MC004,16,1,1,ENTREVISTA COMPLETA, ,2, , , , , , , , , ,2, , , , , , , , , , ,3, , , , ,3,137147,136559,136559,0,1,111,1,1o01,1,200.41512530436,2,15
02,02002025535799990111,2,02 BAJA CALIFORNIA,002,002 MEXICALI,0255,0255 COLONIA PESCADEROS (CAMPO LA CATORCE),3579,MC002,16,1,1,ENTREVISTA COMPLETA, ,2, , , , , , , , , ,2, , , , , , , , , , ,3, , , , ,3,137083,136495,136495,0,1,111,1,1o01,1,200.41512530436,2,18
02,020020270348A9990021,4,02 BAJA CALIFORNIA,002,002 MEXICALI,0270,0270 EJIDO QUINTANA ROO,348A,MC002,16,1,1,ENTREVISTA COMPLETA, ,2, , , , , , , , , ,2, , , , , , , , , , ,3, , , , ,3,137072,136484,136484,0,1,112,1,1o31,1,2231.58942248084,1,16
02,020020270348A9990061,6,02 BAJA CALIFORNIA,002,002 MEXICALI,0270,0270 EJIDO QUINTANA ROO,348A,MC002,16,1,1,ENTREVISTA COMPLETA, ,2, , , , , , , , , ,2, , , , , , , , , , ,3, , , , ,3,137073,136485,136485,0,1,112,1,1o31,1,1422.02598660673,2,15
02,020020270348A9990101,4,02 BAJA CALIFORNIA,002,002 MEXICALI,0270,0270 EJIDO QUINTANA ROO,348A,MC006,16,1,1,ENTREVISTA COMPLETA, ,2, , , , , , , , , ,2, , , , , , , , , , ,3, , , , ,3,137203,136615,136615,0,1,112,1,1o31,1,2514.21823638102,2,13
02,020020270348A9990141,2,02 BAJA CALIFORNIA,002,002 MEXICALI,0270,0270 EJIDO QUINTANA ROO,348A,MC004,16,1,1,ENTREVISTA COMPLETA, ,2, , , , , , , , , ,2, , , , , , , , , , ,3, , , , ,3,137141,136553,136553,0,1,112,1,1o31,1,2844.05197321347,2,16
02,020020521348A9990021,4,02 BAJA CALIFORNIA,002,002 MEXICALI,0521,0521 POBLADO FRANCISCO SANTANA PERALTA,348A,MC002,16,1,1,ENTREVISTA COMPLETA, ,2, , , , , , , , , ,2, , , , , , , , , , ,3, , , , ,3,137074,136486,136486,0,1,112,1,1o31,1,4581.73698947514,1,15
02,020020521348A9990041,5,02 BAJA CALIFORNIA,002,002 MEXICALI,0521,0521 POBLADO FRANCISCO SANTANA PERALTA,348A,MC002,16,1,1,ENTREVISTA COMPLETA, ,2, , , , , , , , , ,2, , , , , , , , , , ,3, , , , ,3,137075,136487,136487,0,1,112,1,1o31,1,763.62283157919,1,16
02,020020521348A9990061,3,02 BAJA CALIFORNIA,002,002 MEXICALI,0521,0521 POBLADO FRANCISCO SANTANA PERALTA,348A,MC002,16,1,1,ENTREVISTA COMPLETA, ,2, , , , , , , , , ,2, , , , , , , , , , ,3, , , , ,3,137076,136488,136488,0,1,112,1,1o31,1,860.334983457198,2,12
02,020020521348A9990091,5,02 BAJA CALIFORNIA,002,002 MEXICALI,0521,0521 POBLADO FRANCISCO SANTANA PERALTA,348A,MC006,16,1,1,ENTREVISTA COMPLETA, ,2, , , , , , , , , ,2, , , , , , , , , , ,3, , , , ,3,137205,136617,136617,0,1,112,1,1o31,1,1527.24566315838,1,16
02,020020521348A9990101,3,02 BAJA CALIFORNIA,002,002 MEXICALI,0521,0521 POBLADO FRANCISCO SANTANA PERALTA,348A,MC006,16,1,1,ENTREVISTA COMPLETA, ,2, , , , , , , , , ,2, , , , , , , , , , ,3, , , , ,3,137204,136616,136616,0,1,112,1,1o31,1,1636.4539310763,1,10
02,020020521348A9990131,4,02 BAJA CALIFORNIA,002,002 MEXICALI,0521,0521 POBLADO FRANCISCO SANTANA PERALTA,348A,MC004,16,1,1,ENTREVISTA COMPLETA, ,2, , , , , , , , , ,2, , , , , , , , , , ,3, , , , ,3,137142,136554,136554,0,1,112,1,1o31,1,1636.4539310763,1,11
02,020040001393A0020111,4,02 BAJA CALIFORNIA,004,004 TIJUANA,0001,0001 TIJUANA,393A,MC002,16,1,1,ENTREVISTA COMPLETA, ,2, , , , , , , , , ,2, , , , , , , , , , ,3, , , , ,3,137091,136503,136503,0,1,123,1,1o61,2,64211.1483539649,2,10
02,020040001393A0020271,3,02 BAJA CALIFORNIA,004,004 TIJUANA,0001,0001 TIJUANA,393A,MC002,16,1,1,ENTREVISTA COMPLETA, ,2, , , , , , , , , ,2, , , , , , , , , , ,3, , , , ,3,137090,136502,136502,0,1,123,1,1o61,2,20072.2914685503,2,18
02,020040001393A0060131,4,02 BAJA CALIFORNIA,004,004 TIJUANA,0001,0001 TIJUANA,393A,MC004,16,1,1,ENTREVISTA COMPLETA, ,2, , , , , , , , , ,2, , , , , , , , , , ,3, , , , ,3,137156,136568,136568,0,1,123,1,1o61,2,24485.3817189956,2,15
02,020040001393A0340701,5,02 BAJA CALIFORNIA,004,004 TIJUANA,0001,0001 TIJUANA,393A,MC006,16,1,1,ENTREVISTA COMPLETA, ,2, , , , , , , , , ,2, , , , , , , , , , ,3, , , , ,3,137221,136633,136633,0,1,123,1,1o61,2,22138.0927654793,2,17
02,02004000139970010161,3,02 BAJA CALIFORNIA,004,004 TIJUANA,0001,0001 TIJUANA,3997,MC006,16,1,1,ENTREVISTA COMPLETA, ,2, , , , , , , , , ,2, , , , , , , , , , ,3, , , , ,3,137220,136632,136632,0,1,123,1,1o62,2,10908.9146278726,1,17
02,02004000139970130541,4,02 BAJA CALIFORNIA,004,004 TIJUANA,0001,0001 TIJUANA,3997,MC006,16,1,1,ENTREVISTA COMPLETA, ,2, , , , , , , , , ,2, , , , , , , , , , ,3, , , , ,3,137219,136631,136631,0,1,123,1,1o62,2,41639.8692667013,2,18
02,02004000139970340291,4,02 BAJA CALIFORNIA,004,004 TIJUANA,0001,0001 TIJUANA,3997,MC002,16,1,1,ENTREVISTA COMPLETA, ,2, , , , , , , , , ,2, , , , , , , , , , ,3, , , , ,3,137089,136501,136501,0,1,123,1,1o62,2,9852.43732737594,1,12
02,02004000139970340341,5,02 BAJA CALIFORNIA,004,004 TIJUANA,0001,0001 TIJUANA,3997,MC002,16,1,1,ENTREVISTA COMPLETA, ,2, , , , , , , , , ,2, , , , , , , , , , ,3, , , , ,3,137088,136500,136500,0,1,123,1,1o62,2,17016.2927291808,2,18
02,02004000153150030031,3,02 BAJA CALIFORNIA,004,004 TIJUANA,0001,0001 TIJUANA,5315,MC006,16,1,1,ENTREVISTA COMPLETA, ,2, , , , , , , , , ,2, , , , , , , , , , ,3, , , , ,3,137215,136627,136627,0,1,122,1,1o44,2,2385.06824823269,2,19
02,02004000153150030101,6,02 BAJA CALIFORNIA,004,004 TIJUANA,0001,0001 TIJUANA,5315,MC006,16,1,1,ENTREVISTA COMPLETA, ,2, , , , , , , , , ,2, , , , , , , , , , ,3, , , , ,3,137225,136637,136637,0,1,122,1,1o44,2,7233.82091161941,1,13
02,02004000153150030381,4,02 BAJA CALIFORNIA,004,004 TIJUANA,0001,0001 TIJUANA,5315,MC006,16,1,1,ENTREVISTA COMPLETA, ,2, , , , , , , , , ,2, , , , , , , , , , ,3, , , , ,3,137216,136628,136628,0,1,122,1,1o44,2,7233.82091161941,1,14
02,02004000153150080071,5,02 BAJA CALIFORNIA,004,004 TIJUANA,0001,0001 TIJUANA,5315,MC004,16,1,1,ENTREVISTA COMPLETA, ,2, , , , , , , , , ,2, , , , , , , , , , ,3, , , , ,3,137155,136567,136567,0,1,122,1,1o44,2,2994.42823208755,2,16
02,02004000153150150071,3,02 BAJA CALIFORNIA,004,004 TIJUANA,0001,0001 TIJUANA,5315,MC004,16,1,1,ENTREVISTA COMPLETA, ,2, , , , , , , , , ,2, , , , , , , , , , ,3, , , , ,3,137154,136566,136566,0,1,122,1,1o44,2,3612.59495128184,2,12
02,02004000153150220031,5,02 BAJA CALIFORNIA,004,004 TIJUANA,0001,0001 TIJUANA,5315,MC002,16,1,1,ENTREVISTA COMPLETA, ,2, , , , , , , , , ,2, , , , , , , , , , ,3, , , , ,3,137084,136496,136496,0,1,122,1,1o44,2,4232.90224916866,1,13
02,02004000153150220101,4,02 BAJA CALIFORNIA,004,004 TIJUANA,0001,0001 TIJUANA,5315,MC002,16,1,1,ENTREVISTA COMPLETA, ,2, , , , , , , , , ,2, , , , , , , , , , ,3, , , , ,3,137087,136499,136499,0,1,122,1,1o44,2,4232.90224916866,1,11
02,02004000153150290021,2,02 BAJA CALIFORNIA,004,004 TIJUANA,0001,0001 TIJUANA,5315,MC002,16,1,1,ENTREVISTA COMPLETA, ,2, , , , , , , , , ,2, , , , , , , , , , ,9,0,0,0,0,9,137085,136497,136497,0,1,122,1,1o44,2,24904.4584462628,1,18
02,02004000153150290101,3,02 BAJA CALIFORNIA,004,004 TIJUANA,0001,0001 TIJUANA,5315,MC002,16,1,1,ENTREVISTA COMPLETA, ,2, , , , , , , , , ,2, , , , , , , , , , ,3, , , , ,3,137086,136498,136498,0,1,122,1,1o44,2,6818.12873248768,1,13
02,02004000153150360061,5,02 BAJA CALIFORNIA,004,004 TIJUANA,0001,0001 TIJUANA,5315,MC006,16,1,1,ENTREVISTA COMPLETA, ,2, , , , , , , , , ,2, , , , , , , , , , ,3, , , , ,3,137217,136629,136629,0,1,122,1,1o44,2,5666.81560985386,2,10
02,02004000153150360171,4,02 BAJA CALIFORNIA,004,004 TIJUANA,0001,0001 TIJUANA,5315,MC006,16,1,1,ENTREVISTA COMPLETA, ,2, , , , , , , , , ,2, , , , , , , , , , ,3, , , , ,3,137218,136630,136630,0,1,122,1,1o44,2,5666.81560985386,2,11
02,02004190382010010401,3,02 BAJA CALIFORNIA,004,004 TIJUANA,1903,1903 VILLA DEL PRADO,8201,MC004,16,1,1,ENTREVISTA COMPLETA, ,2, , , , , , , , , ,2, , , , , , , , , , ,2,0,1,0,0,3,137159,136571,136571,0,1,122,1,1o45,2,56563.9132463049,1,17
02,02004190382010011051,3,02 BAJA CALIFORNIA,004,004 TIJUANA,1903,1903 VILLA DEL PRADO,8201,MC004,16,1,1,ENTREVISTA COMPLETA, ,2, , , , , , , , , ,2, , , , , , , , , , ,3, , , , ,3,137157,136569,136569,0,1,122,1,1o45,2,56563.9132463049,1,15