folio,INT,entidad,desc_ent,munici,desc_mun,locali,desc_loc,maq,completa,n_comp,ob_ser,a1400,a14a11,a14a12,a101h,a101m,a101ah,a101am,a101bh,a101bm,a101ch,a101cm,a101dh,a101dm,a101eh,a101em,a102,a103,a104,a105a,a105b,a105c,a105d,a105e,a105f,a105g,a105h,a105i,a105j,a105esp,a301,a302a,a302b,a3025,a303,a305a,a305b,a306a,a306b,a306c,a306d,a306e,a306f,a306g,a306h,a306i,a306j,a306k,a306l,a306m,a306n,a306esp,a307,a307a,a307b1,a307b12,a307b2,a307b22,a307b3,a307b32,a307b4,a307b42,a307b5,a307b52,a307ca,a307cb,a308a,a308b,a309a,a309b,a309c,a309d,a309e,a309f,a309g,a310a,a310b,a310c,a310d,a310e,a310f,a310g,a310h,a311e1,a311e2,a311e3,a311e4,a311e5,a311e6,a311e7,a312a,a312b,a312c,a312d,a312e,a312f,a312g,a312h,a312i,a312j,a312k,a312l,a312m,a312n,a312o,a312p,a312q,a312esp,a313a,a313b,a313c,a313d,a313e,a313f,a313g,a313h,a313i,a313j,a313k,a313k2,a313l,a313l2,a313l3,a313m,a313m2,a313n,a313o,a313p,a313q,a313r,a313s,a313t,a313u,a401,a402a,a402b,a403,a404,a405,a405b,a406a,a406b,a406c,a406d,a406e,a406f,a406g,a406h,a406i,a406j,a406k,a406l,a406esp,a407a,a407b,a407c,a407d,a407e,a407f,a407g,a408a,a408b,a501,a502a,a502b,a502c,a502d,a502desp,a503,a504,a505,a605a,a605b,a605c,a606a,a606b,a606c,a606d,a606e,a606f,a606g,a606h,a606esp,a600a,a607,a608a,a608b,a608c,a608d,a608e,a609,a610a,a610b,a610c,a610d,a611,a612,a701a,a702a,a703a,a704a,a705a,a706a,a701b,a702b,a703b,a704b,a705b,a706b,a1301,a1301a,a1312c,ID_SQL_R,ID_SQL_1,ID_SQL_2,ID_SQL_3,ID_SQL_4,TIEMPO_GEN,ORIGEN,c1,est_var,region_h,code_upm,rural,ponde_f,edad,sexo,pondefmiles,gpo_edad,diabetes,hcol
010010001209A0020041,1,01,AGUASCALIENTES,001,AGUASCALIENTES,0001,AGUASCALIENTES,MC035,1,ENTREVISTA COMPLETA,,,,,,,,,,,,,,,,,,,,,,,,,,,,,,,,,,,,,,,,,,,,,,,,,,,,,,,,,,,,,,,,,,,,,,,,,,,,,,,,,,,,,,,,,,,,,,,,,,,,,,,,,,,,,,,,,,,,,,,,,,,,,,,,,,,,,,,,,,,,,,,,,,,,,,,,,,,,,,,,,,,,,,,,,,,,,,,,,,,,,,,,,,,,,,,,,,,,,,,,,,,,,,,,,,,,,437324,324069,324069,324069,324069,2016/09/29,0,1,223,2,2o72,2,9460.264058119825,41,1,9.460264205932617,40,,
010010001209A0080151,1,01,AGUASCALIENTES,001,AGUASCALIENTES,0001,AGUASCALIENTES,MC033,1,ENTREVISTA COMPLETA,,,,,,,,,,,,,,,,,,,,,,,,,,,,,,,,,,,,,,,,,,,,,,,,,,,,,,,,,,,,,,,,,,,,,,,,,,,,,,,,,,,,,,,,,,,,,,,,,,,,,,,,,,,,,,,,,,,,,,,,,,,,,,,,,,,,,,,,,,,,,,,,,,,,,,,,,,,,,,,,,,,,,,,,,,,,,,,,,,,,,,,,,,,,,,,,,,,,,,,,,,,,,,,,,,,,,444683,323864,323864,323864,323864,2016/09/29,0,1,223,2,2o72,2,33016.09908168427,64,1,33.01609802246094,60,,
010010001209A0210101,2,01,AGUASCALIENTES,001,AGUASCALIENTES,0001,AGUASCALIENTES,MC031,1,ENTREVISTA COMPLETA,,,,,,,,,,,,,,,,,,,,,,,,,,,,,,,,,,,,,,,,,,,,,,,,,,,,,,,,,,,,,,,,,,,,,,,,,,,,,,,,,,,,,,,,,,,,,,,,,,,,,,,,,,,,,,,,,,,,,,,,,,,,,,,,,,,,,,,,,,,,,,,,,,,,,,,,,,,,,,,,,,,,,,,,,,,,,,,,,,,,,,,,,,,,,,,,,,,,,,,,,,,,,,,,,,,,,444386,323655,323655,323655,323655,2016/09/29,0,1,223,2,2o72,2,5820.010327539746,73,2,5.820010185241699,70,,
010010001262A0010361,2,01,AGUASCALIENTES,001,AGUASCALIENTES,0001,AGUASCALIENTES,MC035,1,ENTREVISTA COMPLETA,,,,,,,,,,,,,,,,,,,,,,,,,,,,,,,,,,,,,,,,,,,,,,,,,,,,,,,,,,,,,,,,,,,,,,,,,,,,,,,,,,,,,,,,,,,,,,,,,,,,,,,,,,,,,,,,,,,,,,,,,,,,,,,,,,,,,,,,,,,,,,,,,,,,,,,,,,,,,,,,,,,,,,,,,,,,,,,,,,,,,,,,,,,,,,,,,,,,,,,,,,,,,,,,,,,,,437316,324070,324070,324070,324070,2016/09/29,0,1,222,2,2o50,2,35780.83192610531,24,1,35.78083038330078,20,,
010010001262A0280061,2,01,AGUASCALIENTES,001,AGUASCALIENTES,0001,AGUASCALIENTES,MC035,1,ENTREVISTA COMPLETA,,,,,,,,,,,,,,,,,,,,,,,,,,,,,,,,,,,,,,,,,,,,,,,,,,,,,,,,,,,,,,,,,,,,,,,,,,,,,,,,,,,,,,,,,,,,,,,,,,,,,,,,,,,,,,,,,,,,,,,,,,,,,,,,,,,,,,,,,,,,,,,,,,,,,,,,,,,,,,,,,,,,,,,,,,,,,,,,,,,,,,,,,,,,,,,,,,,,,,,,,,,,,,,,,,,,,437317,324071,324071,324071,324071,2016/09/29,0,1,222,2,2o50,2,22500.960922228463,31,2,22.500961303710938,30,,
01001000127230130131,2,01,AGUASCALIENTES,001,AGUASCALIENTES,0001,AGUASCALIENTES,MC035,1,ENTREVISTA COMPLETA,,,,,,,,,,,,,,,,,,,,,,,,,,,,,,,,,,,,,,,,,,,,,,,,,,,,,,,,,,,,,,,,,,,,,,,,,,,,,,,,,,,,,,,,,,,,,,,,,,,,,,,,,,,,,,,,,,,,,,,,,,,,,,,,,,,,,,,,,,,,,,,,,,,,,,,,,,,,,,,,,,,,,,,,,,,,,,,,,,,,,,,,,,,,,,,,,,,,,,,,,,,,,,,,,,,,,437310,324061,324061,324061,324061,2016/09/29,0,1,223,2,2o71,2,29787.118848237187,24,1,29.787118911743164,20,,
01001000127230320011,1,01,AGUASCALIENTES,001,AGUASCALIENTES,0001,AGUASCALIENTES,MC031,1,ENTREVISTA COMPLETA,,3,,,,5,,3,,3,,1,,7,,9,2,5,2,,,,,,,,,,,,1,1,,44,2,4,2,,,,,,,,1,,,,,,,,2,1,METFORMINA,1,99,,,,,,,,,,,,,,,,,,1,,,1,1,,,,,0,0,1,1,0,0,0,,,,,,,,,,,,,,,,,1,,2,2,1,2,2,2,2,2,2,2,2,0,2,0,0,2,0,2,2,2,2,2,2,1,2,1,2,0,1,1,,0,,,,,,,,,,,,,,,,,,,,,3,6,1,2,2,1,2,,,,,1,2,2,,,,,,,,1,,1,1,1,,,,,1,1,,,,2,,2,,2,,2,,1,,1,,1,,3,,,444405,323647,323647,323647,323647,2016/09/29,0,1,223,2,2o71,2,5382.494049696174,45,2,5.38249397277832,40,1,1
010010001209A0310131,1,01,AGUASCALIENTES,001,AGUASCALIENTES,0001,AGUASCALIENTES,MC031,1,ENTREVISTA COMPLETA,,3,,,,5,,6,,5,,1,,8,,9,1,2,,,,,,,,,,,,,3,,,,,,,,,,,,,,,,,,,,,,,,,,,,,,,,,,,,,,,,,,,,,,,,,,,,,,,,,,,,,,,,,,,,,,,,,,,,,,,,,,,,,,,,,,,,,,,,,,,,,,,1,0,12,2,,1,12,,,,,,,,,,,1,,SEGURO POPULAR,,,,,,,1,3,12,2,2,2,2,2,,,,,1,2,2,,,,,,,,1,,1,2,,,,,,2,,,,,2,,2,,2,,1,69,2,,1,,2,,3,,,444393,323635,323635,323635,323635,2016/09/29,0,1,223,2,2o72,2,3756.176878057567,83,2,3.7561769485473633,80,0,0
01001000127230070191,2,01,AGUASCALIENTES,001,AGUASCALIENTES,0001,AGUASCALIENTES,MC031,1,ENTREVISTA COMPLETA,,3,,,,5,,3,,3,,1,,8,,9,1,5,,,,,,,,,,,,,3,,,,,,,,,,,,,,,,,,,,,,,,,,,,,,,,,,,,,,,,,,,,,,,,,,,,,,,,,,,,,,,,,,,,,,,,,,,,,,,,,,,,,,,,,,,,,,,,,,,,,,,2,,,,,,,,,,,,,,,,,,,,,,,,,,,,,2,2,2,2,2,,,,,2,2,2,,,,,,,,,,2,,,,,,,,,,,,2,,2,,2,,2,,1,,1,,2,,3,,,444394,323636,323636,323636,323636,2016/09/29,0,1,223,2,2o71,2,11587.532497985769,29,2,11.587532043457031,20,0,
01001000127230220331,1,01,AGUASCALIENTES,001,AGUASCALIENTES,0001,AGUASCALIENTES,MC033,1,ENTREVISTA COMPLETA,,3,,,,3,,4,,4,,1,,8,,9,2,2,,,,,,,,,,,,,3,,,,,,,,,,,,,,,,,,,,,,,,,,,,,,,,,,,,,,,,,,,,,,,,,,,,,,,,,,,,,,,,,,,,,,,,,,,,,,,,,,,,,,,,,,,,,,,,,,,,,,,2,,,,,,,,,,,,,,,,,,,,,,,,,,,,,2,2,2,2,2,,,,,1,2,2,,1,,,,,,,,1,2,,,,,,2,,,,,2,,2,,2,,2,,2,,1,,2,,3,,3,444688,323849,323849,323849,323849,2016/09/29,0,1,223,2,2o71,2,3955.669118418955,47,2,3.9556691646575928,40,0,0
01001000127230380431,1,01,AGUASCALIENTES,001,AGUASCALIENTES,0001,AGUASCALIENTES,MC035,1,ENTREVISTA COMPLETA,,3,,,4,,5,,4,,1,,9,,9,,3,,,,,,,,,,,,,,3,,,,,,,,,,,,,,,,,,,,,,,,,,,,,,,,,,,,,,,,,,,,,,,,,,,,,,,,,,,,,,,,,,,,,,,,,,,,,,,,,,,,,,,,,,,,,,,,,,,,,,,2,,,,,,,,,,,,,,,,,,,,,,,,,,,,,2,2,2,2,2,,,,,2,2,2,,,,,,,,,,2,,,,,,,,,,,,2,,2,,2,,2,,1,,1,,2,,3,,,437312,324055,324055,324055,324055,2016/09/29,0,1,223,2,2o71,2,6888.54487818126,25,1,6.888545036315918,20,0,
010010001262A0220151,1,01,AGUASCALIENTES,001,AGUASCALIENTES,0001,AGUASCALIENTES,MC031,1,ENTREVISTA COMPLETA,,3,,,,5,,3,,4,,1,,8,,9,2,21,1,1,,,1,,,,,,,,3,,,,,,,,,,,,,,,,,,,,,,,,,,,,,,,,,,,,,,,,,,,,,,,,,,,,,,,,,,,,,,,,,,,,,,,,,,,,,,,,,,,,,,,,,,,,,,,,,,,,,,,1,0,19,1,1,,0,,,,,,,,,,,,,,,,,,,,,1,1,2,2,2,2,1,CRECIDO EL CORAZON,,,,1,2,2,,,,,,,,1,,1,1,1,,,,,1,1,,,,2,,1,99,2,,1,86,2,,1,,2,,3,,,444410,323653,323653,323653,323653,2016/09/29,0,1,222,2,2o50,2,4486.792973608785,45,2,4.486793041229248,40,0,1
01001000127230130241,1,01,AGUASCALIENTES,001,AGUASCALIENTES,0001,AGUASCALIENTES,MC035,1,ENTREVISTA COMPLETA,,3,,,,6,,5,,5,,1,,9,,9,1,2,,,,,,,,,,,,,1,,20,54,1,3,1,1,,,,,,,,,,,,,,,2,1,METFORMINA 850 MG,1,99,,,,,,,,,,,,,,,,,,1,,,1,1,,,,,0,0,2,2,0,0,0,,,,,,,,,,,,,,,,,1,,2,2,1,2,1,2,2,2,1,2,2,0,2,0,0,2,0,1,2,2,2,2,2,1,2,1,0,8,2,,1,10,1,,,,,,,,,,,,,,,,1,,1,,1,1,2,2,2,2,2,,,,,2,2,2,,,,,,,,,,1,1,1,,,,,1,1,,,,2,,9,,9,,9,,1,,1,,2,,3,,,437321,324063,324063,324063,324063,2016/09/29,0,1,223,2,2o71,2,2075.2170794389945,79,2,2.0752170085906982,70,1,1
01001000127230070101,3,01,AGUASCALIENTES,001,AGUASCALIENTES,0001,AGUASCALIENTES,MC031,1,ENTREVISTA COMPLETA,,3,,,2,,4,,4,,1,,8,,9,,2,3,,,,,,,,,,,,,3,,,,,,,,,,,,,,,,,,,,,,,,,,,,,,,,,,,,,,,,,,,,,,,,,,,,,,,,,,,,,,,,,,,,,,,,,,,,,,,,,,,,,,,,,,,,,,,,,,,,,,,2,,,,,,,,,,,,,,,,,,,,,,,,,,,,,2,2,2,2,2,,,,,2,2,2,,,,,,,,,,2,,,,,,,,,,,,2,,2,,1,45,2,,2,,1,35,2,,3,,98,444397,323640,323640,323640,323640,2016/09/29,0,1,223,2,2o71,2,31060.072645170403,23,1,31.06007194519043,20,0,
010010001209A0210081,1,01,AGUASCALIENTES,001,AGUASCALIENTES,0001,AGUASCALIENTES,MC031,1,ENTREVISTA COMPLETA,,3,,,,4,,4,,5,,1,,8,,9,2,3,,,,,,,,,,,,,3,,,,,,,,,,,,,,,,,,,,,,,,,,,,,,,,,,,,,,,,,,,,,,,,,,,,,,,,,,,,,,,,,,,,,,,,,,,,,,,,,,,,,,,,,,,,,,,,,,,,,,,2,,,,,,,,,,,,,,,,,,,,,,,,,,,,,2,2,2,2,2,,,,,2,2,2,,,,,,,,,,2,,,,,,,,,,,,2,,2,,1,75,2,,1,,2,,2,,3,,,444409,323651,323651,323651,323651,2016/09/29,0,1,223,2,2o72,2,3546.7448705806305,56,2,3.5467448234558105,50,0,
010010001209A0210121,2,01,AGUASCALIENTES,001,AGUASCALIENTES,0001,AGUASCALIENTES,MC031,1,ENTREVISTA COMPLETA,,3,,,,4,,3,,3,,1,,8,,9,1,1,,,,,,,,,,,,,3,,,,,,,,,,,,,,,,,,,,,,,,,,,,,,,,,,,,,,,,,,,,,,,,,,,,,,,,,,,,,,,,,,,,,,,,,,,,,,,,,,,,,,,,,,,,,,,,,,,,,,,2,,,,,,,,,,,,,,,,,,,,,,,,,,,,,2,2,2,2,2,,,,,2,2,2,,,,,,,,,,2,,,,,,,,,,,,2,,1,99,2,,2,,2,,2,,2,,3,,,444387,323628,323628,323628,323628,2016/09/29,0,1,223,2,2o72,2,12018.279097367833,44,2,12.018279075622559,40,0,
010010001262A0170051,1,01,AGUASCALIENTES,001,AGUASCALIENTES,0001,AGUASCALIENTES,MC031,1,ENTREVISTA COMPLETA,,3,,,,2,,9,,3,,1,,8,,9,2,3,,,,,,,,,,,,,3,,,,,,,,,,,,,,,,,,,,,,,,,,,,,,,,,,,,,,,,,,,,,,,,,,,,,,,,,,,,,,,,,,,,,,,,,,,,,,,,,,,,,,,,,,,,,,,,,,,,,,,2,,,,,,,,,,,,,,,,,,,,,,,,,,,,,2,2,2,2,1,SOPLO EN EL CORAZON,,,,2,2,2,,,,,,,,,,1,1,1,,,,,1,1,,,,2,,9,,9,,9,,2,,2,,2,,3,,,444411,323654,323654,323654,323654,2016/09/29,0,1,222,2,2o50,2,3115.2163585023354,64,2,3.1152162551879883,60,0,1
010010001262A0170161,1,01,AGUASCALIENTES,001,AGUASCALIENTES,0001,AGUASCALIENTES,MC031,1,ENTREVISTA COMPLETA,,3,,,,4,,2,,2,,1,,9,,9,2,2,,,,,,,,,,,,,3,,,,,,,,,,,,,,,,,,,,,,,,,,,,,,,,,,,,,,,,,,,,,,,,,,,,,,,,,,,,,,,,,,,,,,,,,,,,,,,,,,,,,,,,,,,,,,,,,,,,,,,2,,,,,,,,,,,,,,,,,,,,,,,,,,,,,2,2,2,2,2,,,,,2,2,2,,,,,,,,,,2,,,,,,,,,,,,2,,2,,2,,2,,2,,2,,2,,3,,,444403,323646,323646,323646,323646,2016/09/29,0,1,222,2,2o50,2,2847.2737157259453,48,2,2.847273826599121,40,0,
010010001262A0220121,3,01,AGUASCALIENTES,001,AGUASCALIENTES,0001,AGUASCALIENTES,MC031,1,ENTREVISTA COMPLETA,,3,,,,4,,4,,4,,1,,7,,9,3,,,,,,,,,,,,,,3,,,,,,,,,,,,,,,,,,,,,,,,,,,,,,,,,,,,,,,,,,,,,,,,,,,,,,,,,,,,,,,,,,,,,,,,,,,,,,,,,,,,,,,,,,,,,,,,,,,,,,,2,,,,,,,,,,,,,,,,,,,,,,,,,,,,,2,2,2,2,2,,,,,2,2,2,,,,,,,,,,2,,,,,,,,,,,,2,,2,,2,,2,,1,,2,,2,,3,,,444402,323644,323644,323644,323644,2016/09/29,0,1,222,2,2o50,2,19703.33573521111,24,2,19.70333480834961,20,0,
010010001262A0280431,2,01,AGUASCALIENTES,001,AGUASCALIENTES,0001,AGUASCALIENTES,MC035,1,ENTREVISTA COMPLETA,,3,,,,8,,5,,4,,1,,9,,8,3,,,,,,,,,,,,,,3,,,,,,,,,,,,,,,,,,,,,,,,,,,,,,,,,,,,,,,,,,,,,,,,,,,,,,,,,,,,,,,,,,,,,,,,,,,,,,,,,,,,,,,,,,,,,,,,,,,,,,,1,0,16,2,,1,3,1,,,,,,,,,,,,,,,,,,,1,3,1,2,2,2,2,2,,,,,2,2,2,,,,,,,,,,2,,,,,,,,,,,,2,,2,,2,,2,,2,,2,,2,,3,,,437319,324060,324060,324060,324060,2016/09/29,0,1,222,2,2o50,2,11993.370091930477,74,2,11.993370056152344,70,0,
01001000127230320351,1,01,AGUASCALIENTES,001,AGUASCALIENTES,0001,AGUASCALIENTES,MC031,1,ENTREVISTA COMPLETA,,3,,,,6,,3,,4,,1,,8,,9,2,2,,,,,,,,,,,,,3,,,,,,,,,,,,,,,,,,,,,,,,,,,,,,,,,,,,,,,,,,,,,,,,,,,,,,,,,,,,,,,,,,,,,,,,,,,,,,,,,,,,,,,,,,,,,,,,,,,,,,,2,,,,,,,,,,,,,,,,,,,,,,,,,,,,,2,2,2,2,2,,,,,2,2,2,,,,,,,,,,2,,,,,,,,,,,,2,,1,99,2,,2,,2,,2,,2,,3,,,444404,323652,323652,323652,323652,2016/09/29,0,1,223,2,2o71,2,9305.232577585419,34,2,9.305233001708984,30,0,
01001000127230380271,2,01,AGUASCALIENTES,001,AGUASCALIENTES,0001,AGUASCALIENTES,MC035,1,ENTREVISTA COMPLETA,,3,,,,6,,3,,3,,1,,6,,8,1,5,,,,,,,,,,,,,3,,,,,,,,,,,,,,,,,,,,,,,,,,,,,,,,,,,,,,,,,,,,,,,,,,,,,,,,,,,,,,,,,,,,,,,,,,,,,,,,,,,,,,,,,,,,,,,,,,,,,,,2,,,,,,,,,,,,,,,,,,,,,,,,,,,,,1,2,2,2,1,TAQUICARDIA ARTMICA,,,,1,2,2,,1,,,,,,,,1,2,,,,,,2,,,,,2,,2,,2,,2,,2,,2,,2,,3,,,437308,324051,324051,324051,324051,2016/09/29,0,1,223,2,2o71,2,8919.15202497013,48,2,8.91915225982666,40,0,0
010010001209A0210051,1,01,AGUASCALIENTES,001,AGUASCALIENTES,0001,AGUASCALIENTES,MC031,1,ENTREVISTA COMPLETA,,3,,,4,,2,,2,,1,,9,,8,,1,4,,,,,,,,,,,,,3,,,,,,,,,,,,,,,,,,,,,,,,,,,,,,,,,,,,,,,,,,,,,,,,,,,,,,,,,,,,,,,,,,,,,,,,,,,,,,,,,,,,,,,,,,,,,,,,,,,,,,,2,,,,,,,,,,,,,,,,,,,,,,,,,,,,,2,2,2,2,2,,,,,2,2,2,,,,,,,,,,2,,,,,,,,,,,,2,,2,,2,,1,80,2,,2,,2,,3,,,444408,323650,323650,323650,323650,2016/09/29,0,1,223,2,2o72,2,5513.822215058608,60,1,5.513822078704834,60,0,
010010001262A0010211,1,01,AGUASCALIENTES,001,AGUASCALIENTES,0001,AGUASCALIENTES,MC035,1,ENTREVISTA COMPLETA,,3,,,6,,2,,2,,2,,9,,7,,2,14,1,,,,,,,,,1,,,3,,,,,,,,,,,,,,,,,,,,,,,,,,,,,,,,,,,,,,,,,,,,,,,,,,,,,,,,,,,,,,,,,,,,,,,,,,,,,,,,,,,,,,,,,,,,,,,,,,,,,,,1,0,71,,,1,0,1,,,,,,,,,1,,,,,,,,,,1,1,7,2,2,2,2,2,,,,,2,2,2,,,,,,,,,,2,,,,,,,,,,,,1,1,2,,1,84,1,84,2,,2,,2,,3,,98,437314,324056,324056,324056,324056,2016/09/29,0,1,222,2,2o50,2,11939.338747507218,74,1,11.939338684082031,70,0,
010010001262A0220031,1,01,AGUASCALIENTES,001,AGUASCALIENTES,0001,AGUASCALIENTES,MC031,1,ENTREVISTA COMPLETA,,3,,,,5,,5,,5,,1,,9,,9,2,10,2,,,,,,,,,,,,1,,14,45,2,3,1,1,,,,,,,,,,,,,,,1,,,,,,,,,,,,,9,1,60,,,,,,,1,,,,,1,,,,0,0,0,0,7,0,0,1,,,,,,,,,,,,,,,,,,2,2,1,2,2,2,2,2,2,2,1,5,1,1,4,2,0,2,2,2,2,2,2,2,1,2,,,,,,,,,,,,,,,,,,,,,,,,,,,,,2,2,2,2,2,,,,,2,2,2,,,,,,,,,,2,,,,,,,,,,,,2,,1,99,2,,2,,2,,2,,2,,3,,,444401,323642,323642,323642,323642,2016/09/29,0,1,222,2,2o50,2,4909.022547217855,63,2,4.909022331237793,60,1,
01001000127230070361,1,01,AGUASCALIENTES,001,AGUASCALIENTES,0001,AGUASCALIENTES,MC031,1,ENTREVISTA COMPLETA,,3,,,,8,,5,,4,,1,,8,,9,2,1,,,,,,,,,,,,,1,,16,99,2,3,12,1,,,,,,,,,,,,,,,3,1,GLIBENCLAMIDA,1,INSULINA IS0FANA,1,99,,,,,,,3,1,45,1,,,,,,,,,1,1,,,,,0,0,1,1,0,0,0,,,,,,,,,,,,1,,,,,,,2,2,1,2,2,2,2,2,2,2,2,0,1,1,1,2,0,1,2,2,2,2,2,1,1,2,,,,,,,,,,,,,,,,,,,,,,,,,,,,,2,2,2,2,2,,,,,1,2,2,,,,,,,,1,,1,1,1,,,,,1,1,,,,2,,2,,2,,1,74,1,,2,,2,,3,,,444395,323637,323637,323637,323637,2016/09/29,0,1,223,2,2o71,2,2308.6163513781516,65,2,2.3086163997650146,60,1,1
01001000127230380521,2,01,AGUASCALIENTES,001,AGUASCALIENTES,0001,AGUASCALIENTES,MC035,1,ENTREVISTA COMPLETA,,3,,,,10,,10,,10,,10,,10,,10,2,2,,,,,,,,,,,,,3,,,,,,,,,,,,,,,,,,,,,,,,,,,,,,,,,,,,,,,,,,,,,,,,,,,,,,,,,,,,,,,,,,,,,,,,,,,,,,,,,,,,,,,,,,,,,,,,,,,,,,,2,,,,,,,,,,,,,,,,,,,,,,,,,,,,,2,2,2,2,2,,,,,2,2,2,,,,,,,,,,2,,,,,,,,,,,,2,,9,,9,,9,,9,,9,,9,,3,,98,437306,324049,324049,324049,324049,2016/09/29,0,1,223,2,2o71,2,7019.07628942093,63,2,7.019076347351074,60,0,
01001000127230010131,1,01,AGUASCALIENTES,001,AGUASCALIENTES,0001,AGUASCALIENTES,MC033,1,ENTREVISTA COMPLETA,,3,,,,6,,4,,2,,1,,7,,9,1,15,,,,,,,,,,,,,3,,,,,,,,,,,,,,,,,,,,,,,,,,,,,,,,,,,,,,,,,,,,,,,,,,,,,,,,,,,,,,,,,,,,,,,,,,,,,,,,,,,,,,,,,,,,,,,,,,,,,,,1,0,8,2,,1,12,1,,,,,,,,,,,,,,,,,,,1,1,1,1,2,2,2,2,,,,,1,2,2,,,,,,,,1,,1,1,,1,,,,2,,,,,2,,1,55,1,56,1,56,2,,1,75,2,,9,,98,444692,323847,323847,323847,323847,2016/09/29,0,1,223,2,2o71,2,1624.1635629168545,52,2,1.6241635084152222,50,0,1
01001000127230380011,1,01,AGUASCALIENTES,001,AGUASCALIENTES,0001,AGUASCALIENTES,MC035,1,ENTREVISTA COMPLETA,,3,,,5,,5,,3,,1,,6,,9,,3,,,,,,,,,,,,,,3,,,,,,,,,,,,,,,,,,,,,,,,,,,,,,,,,,,,,,,,,,,,,,,,,,,,,,,,,,,,,,,,,,,,,,,,,,,,,,,,,,,,,,,,,,,,,,,,,,,,,,,1,0,1,,,2,0,,,,,,,,,,,,,,,,,,,,,3,1,2,2,2,2,2,,,,,2,2,2,,,,,,,,,,1,2,,,,,,2,,,,,2,,2,,2,,2,,2,,1,,1,,1,1,5,437305,324047,324047,324047,324047,2016/09/29,0,1,223,2,2o71,2,3176.81749823355,47,1,3.1768174171447754,40,0,0
01001000127230320181,1,01,AGUASCALIENTES,001,AGUASCALIENTES,0001,AGUASCALIENTES,MC031,1,ENTREVISTA COMPLETA,,3,,,,7,,4,,3,,1,,9,,9,2,10,2,,,,,,,,,,,,3,,,,,,,,,,,,,,,,,,,,,,,,,,,,,,,,,,,,,,,,,,,,,,,,,,,,,,,,,,,,,,,,,,,,,,,,,,,,,,,,,,,,,,,,,,,,,,,,,,,,,,,2,,,,,,,,,,,,,,,,,,,,,,,,,,,,,2,2,2,2,2,,,,,2,2,2,,,,,,,,,,1,1,,,,,1,2,,,,,2,,2,,2,,2,,2,,1,,2,,1,1,8,444391,323634,323634,323634,323634,2016/09/29,0,1,223,2,2o71,2,9305.232577585419,30,2,9.305233001708984,30,0,1
010010001209A0310011,2,01,AGUASCALIENTES,001,AGUASCALIENTES,0001,AGUASCALIENTES,MC031,1,ENTREVISTA COMPLETA,,3,,,,6,,4,,4,,1,,8,,9,2,6,1,1,,,,,,,,,,,3,,,,,,,,,,,,,,,,,,,,,,,,,,,,,,,,,,,,,,,,,,,,,,,,,,,,,,,,,,,,,,,,,,,,,,,,,,,,,,,,,,,,,,,,,,,,,,,,,,,,,,,1,6,0,2,,1,1,,,,,,,,,,1,,,,,,,,,,1,1,1,2,2,2,2,2,,,,,1,2,2,,,,,,,,1,,1,2,,,,,,2,,,,,2,,2,,1,50,2,,2,,1,50,2,,1,1,4,444383,323638,323638,323638,323638,2016/09/29,0,1,223,2,2o72,2,11268.530634172701,69,2,11.26853084564209,60,0,0
01001000127230380351,2,01,AGUASCALIENTES,001,AGUASCALIENTES,0001,AGUASCALIENTES,MC035,1,ENTREVISTA COMPLETA,,3,,,,6,,5,,5,,1,,7,,9,3,,,,,,,,,,,,,,3,,,,,,,,,,,,,,,,,,,,,,,,,,,,,,,,,,,,,,,,,,,,,,,,,,,,,,,,,,,,,,,,,,,,,,,,,,,,,,,,,,,,,,,,,,,,,,,,,,,,,,,2,,,,,,,,,,,,,,,,,,,,,,,,,,,,,2,2,2,2,2,,,,,2,2,2,,,,,,,,,,2,,,,,,,,,,,,2,,1,50,1,50,2,,2,,1,65,2,,1,1,,437311,324054,324054,324054,324054,2016/09/29,0,1,223,2,2o71,2,3509.538144710465,50,2,3.509538173675537,50,0,
010010001262A0130261,4,01,AGUASCALIENTES,001,AGUASCALIENTES,0001,AGUASCALIENTES,MC033,1,ENTREVISTA COMPLETA,,3,,,,5,,4,,4,,1,,8,,9,3,,,,,,,,,,,,,,3,,,,,,,,,,,,,,,,,,,,,,,,,,,,,,,,,,,,,,,,,,,,,,,,,,,,,,,,,,,,,,,,,,,,,,,,,,,,,,,,,,,,,,,,,,,,,,,,,,,,,,,2,,,,,,,,,,,,,,,,,,,,,,,,,,,,,2,2,2,2,2,,,,,2,2,2,,,,,,,,,,2,,,,,,,,,,,,2,,1,42,2,,2,,2,,2,,2,,1,1,3,444696,323853,323853,323853,323853,2016/09/29,0,1,222,2,2o50,2,23097.862363537206,29,2,23.097862243652344,20,0,
010010001262A0170131,2,01,AGUASCALIENTES,001,AGUASCALIENTES,0001,AGUASCALIENTES,MC031,1,ENTREVISTA COMPLETA,,3,,,,7,,5,,4,,1,,8,,9,1,40,,,,,,,,,,,,,3,,,,,,,,,,,,,,,,,,,,,,,,,,,,,,,,,,,,,,,,,,,,,,,,,,,,,,,,,,,,,,,,,,,,,,,,,,,,,,,,,,,,,,,,,,,,,,,,,,,,,,,2,,,,,,,,,,,,,,,,,,,,,,,,,,,,,2,2,2,2,2,,,,,2,2,2,,,,,,,,,,1,1,,,,,1,1,,,,1,2,,2,,2,,2,,2,,2,,2,,1,1,,444400,323645,323645,323645,323645,2016/09/29,0,1,222,2,2o50,2,8335.692521135385,28,2,8.335692405700684,20,0,1
01001000127230130091,1,01,AGUASCALIENTES,001,AGUASCALIENTES,0001,AGUASCALIENTES,MC035,1,ENTREVISTA COMPLETA,,3,,,2,,4,,3,,1,,9,,9,,2,4,,,,,,,,,,,,,3,,,,,,,,,,,,,,,,,,,,,,,,,,,,,,,,,,,,,,,,,,,,,,,,,,,,,,,,,,,,,,,,,,,,,,,,,,,,,,,,,,,,,,,,,,,,,,,,,,,,,,,2,,,,,,,,,,,,,,,,,,,,,,,,,,,,,2,2,2,2,2,,,,,2,2,2,,,,,,,,,,1,2,,,,,,2,,,,,2,,2,,2,,1,78,2,,2,,2,,1,1,98,437325,324065,324065,324065,324065,2016/09/29,0,1,223,2,2o71,2,2289.507243606877,47,1,2.2895071506500244,40,0,0
01001000127230070011,2,01,AGUASCALIENTES,001,AGUASCALIENTES,0001,AGUASCALIENTES,MC031,1,ENTREVISTA COMPLETA,,3,,,7,,5,,4,,1,,8,,9,,1,30,,,,,,,,,,,,,3,,,,,,,,,,,,,,,,,,,,,,,,,,,,,,,,,,,,,,,,,,,,,,,,,,,,,,,,,,,,,,,,,,,,,,,,,,,,,,,,,,,,,,,,,,,,,,,,,,,,,,,2,,,,,,,,,,,,,,,,,,,,,,,,,,,,,2,2,2,2,2,,,,,2,2,2,,,,,,,,,,2,,,,,,,,,,,,2,,2,,1,55,1,62,2,,2,,2,,1,1,,444396,323639,323639,323639,323639,2016/09/29,0,1,223,2,2o71,2,3581.02415025691,47,1,3.581024169921875,40,0,
010010001262A0130151,2,01,AGUASCALIENTES,001,AGUASCALIENTES,0001,AGUASCALIENTES,MC033,1,ENTREVISTA COMPLETA,,3,,,,4,,4,,5,,1,,9,,9,2,7,2,,,,,,,,,,,,3,,,,,,,,,,,,,,,,,,,,,,,,,,,,,,,,,,,,,,,,,,,,,,,,,,,,,,,,,,,,,,,,,,,,,,,,,,,,,,,,,,,,,,,,,,,,,,,,,,,,,,,2,,,,,,,,,,,,,,,,,,,,,,,,,,,,,2,2,2,2,2,,,,,2,2,2,,,,,,,,,,2,,,,,,,,,,,,2,,2,,2,,2,,2,,2,,2,,1,1,3,444700,323855,323855,323855,323855,2016/09/29,0,1,222,2,2o50,2,9239.14494541488,28,2,9.239145278930664,20,0,
01001000127230130051,1,01,AGUASCALIENTES,001,AGUASCALIENTES,0001,AGUASCALIENTES,MC035,1,ENTREVISTA COMPLETA,,3,,,6,,6,,4,,1,,9,,8,,2,20,2,,,,,,,,,,,,1,,4,36,,4,1,1,,,,,,,,,,,,,,,2,1,GLIBENCLAMIDA,1,METFORMINA,1,99,,,,,,,,,,,,,1,,,,,,,,,,,1,0,0,0,0,0,0,0,,,,,,,,,,,,,,,,1,,EVITAR REFRESCOS,2,2,2,2,2,2,2,2,2,2,2,0,2,0,0,2,0,2,2,2,2,2,2,2,2,2,,,,,,,,,,,,,,,,,,,,,,,,,,,,,1,2,2,2,2,,,,,1,2,2,,1,,,,,,,,1,2,,,,,,2,,,,,2,,2,,2,,2,,1,,2,,2,,1,1,1,437320,324062,324062,324062,324062,2016/09/29,0,1,223,2,2o71,2,4579.014487213754,41,1,4.579014301300049,40,1,0
010010001262A0170191,1,01,AGUASCALIENTES,001,AGUASCALIENTES,0001,AGUASCALIENTES,MC031,1,ENTREVISTA COMPLETA,,3,,,4,,4,,5,,1,,8,,8,,3,,,,,,,,,,,,,,3,,,,,,,,,,,,,,,,,,,,,,,,,,,,,,,,,,,,,,,,,,,,,,,,,,,,,,,,,,,,,,,,,,,,,,,,,,,,,,,,,,,,,,,,,,,,,,,,,,,,,,,2,,,,,,,,,,,,,,,,,,,,,,,,,,,,,2,2,2,2,2,,,,,2,2,2,,,,,,,,,,2,,,,,,,,,,,,2,,1,58,1,58,2,,1,48,2,,2,,1,1,5,444399,323643,323643,323643,323643,2016/09/29,0,1,222,2,2o50,2,7778.83440779431,49,1,7.778834342956543,40,0,
010010001209A0310031,1,01,AGUASCALIENTES,001,AGUASCALIENTES,0001,AGUASCALIENTES,MC031,1,ENTREVISTA COMPLETA,,3,,,,4,,4,,4,,1,,8,,9,2,5,2,,,,,,,,,,,,3,,,,,,,,,,,,,,,,,,,,,,,,,,,,,,,,,,,,,,,,,,,,,,,,,,,,,,,,,,,,,,,,,,,,,,,,,,,,,,,,,,,,,,,,,,,,,,,,,,,,,,,1,4,0,3,,1,12,1,,,,,,,,,,,,,1,,,,,,,3,12,2,2,2,2,2,,,,,2,2,2,,,,,,,,,,1,1,,,,,1,2,,,,,2,,2,,2,,2,,2,,9,,2,,1,1,,444385,323627,323627,323627,323627,2016/09/29,0,1,223,2,2o72,2,3756.176878057567,87,2,3.7561769485473633,80,0,1
010010001262A0280511,3,01,AGUASCALIENTES,001,AGUASCALIENTES,0001,AGUASCALIENTES,MC035,1,ENTREVISTA COMPLETA,,3,,,,3,,3,,3,,1,,9,,7,3,,,,,,,,,,,,,,3,,,,,,,,,,,,,,,,,,,,,,,,,,,,,,,,,,,,,,,,,,,,,,,,,,,,,,,,,,,,,,,,,,,,,,,,,,,,,,,,,,,,,,,,,,,,,,,,,,,,,,,2,,,,,,,,,,,,,,,,,,,,,,,,,,,,,2,2,2,2,2,,,,,2,2,2,,,,,,,,,,2,,,,,,,,,,,,2,,2,,2,,2,,1,,1,,2,,2,1,,437323,324064,324064,324064,324064,2016/09/29,0,1,222,2,2o50,2,30001.28122963795,21,2,30.00128173828125,20,0,
01001000127230320431,1,01,AGUASCALIENTES,001,AGUASCALIENTES,0001,AGUASCALIENTES,MC031,1,ENTREVISTA COMPLETA,,3,,,,6,,3,,3,,1,,8,,8,2,2,,,,,,,,,,,,,3,,,,,,,,,,,,,,,,,,,,,,,,,,,,,,,,,,,,,,,,,,,,,,,,,,,,,,,,,,,,,,,,,,,,,,,,,,,,,,,,,,,,,,,,,,,,,,,,,,,,,,,2,,,,,,,,,,,,,,,,,,,,,,,,,,,,,2,2,2,2,2,,,,,1,2,2,,,,,,,,1,,1,1,,1,,,,2,,,,,2,,2,,1,76,1,76,2,,2,,1,80,1,2,,444390,323631,323631,323631,323631,2016/09/29,0,1,223,2,2o71,2,5382.494049696174,46,2,5.38249397277832,40,0,1
010010001209A0260141,1,01,AGUASCALIENTES,001,AGUASCALIENTES,0001,AGUASCALIENTES,MC033,1,ENTREVISTA COMPLETA,,3,,,5,,5,,3,,1,,6,,7,,3,,,,,,,,,,,,,,1,,16,52,,3,1,1,,,,,,,,,,,,,,,2,1,SIBET METFORMINA 850MG TABLETAS,1,GLIBENCLAMIDA 5MG,1,99,,,,,,,,,,,1,,,,,,,,,1,,,,,0,0,0,1,0,0,0,,,1,,,,,,,,,,,,,,,,2,2,2,2,2,2,2,2,2,2,2,0,2,0,0,2,0,2,2,2,2,2,2,2,2,1,0,6,,,1,12,1,,,,,,,,,,,,,,,,,,,1,3,12,2,2,2,2,2,,,,,2,1,2,,,,,,1,,,,1,2,,,,,,2,,,,,2,,9,,9,,9,,2,,9,,1,,1,2,98,444685,323843,323843,323843,323843,2016/09/29,0,1,223,2,2o72,2,18107.26515193282,68,1,18.10726547241211,60,1,0
010010001262A0280291,1,01,AGUASCALIENTES,001,AGUASCALIENTES,0001,AGUASCALIENTES,MC035,1,ENTREVISTA COMPLETA,,3,,,,8,,5,,4,,1,,8,,9,1,7,,,,,,,,,,,,,3,,,,,,,,,,,,,,,,,,,,,,,,,,,,,,,,,,,,,,,,,,,,,,,,,,,,,,,,,,,,,,,,,,,,,,,,,,,,,,,,,,,,,,,,,,,,,,,,,,,,,,,2,,,,,,,,,,,,,,,,,,,,,,,,,,,,,2,2,2,2,2,,,,,1,2,2,,,,,,,,1,,2,,,,,,,,,,,,2,,1,99,9,,9,,2,,1,,2,,1,2,,437326,324066,324066,324066,324066,2016/09/29,0,1,222,2,2o50,2,5123.860990953105,45,2,5.123860836029053,40,0,
010010001209A0260041,1,01,AGUASCALIENTES,001,AGUASCALIENTES,0001,AGUASCALIENTES,MC033,1,ENTREVISTA COMPLETA,,3,,,3,,3,,3,,1,,7,,9,,1,3,,,,,,,,,,,,,3,,,,,,,,,,,,,,,,,,,,,,,,,,,,,,,,,,,,,,,,,,,,,,,,,,,,,,,,,,,,,,,,,,,,,,,,,,,,,,,,,,,,,,,,,,,,,,,,,,,,,,,2,,,,,,,,,,,,,,,,,,,,,,,,,,,,,2,2,2,2,2,,,,,2,2,2,,,,,,,,,,1,2,,,,,,2,,,,,2,,2,,2,,1,45,1,,1,,2,,1,2,3,444684,323844,323844,323844,323844,2016/09/29,0,1,223,2,2o72,2,33599.8541230134,62,1,33.599853515625,60,0,0
010010001262A0280211,1,01,AGUASCALIENTES,001,AGUASCALIENTES,0001,AGUASCALIENTES,MC035,1,ENTREVISTA COMPLETA,,3,,,4,,4,,4,,1,,9,,9,,1,10,,,,,,,,,,,,,3,,,,,,,,,,,,,,,,,,,,,,,,,,,,,,,,,,,,,,,,,,,,,,,,,,,,,,,,,,,,,,,,,,,,,,,,,,,,,,,,,,,,,,,,,,,,,,,,,,,,,,,2,,,,,,,,,,,,,,,,,,,,,,,,,,,,,1,1,2,2,2,,1,37,2,2,1,2,,,,,,,,1,,1,2,,,,,,1,1,,,,2,,2,,2,,2,,1,,1,,2,,1,2,3,437318,324059,324059,324059,324059,2016/09/29,0,1,222,2,2o50,2,13998.536901120831,39,1,13.998537063598633,30,0,0
01001000127230010011,1,01,AGUASCALIENTES,001,AGUASCALIENTES,0001,AGUASCALIENTES,MC033,1,ENTREVISTA COMPLETA,,3,,,4,,4,,7,,6,,9,,9,,2,10,2,,,,,,,,,,,,3,,,,,,,,,,,,,,,,,,,,,,,,,,,,,,,,,,,,,,,,,,,,,,,,,,,,,,,,,,,,,,,,,,,,,,,,,,,,,,,,,,,,,,,,,,,,,,,,,,,,,,,2,,,,,,,,,,,,,,,,,,,,,,,,,,,,,2,2,2,2,2,,,,,2,2,2,,,,,,,,,,1,2,,,,,,2,,,,,2,,2,,2,,2,,1,,1,,2,,1,2,98,444686,323852,323852,323852,323852,2016/09/29,0,1,223,2,2o71,2,7574.846340131841,60,1,7.574846267700195,60,0,0