folio,INT,entidad,desc_ent,munici,desc_mun,locali,desc_loc,maq,completa,n_comp,ob_ser,u401,u401esp,u402,u402esp,u403,u405a,u405b,u405c,u405d,u405e,u405f,u405g,u405h,u405esp,u501,u501a,u502,u505,u506a,u506b,u509a,u509b,u511a,u511b,u512,u513,u601a,u602,u603,u603a,u605a,u701,u702,u703,u703esp,u704a,u801,u810,u810a,TIEMPO_GEN,ORIGEN,est_var,region_h,code_upm,rural,a301,a401,a607,a609,ponde_f,c1,edad,sexo,llegada1,llegada2,t_llegada,esperar1,esperar2,t_espera,consulta1,consulta2,t_consulta,PRESTADOR,PRESTADOR2,CALIDAD,medicamentos
010010001209A0020131,1,01,AGUASCALIENTES,001,AGUASCALIENTES,0001,AGUASCALIENTES,MC035,1,ENTREVISTA COMPLETA,,10,,6,,2,0,0,0,1,0,0,0,0,,1,11,1,50,,5,,1,,40,2,,3,1,1,3,1000,1,1,7,PRIVADO,400,2,4,8,2016/09/29,0,223,2,2o72,2,1,2,1,1,39401.40897060581,1,67,1,0,5,5,0,1,1,0,40,40,4,4,3,3
010010001209A0020161,1,01,AGUASCALIENTES,001,AGUASCALIENTES,0001,AGUASCALIENTES,MC035,1,ENTREVISTA COMPLETA,,1,,8,,1,0,0,0,0,0,0,1,0,POR CAMPA�A,2,10,2,7777,99,99,,5,99,99,2,,0,,,,,2,,,,,2,3,8,2016/09/29,0,223,2,2o72,2,3,2,2,1,8123.698063519684,1,55,1,,,,0,5,5,,,,1,1,2,0
010010001209A0080071,2,01,AGUASCALIENTES,001,AGUASCALIENTES,0001,AGUASCALIENTES,MC033,1,ENTREVISTA COMPLETA,,1,,5,,3,1,0,0,0,0,0,0,0,,2,10,1,7777,,5,,30,,30,2,,0,,,,,1,1,1,,,9,4,6,2016/09/29,0,223,2,2o72,2,3,2,1,1,17990.99961848397,1,44,2,0,5,5,0,30,30,0,30,30,1,1,3,0
010010001209A0080101,1,01,AGUASCALIENTES,001,AGUASCALIENTES,0001,AGUASCALIENTES,MC033,1,ENTREVISTA COMPLETA,,10,,6,,3,0,0,0,0,0,0,1,0,POR EL SEGURO DE GASTOS MEDICOS,1,11,1,7777,,15,,10,,30,1,99,0,,,,,1,1,1,,,2,4,10,2016/09/29,0,223,2,2o72,2,3,2,1,2,8995.499809241985,1,47,2,0,15,15,0,10,10,0,30,30,4,4,3,0
010010001209A0210011,1,01,AGUASCALIENTES,001,AGUASCALIENTES,0001,AGUASCALIENTES,MC031,1,ENTREVISTA COMPLETA,,10,,5,,2,0,0,1,0,0,0,0,0,,1,10,1,7777,,10,,20,,25,1,700,0,,,,,1,1,1,,700,2,4,8,2016/09/29,0,223,2,2o72,2,3,2,1,1,3546.7448705806305,1,55,2,0,10,10,0,20,20,0,25,25,4,4,3,0
010010001209A0260141,1,01,AGUASCALIENTES,001,AGUASCALIENTES,0001,AGUASCALIENTES,MC033,1,ENTREVISTA COMPLETA,,1,,5,,1,1,0,0,0,0,0,0,0,,2,10,1,7777,,10,,30,,20,2,,8,1,1,1,,1,1,1,,,2,5,10,2016/09/29,0,223,2,2o72,2,1,1,2,2,18107.26515193282,1,68,1,0,10,10,0,30,30,0,20,20,1,1,3,3
010010001209A0310011,2,01,AGUASCALIENTES,001,AGUASCALIENTES,0001,AGUASCALIENTES,MC031,1,ENTREVISTA COMPLETA,,10,,6,,2,0,0,0,1,0,0,0,0,,1,11,1,7777,,15,,10,,30,2,,3,1,1,1,150,1,2,,,,2,4,10,2016/09/29,0,223,2,2o72,2,3,1,2,2,11268.530634172701,1,69,2,0,15,15,0,10,10,0,30,30,4,4,3,3
010010001209A0310031,1,01,AGUASCALIENTES,001,AGUASCALIENTES,0001,AGUASCALIENTES,MC031,1,ENTREVISTA COMPLETA,,1,,5,,1,1,0,0,0,0,0,0,0,,1,1,1,7777,,10,,15,,20,2,,1,1,1,1,,1,1,1,,,4,3,7,2016/09/29,0,223,2,2o72,2,3,1,1,2,3756.176878057567,1,87,2,0,10,10,0,15,15,0,20,20,1,1,2,1
010010001209A0310131,1,01,AGUASCALIENTES,001,AGUASCALIENTES,0001,AGUASCALIENTES,MC031,1,ENTREVISTA COMPLETA,,7,,5,,2,1,0,0,0,0,0,0,0,,1,7,2,7777,,10,1,30,,10,2,,1,1,1,1,,2,,,,,3,4,10,2016/09/29,0,223,2,2o72,2,3,1,2,2,3756.176878057567,1,83,2,0,10,10,60,30,90,0,10,10,3,3,3,1
010010001262A0010211,1,01,AGUASCALIENTES,001,AGUASCALIENTES,0001,AGUASCALIENTES,MC035,1,ENTREVISTA COMPLETA,,1,,5,,2,1,0,0,0,0,0,0,0,,2,10,1,100,,30,1,30,,45,2,,4,1,1,1,,2,,,,,2,4,7,2016/09/29,0,222,2,2o50,2,3,1,0,0,11939.338747507218,1,74,1,0,30,30,60,30,90,0,45,45,1,1,3,3
010010001262A0080121,1,01,AGUASCALIENTES,001,AGUASCALIENTES,0001,AGUASCALIENTES,MC033,1,ENTREVISTA COMPLETA,,7,,5,,2,1,0,0,0,0,0,0,0,,2,10,2,30,,20,1,30,,30,2,,2,1,2,,,2,,,,,2,3,8,2016/09/29,0,222,2,2o50,2,3,2,1,2,9118.029986609405,1,41,2,0,20,20,60,30,90,0,30,30,3,3,2,2
010010001262A0080251,2,01,AGUASCALIENTES,001,AGUASCALIENTES,0001,AGUASCALIENTES,MC033,1,ENTREVISTA COMPLETA,,1,,5,,2,1,0,0,0,0,0,0,0,,2,10,1,12,,15,,5,,10,2,,2,4,1,1,,2,,,,,1,4,7,2016/09/29,0,222,2,2o50,2,3,1,2,2,9976.082037605704,1,58,2,0,15,15,0,5,5,0,10,10,1,1,3,2
010010001262A0130041,1,01,AGUASCALIENTES,001,AGUASCALIENTES,0001,AGUASCALIENTES,MC033,1,ENTREVISTA COMPLETA,,1,,5,,1,1,0,0,0,0,0,0,0,,2,11,1,7777,,20,1,,,30,2,,8,1,1,1,,2,,,,,3,4,7,2016/09/29,0,222,2,2o50,2,3,1,1,2,3452.8547447681394,1,52,2,0,20,20,60,0,60,0,30,30,1,1,3,3
010010001262A0130311,1,01,AGUASCALIENTES,001,AGUASCALIENTES,0001,AGUASCALIENTES,MC033,1,ENTREVISTA COMPLETA,,7,,5,,2,1,0,0,0,0,0,0,0,,2,1,2,7777,,5,,1,12,,2,,0,,,,,2,,,,,4,4,10,2016/09/29,0,222,2,2o50,2,3,1,1,1,3693.4584164986577,1,68,2,0,5,5,0,1,1,720,0,720,3,3,3,0
010010001262A0170051,1,01,AGUASCALIENTES,001,AGUASCALIENTES,0001,AGUASCALIENTES,MC031,1,ENTREVISTA COMPLETA,,10,,6,,2,0,0,0,0,1,0,0,0,,1,11,1,700,,20,,10,,30,1,700,0,,,,,1,1,1,,1800,2,5,10,2016/09/29,0,222,2,2o50,2,3,2,1,1,3115.2163585023354,1,64,2,0,20,20,0,10,10,0,30,30,4,4,3,0
010010001262A0170081,1,01,AGUASCALIENTES,001,AGUASCALIENTES,0001,AGUASCALIENTES,MC031,1,ENTREVISTA COMPLETA,,7,,5,,1,0,1,1,0,0,0,0,0,,1,10,1,30,,10,3,,,30,2,,4,1,3,1,30,1,2,,,,2,2,9,2016/09/29,0,222,2,2o50,2,3,1,1,1,7638.079348225571,1,56,1,0,10,10,180,0,180,0,30,30,3,3,1,3
010010001262A0170131,2,01,AGUASCALIENTES,001,AGUASCALIENTES,0001,AGUASCALIENTES,MC031,1,ENTREVISTA COMPLETA,,1,,5,,4,1,0,0,0,0,0,0,0,,2,10,2,7777,,5,2,,,15,2,,2,1,1,1,,2,,,,,2,3,5,2016/09/29,0,222,2,2o50,2,3,2,1,1,8335.692521135385,1,28,2,0,5,5,120,0,120,0,15,15,1,1,2,2
010010001262A0220031,1,01,AGUASCALIENTES,001,AGUASCALIENTES,0001,AGUASCALIENTES,MC031,1,ENTREVISTA COMPLETA,,1,,5,,4,1,0,0,0,0,0,0,0,,2,11,1,7777,,30,,30,,20,2,,1,1,1,1,,1,1,1,,,2,3,6,2016/09/29,0,222,2,2o50,2,1,2,0,0,4909.022547217855,1,63,2,0,30,30,0,30,30,0,20,20,1,1,2,1
010010001262A0220151,1,01,AGUASCALIENTES,001,AGUASCALIENTES,0001,AGUASCALIENTES,MC031,1,ENTREVISTA COMPLETA,,1,,5,,3,1,0,0,0,0,0,0,0,,2,10,1,18,,5,1,,,15,2,,2,1,1,1,,2,,,,,2,4,8,2016/09/29,0,222,2,2o50,2,3,1,1,1,4486.792973608785,1,45,2,0,5,5,60,0,60,0,15,15,1,1,3,2
010010001262A0280211,1,01,AGUASCALIENTES,001,AGUASCALIENTES,0001,AGUASCALIENTES,MC035,1,ENTREVISTA COMPLETA,,7,,5,,5,1,0,0,0,0,0,0,0,,2,11,2,7777,,15,5,,,15,2,,2,1,3,3,60,2,,,,,3,4,2,2016/09/29,0,222,2,2o50,2,3,2,2,1,13998.536901120831,1,39,1,0,15,15,300,0,300,0,15,15,3,3,3,2
010010001262A0280431,2,01,AGUASCALIENTES,001,AGUASCALIENTES,0001,AGUASCALIENTES,MC035,1,ENTREVISTA COMPLETA,,1,,5,,5,1,0,0,0,0,0,0,0,,1,11,1,20,,5,1,,,30,2,,3,1,1,1,,2,,,,,2,5,10,2016/09/29,0,222,2,2o50,2,3,1,0,0,11993.370091930477,1,74,2,0,5,5,60,0,60,0,30,30,1,1,3,3
01001000127230010131,1,01,AGUASCALIENTES,001,AGUASCALIENTES,0001,AGUASCALIENTES,MC033,1,ENTREVISTA COMPLETA,,1,,6,,1,1,0,0,0,0,0,0,0,,2,10,1,6,,30,,30,,10,2,,2,1,1,1,,2,,,,,2,2,6,2016/09/29,0,223,2,2o71,2,3,1,1,2,1624.1635629168545,1,52,2,0,30,30,0,30,30,0,10,10,1,1,1,2
01001000127230070361,1,01,AGUASCALIENTES,001,AGUASCALIENTES,0001,AGUASCALIENTES,MC031,1,ENTREVISTA COMPLETA,,1,,5,,2,1,0,0,0,0,0,0,0,,1,99,1,7777,,15,,15,,15,2,,2,1,1,1,,1,1,1,,,2,4,10,2016/09/29,0,223,2,2o71,2,1,2,1,1,2308.6163513781516,1,65,2,0,15,15,0,15,15,0,15,15,1,1,3,2
01001000127230130051,1,01,AGUASCALIENTES,001,AGUASCALIENTES,0001,AGUASCALIENTES,MC035,1,ENTREVISTA COMPLETA,,1,,5,,2,1,0,0,0,0,0,0,0,,2,10,1,50,1,15,2,,,15,2,,2,1,1,1,,1,1,1,,,3,4,7,2016/09/29,0,223,2,2o71,2,1,2,2,2,4579.014487213754,1,41,1,60,15,75,120,0,120,0,15,15,1,1,3,2
01001000127230130241,1,01,AGUASCALIENTES,001,AGUASCALIENTES,0001,AGUASCALIENTES,MC035,1,ENTREVISTA COMPLETA,,1,,5,,2,1,0,0,0,0,0,0,0,,2,99,1,7777,,15,,30,,30,2,,6,1,1,1,,2,,,,,3,4,10,2016/09/29,0,223,2,2o71,2,1,1,1,1,2075.2170794389945,1,79,2,0,15,15,0,30,30,0,30,30,1,1,3,3
01001000127230220391,2,01,AGUASCALIENTES,001,AGUASCALIENTES,0001,AGUASCALIENTES,MC033,1,ENTREVISTA COMPLETA,,3,,6,,3,1,0,0,0,0,0,0,0,,2,11,1,7777,,10,,10,,30,2,,6,1,1,1,,1,1,1,,,3,4,9,2016/09/29,0,223,2,2o71,2,1,1,2,1,9577.924982026128,1,67,2,0,10,10,0,10,10,0,30,30,2,2,3,3
01001000127230320011,1,01,AGUASCALIENTES,001,AGUASCALIENTES,0001,AGUASCALIENTES,MC031,1,ENTREVISTA COMPLETA,,8,,5,,2,1,0,0,0,0,0,0,0,,1,10,1,7777,,30,1,,,30,2,,4,1,1,1,,1,1,1,,,2,3,8,2016/09/29,0,223,2,2o71,2,1,1,1,1,5382.494049696174,1,45,2,0,30,30,60,0,60,0,30,30,3,6,2,3
01001000127230320101,1,01,AGUASCALIENTES,001,AGUASCALIENTES,0001,AGUASCALIENTES,MC031,1,ENTREVISTA COMPLETA,,7,,5,,2,1,0,0,0,0,0,0,0,,1,7,2,7777,,30,2,,,30,2,,2,1,1,1,,1,1,1,,,2,4,10,2016/09/29,0,223,2,2o71,2,1,1,2,1,9877.65886386694,1,61,1,0,30,30,120,0,120,0,30,30,3,3,3,2
01001000127230320181,1,01,AGUASCALIENTES,001,AGUASCALIENTES,0001,AGUASCALIENTES,MC031,1,ENTREVISTA COMPLETA,,1,,5,,2,1,0,0,0,0,0,0,0,,1,1,2,7777,,20,,40,,20,2,,0,,,,,2,,,,,2,4,10,2016/09/29,0,223,2,2o71,2,3,2,1,2,9305.232577585419,1,30,2,0,20,20,0,40,40,0,20,20,1,1,3,0
01001000127230320431,1,01,AGUASCALIENTES,001,AGUASCALIENTES,0001,AGUASCALIENTES,MC031,1,ENTREVISTA COMPLETA,,1,,5,,1,1,0,0,0,0,0,0,0,,1,10,2,15,,5,,10,,20,2,,3,1,1,1,,1,1,1,,,3,5,10,2016/09/29,0,223,2,2o71,2,3,2,1,2,5382.494049696174,1,46,2,0,5,5,0,10,10,0,20,20,1,1,3,3
01001000127230380011,1,01,AGUASCALIENTES,001,AGUASCALIENTES,0001,AGUASCALIENTES,MC035,1,ENTREVISTA COMPLETA,,1,,5,,2,1,0,0,0,0,0,0,0,,1,10,1,7777,,5,,20,,15,2,,1,1,1,1,,2,,,,,2,4,7,2016/09/29,0,223,2,2o71,2,3,1,2,2,3176.81749823355,1,47,1,0,5,5,0,20,20,0,15,15,1,1,3,1
01001000127230380181,2,01,AGUASCALIENTES,001,AGUASCALIENTES,0001,AGUASCALIENTES,MC035,1,ENTREVISTA COMPLETA,,1,,9,,2,1,0,0,0,0,0,0,0,,2,7,2,7777,,30,2,,,30,2,,2,4,1,1,,1,2,,,,3,3,5,2016/09/29,0,223,2,2o71,2,3,2,1,2,10279.594455767683,1,32,2,0,30,30,120,0,120,0,30,30,1,1,2,2
02002000143500020021,1,02,BAJA CALIFORNIA,002,MEXICALI,0001,MEXICALI,MC005,1,ENTREVISTA COMPLETA,,8,,5,,2,1,1,0,0,0,0,0,0,,2,11,1,7777,,5,,20,,15,2,,1,1,1,1,,2,,,,,2,5,9,2016/09/29,0,122,1,1a45,2,3,2,1,2,15360.433039304093,1,41,1,0,5,5,0,20,20,0,15,15,3,6,3,1
02002000143500020111,1,02,BAJA CALIFORNIA,002,MEXICALI,0001,MEXICALI,MC005,1,ENTREVISTA COMPLETA,,1,,5,,1,1,0,0,0,0,0,0,0,,2,10,1,12,,30,,10,,15,2,,7,1,1,1,,2,,,,,1,5,8,2016/09/29,0,122,1,1a45,2,1,1,2,2,3936.9473045289546,1,62,2,0,30,30,0,10,10,0,15,15,1,1,3,3
02002000143500020131,1,02,BAJA CALIFORNIA,002,MEXICALI,0001,MEXICALI,MC005,1,ENTREVISTA COMPLETA,,8,,5,,1,0,0,1,0,0,0,0,0,,2,1,1,50,,30,1,30,,15,2,,1,2,1,1,,2,,,,,2,4,10,2016/09/29,0,122,1,1a45,2,1,2,2,2,12242.45041135243,1,63,1,0,30,30,60,30,90,0,15,15,3,6,3,1
02002000143500070241,1,02,BAJA CALIFORNIA,002,MEXICALI,0001,MEXICALI,MC005,1,ENTREVISTA COMPLETA,,1,,5,,2,1,0,0,0,0,0,0,0,,2,10,1,26,,20,2,,,20,2,,3,1,1,1,,2,,,,,2,4,8,2016/09/29,0,122,1,1a45,2,3,1,1,2,11960.820858521301,1,57,2,0,20,20,120,0,120,0,20,20,1,1,3,3
02002000143500070281,1,02,BAJA CALIFORNIA,002,MEXICALI,0001,MEXICALI,MC005,1,ENTREVISTA COMPLETA,,1,,5,,3,1,0,0,0,0,0,0,0,,2,10,1,52,,45,,30,,10,2,,4,2,1,1,,2,,,,,2,3,8,2016/09/29,0,122,1,1a45,2,3,2,2,1,12397.910099115637,1,50,1,0,45,45,0,30,30,0,10,10,1,1,2,3
02002000143500130051,1,02,BAJA CALIFORNIA,002,MEXICALI,0001,MEXICALI,MC003,1,ENTREVISTA COMPLETA,,7,,5,,3,0,0,0,1,0,0,0,0,,1,10,1,300,,40,,10,,40,1,300,0,,,,,2,,,,,3,4,9,2016/09/29,0,122,1,1a45,2,3,1,0,0,10558.545631300418,1,72,1,0,40,40,0,10,10,0,40,40,3,3,3,0
02002000143500130071,2,02,BAJA CALIFORNIA,002,MEXICALI,0001,MEXICALI,MC003,1,ENTREVISTA COMPLETA,,1,,5,,3,1,0,0,0,0,0,0,0,,1,9,1,7777,,30,,20,,20,2,,1,2,1,1,,1,1,1,,,3,2,5,2016/09/29,0,122,1,1a45,2,1,1,1,2,6026.506814748131,1,68,2,0,30,30,0,20,20,0,20,20,1,1,1,1
02002000143500130171,2,02,BAJA CALIFORNIA,002,MEXICALI,0001,MEXICALI,MC003,1,ENTREVISTA COMPLETA,,1,,6,,2,1,0,0,0,0,0,0,0,,2,1,1,7777,1,,2,,99,99,2,,0,,,,,2,,,,,2,2,6,2016/09/29,0,122,1,1a45,2,1,2,0,0,9064.809762446901,1,65,2,60,0,60,120,0,120,,,,1,1,1,0
02002000143500270031,3,02,BAJA CALIFORNIA,002,MEXICALI,0001,MEXICALI,MC003,1,ENTREVISTA COMPLETA,,1,,5,,1,1,0,0,0,0,0,0,0,,2,99,1,7777,,20,,20,,20,2,,4,1,1,1,,1,1,2,,,2,5,10,2016/09/29,0,122,1,1a45,2,3,1,1,1,10923.836563153978,1,69,2,0,20,20,0,20,20,0,20,20,1,1,3,3
02002000143500340031,1,02,BAJA CALIFORNIA,002,MEXICALI,0001,MEXICALI,MC001,1,ENTREVISTA COMPLETA,,3,,5,,2,1,0,0,0,0,0,0,0,,2,11,1,100,,30,3,,,30,2,,3,1,1,1,,2,,,,,2,4,8,2016/09/29,0,122,1,1a45,2,1,1,2,2,3608.8683624848745,1,64,2,0,30,30,180,0,180,0,30,30,2,2,3,3
02002000143500340061,1,02,BAJA CALIFORNIA,002,MEXICALI,0001,MEXICALI,MC001,1,ENTREVISTA COMPLETA,,10,,5,,2,0,0,0,0,1,1,0,0,,1,11,2,7777,,15,,1,1,,1,40,2,2,1,1,215,2,,,,,2,4,10,2016/09/29,0,122,1,1a45,2,3,2,1,3,7040.198476347708,1,43,1,0,15,15,0,1,1,60,0,60,4,4,3,2
02002000143500340081,1,02,BAJA CALIFORNIA,002,MEXICALI,0001,MEXICALI,MC001,1,ENTREVISTA COMPLETA,,7,,6,,2,1,0,0,0,0,0,0,0,,2,99,1,7777,,20,,20,,30,2,,2,1,1,1,,1,1,1,,,2,4,9,2016/09/29,0,122,1,1a45,2,3,2,1,1,14080.396952695415,1,42,1,0,20,20,0,20,20,0,30,30,3,3,3,2
02002012435799990011,1,02,BAJA CALIFORNIA,002,MEXICALI,0124,CAMPO LA CURVA (COLONIA SILVA),MC001,1,ENTREVISTA COMPLETA,,1,,5,,2,1,0,0,0,0,0,0,0,,1,10,1,150,,20,,1,,15,2,,5,2,1,1,,1,2,,,,2,4,8,2016/09/29,0,111,1,1o01,1,3,1,2,2,189.76371982817594,1,82,2,0,20,20,0,1,1,0,15,15,1,1,3,3
02002012435799990021,2,02,BAJA CALIFORNIA,002,MEXICALI,0124,CAMPO LA CURVA (COLONIA SILVA),MC001,1,ENTREVISTA COMPLETA,,7,,5,,2,0,1,0,0,0,0,0,0,,1,99,1,50,,10,,1,,30,2,,3,1,1,1,,2,,,,,2,4,10,2016/09/29,0,111,1,1o01,1,3,1,1,1,1289.0927501176354,1,49,2,0,10,10,0,1,1,0,30,30,3,3,3,3
02002012435799990031,2,02,BAJA CALIFORNIA,002,MEXICALI,0124,CAMPO LA CURVA (COLONIA SILVA),MC001,1,ENTREVISTA COMPLETA,,7,,5,,3,1,1,0,0,0,0,0,0,,1,7,1,50,,10,,30,,10,1,10,1,1,1,1,,1,2,,,,3,3,1,2016/09/29,0,111,1,1o01,1,3,1,1,2,859.3951667450901,1,39,2,0,10,10,0,30,30,0,10,10,3,3,2,1
02002012435799990071,1,02,BAJA CALIFORNIA,002,MEXICALI,0124,CAMPO LA CURVA (COLONIA SILVA),MC003,1,ENTREVISTA COMPLETA,,1,,8,,1,1,0,0,0,0,0,0,0,,2,7,1,7777,,30,2,,,30,2,,2,1,1,1,,1,1,2,,,2,4,9,2016/09/29,0,111,1,1o01,1,3,1,0,0,320.9993291117701,1,86,1,0,30,30,120,0,120,0,30,30,1,1,3,2
02002012435799990111,1,02,BAJA CALIFORNIA,002,MEXICALI,0124,CAMPO LA CURVA (COLONIA SILVA),MC005,1,ENTREVISTA COMPLETA,,7,,5,,1,1,0,0,0,0,0,0,0,,1,11,1,7777,,30,,1,,25,2,,2,1,1,1,,1,2,,,,2,5,8,2016/09/29,0,111,1,1o01,1,3,1,2,2,943.9618117353446,1,44,1,0,30,30,0,1,1,0,25,25,3,3,3,2
020020167348A9990051,2,02,BAJA CALIFORNIA,002,MEXICALI,0167,EJIDO DISTRITO FEDERAL,MC001,1,ENTREVISTA COMPLETA,,1,,8,,3,1,0,0,0,0,0,0,0,,2,7,2,7777,,5,,30,,15,2,,3,1,1,1,,1,1,1,,,2,3,5,2016/09/29,0,112,1,1o31,1,3,1,2,1,583.1364830332028,1,39,2,0,5,5,0,30,30,0,15,15,1,1,2,3
020020167348A9990091,2,02,BAJA CALIFORNIA,002,MEXICALI,0167,EJIDO DISTRITO FEDERAL,MC005,1,ENTREVISTA COMPLETA,,7,,5,,3,1,0,0,0,0,0,0,0,,1,11,1,100,,20,,20,,40,2,,0,,,,,1,1,2,,,3,4,9,2016/09/29,0,112,1,1o31,1,3,2,1,1,1076.9148318811976,1,29,2,0,20,20,0,20,20,0,40,40,3,3,3,0
020020167348A9990101,2,02,BAJA CALIFORNIA,002,MEXICALI,0167,EJIDO DISTRITO FEDERAL,MC005,1,ENTREVISTA COMPLETA,,77,DIF,8,,2,0,0,1,0,0,0,0,0,,1,1,1,7777,,10,,30,,30,1,10,2,1,1,1,,2,,,,,9,4,10,2016/09/29,0,112,1,1o31,1,1,2,0,0,814.8689290985975,1,52,2,0,10,10,0,30,30,0,30,30,5,8,3,2
020020167348A9990121,2,02,BAJA CALIFORNIA,002,MEXICALI,0167,EJIDO DISTRITO FEDERAL,MC005,1,ENTREVISTA COMPLETA,,1,,5,,2,1,0,0,0,0,0,0,0,,2,10,1,7777,,15,,30,,30,2,,8,1,1,1,,1,1,7,LABORATORIO PARTICULAR,600,2,2,10,2016/09/29,0,112,1,1o31,1,3,2,1,2,583.1364830332028,1,37,2,0,15,15,0,30,30,0,30,30,1,1,1,3
020020167348A9990151,1,02,BAJA CALIFORNIA,002,MEXICALI,0167,EJIDO DISTRITO FEDERAL,MC003,1,ENTREVISTA COMPLETA,,10,,5,,1,0,0,0,0,1,0,0,0,,1,11,1,700,,40,1,,,40,1,700,0,,,,,1,1,7,SANGRE,300,2,4,9,2016/09/29,0,112,1,1o31,1,1,2,1,2,1346.00824085511,1,50,1,0,40,40,60,0,60,0,40,40,4,4,3,0
02002017035799990011,4,02,BAJA CALIFORNIA,002,MEXICALI,0170,EL NACAY EL�AS (COLONIA EL�AS),MC001,1,ENTREVISTA COMPLETA,,7,,5,,3,0,1,0,0,0,0,0,0,,1,1,1,7777,,20,,15,,30,2,,2,1,1,1,,1,1,2,,,3,3,7,2016/09/29,0,111,1,1o01,1,3,2,1,2,1683.3778930631258,1,21,2,0,20,20,0,15,15,0,30,30,3,3,2,2
02002017035799990031,1,02,BAJA CALIFORNIA,002,MEXICALI,0170,EL NACAY EL�AS (COLONIA EL�AS),MC001,1,ENTREVISTA COMPLETA,,7,,5,,4,0,0,0,0,0,0,1,0,PORQUE LE QUITARON EL IMSS Y ES EL UNICO QUE TIENE,2,1,2,200,,25,6,,,5,2,,3,1,2,,,2,,,,,3,4,1,2016/09/29,0,111,1,1o01,1,3,1,1,2,355.8069746778298,1,85,2,0,25,25,360,0,360,0,5,5,3,3,3,3
02002017035799990081,2,02,BAJA CALIFORNIA,002,MEXICALI,0170,EL NACAY EL�AS (COLONIA EL�AS),MC003,1,ENTREVISTA COMPLETA,,1,,6,,3,1,0,0,0,0,0,0,0,,2,1,1,7777,1,,1,,,40,2,,1,1,1,1,,2,,,,,3,3,5,2016/09/29,0,111,1,1o01,1,3,1,0,0,3222.7318752940882,1,47,2,60,0,60,60,0,60,0,40,40,1,1,2,1
02002025535799990031,1,02,BAJA CALIFORNIA,002,MEXICALI,0255,COLONIA PESCADEROS (CAMPO LA CATORCE),MC003,1,ENTREVISTA COMPLETA,,1,,5,,2,0,0,0,0,0,0,0,1,,2,1,1,7777,,30,1,,15,,2,,0,,,,,2,,,,,2,3,7,2016/09/29,0,111,1,1o01,1,3,1,0,0,1336.069025840795,1,47,1,0,30,30,60,0,60,900,0,900,1,1,2,0
02002025535799990061,1,02,BAJA CALIFORNIA,002,MEXICALI,0255,COLONIA PESCADEROS (CAMPO LA CATORCE),MC005,1,ENTREVISTA COMPLETA,,1,,8,,2,0,1,1,0,0,0,0,0,,2,11,1,7777,,5,,10,,20,2,,1,1,1,1,,2,,,,,2,4,10,2016/09/29,0,111,1,1o01,1,3,1,0,0,201.44148720221753,1,78,2,0,5,5,0,10,10,0,20,20,1,1,3,1
02002025535799990151,1,02,BAJA CALIFORNIA,002,MEXICALI,0255,COLONIA PESCADEROS (CAMPO LA CATORCE),MC001,1,ENTREVISTA COMPLETA,,7,,5,,3,1,1,0,0,0,0,0,0,,2,1,1,7777,,5,,30,,20,2,,3,2,1,1,,2,,,,,2,3,6,2016/09/29,0,111,1,1o01,1,1,1,0,0,201.44148720221753,1,68,2,0,5,5,0,30,30,0,20,20,3,3,2,3
020020270348A9990091,1,02,BAJA CALIFORNIA,002,MEXICALI,0270,EJIDO QUINTANA ROO,MC005,1,ENTREVISTA COMPLETA,,3,,5,,2,1,0,0,0,0,0,0,0,,2,11,1,100,,30,,20,,15,2,,2,2,1,1,,2,,,,,2,4,8,2016/09/29,0,112,1,1o31,1,1,2,2,1,2765.5974889630807,1,51,1,0,30,30,0,20,20,0,15,15,2,2,3,2
020020270348A9990101,2,02,BAJA CALIFORNIA,002,MEXICALI,0270,EJIDO QUINTANA ROO,MC005,1,ENTREVISTA COMPLETA,,1,,5,,1,1,0,0,0,0,0,0,0,,1,11,1,200,1,,,20,,20,2,,15,1,1,1,,1,2,,,,2,5,10,2016/09/29,0,112,1,1o31,1,3,1,1,1,2268.751500437651,1,65,2,60,0,60,0,20,20,0,20,20,1,1,3,3
020020270348A9990151,1,02,BAJA CALIFORNIA,002,MEXICALI,0270,EJIDO QUINTANA ROO,MC003,1,ENTREVISTA COMPLETA,,7,,5,,3,0,0,1,0,0,0,0,0,,1,1,2,7777,,15,5,,,30,2,,1,1,1,1,,2,,,,,3,4,7,2016/09/29,0,112,1,1o31,1,1,2,0,0,1260.6814765756023,1,82,2,0,15,15,300,0,300,0,30,30,3,3,3,1
020020521348A9990081,2,02,BAJA CALIFORNIA,002,MEXICALI,0521,POBLADO FRANCISCO SANTANA PERALTA,MC005,1,ENTREVISTA COMPLETA,,7,,5,,1,1,0,0,0,0,0,0,0,,2,11,2,30,,10,1,,,20,2,,2,1,1,1,,1,1,1,,,2,4,9,2016/09/29,0,112,1,1o31,1,3,2,2,1,2271.4776978422847,1,34,2,0,10,10,60,0,60,0,20,20,3,3,3,2
020020521348A9990091,1,02,BAJA CALIFORNIA,002,MEXICALI,0521,POBLADO FRANCISCO SANTANA PERALTA,MC005,1,ENTREVISTA COMPLETA,,7,,5,,2,1,0,0,0,0,0,0,0,,1,10,2,30,,15,,30,,20,2,,1,1,1,1,,2,,,,,2,3,7,2016/09/29,0,112,1,1o31,1,1,2,2,2,2839.061743511762,1,63,1,0,15,15,0,30,30,0,20,20,3,3,2,1
020020521348A9990121,2,02,BAJA CALIFORNIA,002,MEXICALI,0521,POBLADO FRANCISCO SANTANA PERALTA,MC005,1,ENTREVISTA COMPLETA,,1,,6,,1,1,0,0,0,0,0,0,0,,2,11,1,9999,,15,,1,,15,2,,5,1,1,1,,2,,,,,1,5,9,2016/09/29,0,112,1,1o31,1,1,1,2,2,1844.966951138942,1,45,2,0,15,15,0,1,1,0,15,15,1,1,3,3
020020521348A9990161,1,02,BAJA CALIFORNIA,002,MEXICALI,0521,POBLADO FRANCISCO SANTANA PERALTA,MC003,1,ENTREVISTA COMPLETA,,1,,5,,2,1,0,0,0,0,0,0,0,,1,11,2,7777,,20,,20,,30,2,,0,,,,,2,,,,,1,1,7,2016/09/29,0,112,1,1o31,1,1,2,0,0,1892.707829007841,1,56,1,0,20,20,0,20,20,0,30,30,1,1,1,0
020040001393A0060031,1,02,BAJA CALIFORNIA,004,TIJUANA,0001,TIJUANA,MC003,1,ENTREVISTA COMPLETA,,77,ISTECALI,5,,5,1,0,0,0,0,0,0,0,,1,11,2,7777,,30,1,,,2,2,,1,2,1,1,,1,1,1,,,3,3,5,2016/09/29,0,123,1,1o61,2,3,1,1,1,5096.25256588201,1,51,2,0,30,30,60,0,60,0,2,2,5,8,2,1
020040001393A0260061,1,02,BAJA CALIFORNIA,004,TIJUANA,0001,TIJUANA,MC003,1,ENTREVISTA COMPLETA,AUSENCIA DE OCUPANTES DEL HOGAR,1,,5,,2,1,0,0,0,0,0,0,0,,2,11,2,7777,1,,1,,,30,2,,0,,,,,2,,,,,9,3,7,2016/09/29,0,123,1,1o61,2,1,1,0,0,26176.868083917907,1,52,1,60,0,60,60,0,60,0,30,30,1,1,2,0
020040001393A0340341,1,02,BAJA CALIFORNIA,004,TIJUANA,0001,TIJUANA,MC005,1,ENTREVISTA COMPLETA,,9,,5,,1,0,0,1,1,0,0,0,0,,2,11,2,7777,,10,,30,,20,1,30,1,1,1,1,60,2,,,,,1,5,10,2016/09/29,0,123,1,1o61,2,3,2,1,1,37705.33317750177,1,66,1,0,10,10,0,30,30,0,20,20,4,7,3,1
02004000139970010111,1,02,BAJA CALIFORNIA,004,TIJUANA,0001,TIJUANA,MC005,1,ENTREVISTA COMPLETA,,9,,5,,2,0,1,1,0,0,0,0,0,,1,1,2,7777,,10,,5,,10,1,80,4,1,1,1,500,1,2,,,,2,3,8,2016/09/29,0,123,1,1o62,2,3,1,1,2,26758.415173037112,1,52,2,0,10,10,0,5,5,0,10,10,4,7,2,3
02004000139970010161,2,02,BAJA CALIFORNIA,004,TIJUANA,0001,TIJUANA,MC005,1,ENTREVISTA COMPLETA,,10,,5,,3,0,1,0,0,0,0,0,0,,2,10,2,7777,,3,,15,,10,1,50,1,1,1,4,,1,1,7,LBORATORIO PATICULAR,150,5,3,5,2016/09/29,0,123,1,1o62,2,3,2,1,2,18170.182088258607,1,36,2,0,3,3,0,15,15,0,10,10,4,4,2,1
02004000139970010381,1,02,BAJA CALIFORNIA,004,TIJUANA,0001,TIJUANA,MC005,1,ENTREVISTA COMPLETA,,77,MEDICO PARTICULAR ESTADOS UNIDOS,5,,1,0,0,1,0,1,0,0,0,,1,11,1,300,2,,,10,,30,2,,7,1,1,3,,1,1,7,LABORATORIO PARTICULAR,,2,5,10,2016/09/29,0,123,1,1o62,2,1,1,2,2,12164.839918367621,1,80,1,120,0,120,0,10,10,0,30,30,5,8,3,3
02004000139970130451,2,02,BAJA CALIFORNIA,004,TIJUANA,0001,TIJUANA,MC005,1,ENTREVISTA COMPLETA,,1,,5,,1,1,1,0,0,0,0,0,0,,2,11,1,20,,30,1,,,15,2,,3,1,1,1,,1,2,,,,2,5,10,2016/09/29,0,123,1,1o62,2,3,1,1,2,23216.232622220396,1,63,2,0,30,30,60,0,60,0,15,15,1,1,3,3
02004000139970130541,1,02,BAJA CALIFORNIA,004,TIJUANA,0001,TIJUANA,MC005,1,ENTREVISTA COMPLETA,,1,,5,,3,1,0,0,0,0,0,0,0,,2,11,1,20,,30,1,30,,5,2,,8,1,1,1,,2,,,,,3,4,6,2016/09/29,0,123,1,1o62,2,3,1,1,1,44234.22188003936,1,45,1,0,30,30,60,30,90,0,5,5,1,1,3,3
02004000139970340091,1,02,BAJA CALIFORNIA,004,TIJUANA,0001,TIJUANA,MC001,1,ENTREVISTA COMPLETA,,9,,5,,2,0,0,0,1,0,0,0,0,,1,11,2,50,,30,1,,,20,1,45,0,,,,,1,2,,,,2,4,8,2016/09/29,0,123,1,1o62,2,3,1,1,1,27114.727354351042,1,48,1,0,30,30,60,0,60,0,20,20,4,7,3,0
02004000139970340191,1,02,BAJA CALIFORNIA,004,TIJUANA,0001,TIJUANA,MC001,1,ENTREVISTA COMPLETA,,9,,5,,2,0,0,0,1,0,0,0,0,,1,1,1,7777,,5,,30,,20,1,35,2,1,1,1,170,1,2,,,,2,4,10,2016/09/29,0,123,1,1o62,2,3,1,2,2,35640.605550712935,1,62,1,0,5,5,0,30,30,0,20,20,4,7,3,2
02004000139970340291,1,02,BAJA CALIFORNIA,004,TIJUANA,0001,TIJUANA,MC001,1,ENTREVISTA COMPLETA,,1,,6,,2,1,0,0,0,0,0,0,0,,2,10,1,50,,5,1,,,15,2,,1,1,1,1,,1,1,2,,,2,4,10,2016/09/29,0,123,1,1o62,2,3,2,2,1,19409.120738359823,1,69,1,0,5,5,60,0,60,0,15,15,1,1,3,1
02004000153150030031,2,02,BAJA CALIFORNIA,004,TIJUANA,0001,TIJUANA,MC005,1,ENTREVISTA COMPLETA,,1,,6,,2,1,0,1,0,0,0,0,0,,2,10,1,50,1,,3,,,15,2,,3,1,1,1,,1,2,,,,2,3,8,2016/09/29,0,122,1,1o44,2,3,1,2,1,4620.364285898295,1,48,2,60,0,60,180,0,180,0,15,15,1,1,2,3
02004000153150030381,2,02,BAJA CALIFORNIA,004,TIJUANA,0001,TIJUANA,MC005,1,ENTREVISTA COMPLETA,,1,,5,,1,1,0,0,0,0,0,0,0,,2,11,2,50,,20,,30,,20,2,,4,1,1,1,,1,2,,,,2,4,9,2016/09/29,0,122,1,1o44,2,3,1,2,2,4620.364285898295,1,35,2,0,20,20,0,30,30,0,20,20,1,1,3,3
02004000153150080071,3,02,BAJA CALIFORNIA,004,TIJUANA,0001,TIJUANA,MC003,1,ENTREVISTA COMPLETA,,7,,8,,1,1,0,0,0,0,0,0,0,,1,99,1,7777,,10,,30,,15,2,,0,,,,,2,,,,,9,4,8,2016/09/29,0,122,1,1o44,2,3,1,1,2,15821.140935080073,1,53,2,0,10,10,0,30,30,0,15,15,3,3,3,0
02004000153150080141,2,02,BAJA CALIFORNIA,004,TIJUANA,0001,TIJUANA,MC003,1,ENTREVISTA COMPLETA,,7,,8,,1,0,1,0,0,0,0,0,0,,1,7,2,7777,,30,2,,,45,2,,4,2,3,3,190,2,,,,,2,1,9,2016/09/29,0,122,1,1o44,2,3,1,2,2,7126.440755591278,1,67,2,0,30,30,120,0,120,0,45,45,3,3,1,3
02004000153150290021,1,02,BAJA CALIFORNIA,004,TIJUANA,0001,TIJUANA,MC001,1,ENTREVISTA COMPLETA,,7,,5,,3,1,0,0,0,0,0,0,0,,2,11,1,40,,20,3,,,15,2,,3,2,1,1,,1,1,1,,,2,3,8,2016/09/29,0,122,1,1o44,2,1,2,1,1,9233.596787063185,1,56,1,0,20,20,180,0,180,0,15,15,3,3,2,3
02004000153150360241,1,02,BAJA CALIFORNIA,004,TIJUANA,0001,TIJUANA,MC005,1,ENTREVISTA COMPLETA,,3,,5,,2,1,0,0,0,0,0,0,0,,2,11,1,50,,15,1,,,15,2,,7,4,3,3,150,2,,,,,2,4,7,2016/09/29,0,122,1,1o44,2,1,1,0,0,5615.989002967615,1,49,2,0,15,15,60,0,60,0,15,15,2,2,3,3
02004190382010040161,2,02,BAJA CALIFORNIA,004,TIJUANA,1903,VILLA DEL PRADO,MC003,1,ENTREVISTA COMPLETA,AUSENCIA DE OCUPANTES EN EL MOMENTO DE LA VISITA,7,,5,,2,0,1,0,0,0,0,0,0,,1,1,2,7777,,40,2,,,15,2,,2,1,2,,,2,,,,,3,4,8,2016/09/29,0,122,1,1o45,2,3,1,0,0,9050.458468186349,1,40,2,0,40,40,120,0,120,0,15,15,3,3,3,2