idinsert,folio,intp,entidad,desc_ent,munici,desc_mun,locali,desc_loc,inth,maq,completa,sexo,edad,meses,intsel,intsel2,emb,temb,sistol3,diastol3,sistol4,diastol4,tbrazo,htension,rtension,tiempo_gen,origen,c1,est_var,region_h,code_upm,rural,ponde_f,a401,a402a,a402b,a403,a404,a405,a405b,a406a,a406b,a406c,a406d,a406e,a406f,a406g,a406h,a406i,a406j,a406k,a406l,a406esp,a407a,a407b,a407c,a407d,a407e,a407f,a407g,a408a,a408b,vmerge,prom_pas,prom_pad,hta_val,hta_dx,edad_cat,hta_tota,hta_control
1083390,010010001209A0020131,1,01,AGUASCALIENTES,001,AGUASCALIENTES,0001,AGUASCALIENTES,1,MC036,1,1,67,6,1,,,,97,53,103,55,1,19:30,1,2016/09/29,0,1,223,2,2o72,2,43631.61721191897,2,,,,,,,,,,,,,,,,,,,,,,,,,,,,,3,100,54,0,0,5,0,
1083393,010010001209A0020161,1,01,AGUASCALIENTES,001,AGUASCALIENTES,0001,AGUASCALIENTES,1,MC036,1,1,55,3,1,10,,,128,78,126,76,1,20:40,1,2016/09/29,0,1,223,2,2o72,2,10382.290205380154,2,,,,,,,,,,,,,,,,,,,,,,,,,,,,,3,127,77,0,0,4,0,
1082667,010010001209A0080071,2,01,AGUASCALIENTES,001,AGUASCALIENTES,0001,AGUASCALIENTES,2,MC034,1,2,44,0,1,,4,,113,69,112,70,1,20:37,1,2016/09/29,0,1,223,2,2o72,2,21597.966180859727,2,,,,,,,,,,,,,,,,,,,,,,,,,,,,,3,112.5,69.5,0,0,3,0,
1082738,010010001209A0080101,1,01,AGUASCALIENTES,001,AGUASCALIENTES,0001,AGUASCALIENTES,1,MC034,2,2,47,1,1,,4,,101,65,95,62,1,12:45,1,2016/09/29,0,1,223,2,2o72,2,10798.983090429863,2,,,,,,,,,,,,,,,,,,,,,,,,,,,,,3,98,63.5,0,0,3,0,
1083478,010010001209A0120041,1,01,AGUASCALIENTES,001,AGUASCALIENTES,0001,AGUASCALIENTES,1,MC036,1,1,36,3,1,,,,138,100,148,104,1,09:04,1,2016/09/29,0,1,223,2,2o72,2,4470.168996268715,2,,,,,,,,,,,,,,,,,,,,,,,,,,,,,3,143,102,1,1,2,1,0
1083394,010010001209A0120121,1,01,AGUASCALIENTES,001,AGUASCALIENTES,0001,AGUASCALIENTES,1,MC036,1,2,86,2,1,,,,131,75,130,79,1,12:50,1,2016/09/29,0,1,223,2,2o72,2,9877.056183398372,2,,,,,,,,,,,,,,,,,,,,,,,,,,,,,3,130.5,77,0,0,99,0,
1083397,010010001209A0120171,2,01,AGUASCALIENTES,001,AGUASCALIENTES,0001,AGUASCALIENTES,2,MC036,1,2,63,3,1,10,,,125,68,116,67,1,13:30,1,2016/09/29,0,1,223,2,2o72,2,16814.67538728165,2,,,,,,,,,,,,,,,,,,,,,,,,,,,,,3,120.5,67.5,0,0,5,0,
1082049,010010001209A0210011,1,01,AGUASCALIENTES,001,AGUASCALIENTES,0001,AGUASCALIENTES,1,MC032,1,2,55,5,1,10,,,114,61,110,66,1,11:35,1,2016/09/29,0,1,223,2,2o72,2,3880.309704757303,2,,,,,,,,,,,,,,,,,,,,,,,,,,,,,3,112,63.5,0,0,4,0,
1082097,010010001209A0210051,1,01,AGUASCALIENTES,001,AGUASCALIENTES,0001,AGUASCALIENTES,1,MC032,1,1,60,5,1,10,,,102,56,101,57,1,19:34,1,2016/09/29,0,1,223,2,2o72,2,7046.803306819106,2,,,,,,,,,,,,,,,,,,,,,,,,,,,,,3,101.5,56.5,0,0,5,0,
1082098,010010001209A0210081,1,01,AGUASCALIENTES,001,AGUASCALIENTES,0001,AGUASCALIENTES,1,MC032,1,2,56,7,1,,,,90,58,91,59,1,20:34,1,2016/09/29,0,1,223,2,2o72,2,3880.309704757303,2,,,,,,,,,,,,,,,,,,,,,,,,,,,,,3,90.5,58.5,0,0,4,0,
1082046,010010001209A0210121,2,01,AGUASCALIENTES,001,AGUASCALIENTES,0001,AGUASCALIENTES,2,MC032,1,2,44,5,1,10,4,,84,50,83,,1,17:05,1,2016/09/29,0,1,223,2,2o72,2,14427.791173448804,2,,,,,,,,,,,,,,,,,,,,,,,,,,,,,3,,,,,3,,
1082652,010010001209A0260041,1,01,AGUASCALIENTES,001,AGUASCALIENTES,0001,AGUASCALIENTES,1,MC034,1,1,62,2,1,,,,115,66,115,63,1,11:50,1,2016/09/29,0,1,223,2,2o72,2,42941.45765092893,2,,,,,,,,,,,,,,,,,,,,,,,,,,,,,3,115,64.5,0,0,5,0,
1082655,010010001209A0260141,1,01,AGUASCALIENTES,001,AGUASCALIENTES,0001,AGUASCALIENTES,1,MC034,1,1,68,10,1,10,,,149,72,147,69,1,19:14,1,2016/09/29,0,1,223,2,2o72,2,20051.29467459512,1,,6,,,1,12,1,,,,,,,,,,,,,,,,,,,1,3,12,3,148,70.5,1,2,5,1,0
1082100,010010001209A0310011,2,01,AGUASCALIENTES,001,AGUASCALIENTES,0001,AGUASCALIENTES,2,MC032,1,2,69,8,1,,,,102,59,93,57,1,15:40,1,2016/09/29,0,1,223,2,2o72,2,13239.45828838505,1,6,,2,,1,1,,,,,,,,,,1,,,,,,,,,,1,1,1,3,97.5,58,0,2,5,1,1
1082044,010010001209A0310031,1,01,AGUASCALIENTES,001,AGUASCALIENTES,0001,AGUASCALIENTES,1,MC032,1,2,87,5,1,,,,125,71,115,75,1,12:50,1,2016/09/29,0,1,223,2,2o72,2,4413.152762795016,1,4,,3,,1,12,1,,,,,,,,,,,,,1,,,,,,,3,12,3,120,73,0,2,99,1,1
1082042,010010001209A0310071,2,01,AGUASCALIENTES,001,AGUASCALIENTES,0001,AGUASCALIENTES,2,MC032,1,2,45,0,1,10,4,,104,66,101,67,1,18:10,1,2016/09/29,0,1,223,2,2o72,2,27934.659506039177,2,,,,,,,,,,,,,,,,,,,,,,,,,,,,,3,102.5,66.5,0,0,3,0,
1082059,010010001209A0310131,1,01,AGUASCALIENTES,001,AGUASCALIENTES,0001,AGUASCALIENTES,1,MC032,1,2,83,8,1,,,,128,57,119,56,1,19:30,1,2016/09/29,0,1,223,2,2o72,2,4413.152762795016,1,,12,2,,1,12,,,,,,,,,,,1,,SEGURO POPULAR,,,,,,,1,3,12,3,123.5,56.5,0,2,99,1,1
1083440,010010001262A0010211,1,01,AGUASCALIENTES,001,AGUASCALIENTES,0001,AGUASCALIENTES,1,MC036,1,1,74,2,1,10,,,157,97,159,92,1,14:00,1,2016/09/29,0,1,222,2,2o50,2,16565.341747736424,1,,71,,,1,,1,,,,,,,,,1,,,,,,,,,,1,1,7,3,158,94.5,1,2,6,1,0
1082709,010010001262A0080121,1,01,AGUASCALIENTES,001,AGUASCALIENTES,0001,AGUASCALIENTES,1,MC034,1,2,41,10,1,,4,,109,70,108,77,1,13:52,1,2016/09/29,0,1,222,2,2o50,2,10005.448905781243,2,,,,,,,,,,,,,,,,,,,,,,,,,,,,,3,108.5,73.5,0,0,3,0,
1082736,010010001262A0080251,2,01,AGUASCALIENTES,001,AGUASCALIENTES,0001,AGUASCALIENTES,2,MC034,1,2,58,2,1,10,,,127,77,213,84,1,19:12,1,2016/09/29,0,1,222,2,2o50,2,10580.129024292684,1,6,,3,,1,4,1,,,,,,,,,,,,,,,,,,1,,3,4,3,170,80.5,1,2,4,1,0
1082745,010010001262A0080311,2,01,AGUASCALIENTES,001,AGUASCALIENTES,0001,AGUASCALIENTES,2,MC034,1,2,28,8,1,12,2,,144,77,147,74,1,09:13,1,2016/09/29,0,1,222,2,2o50,2,14827.819697208866,2,,,,,,,,,,,,,,,,,,,,,,,,,,,,,3,145.5,75.5,1,1,1,1,0
1082728,010010001262A0080371,1,01,AGUASCALIENTES,001,AGUASCALIENTES,0001,AGUASCALIENTES,1,MC034,1,1,25,8,1,,,,121,79,116,77,1,20:24,1,2016/09/29,0,1,222,2,2o50,2,11811.922741423183,2,,,,,,,,,,,,,,,,,,,,,,,,,,,,,3,118.5,78,0,0,1,0,
1082727,010010001262A0080441,1,01,AGUASCALIENTES,001,AGUASCALIENTES,0001,AGUASCALIENTES,1,MC034,1,2,76,8,1,10,,,144,68,144,63,1,18:11,1,2016/09/29,0,1,222,2,2o50,2,6173.532451262419,2,,,,,,,,,,,,,,,,,,,,,,,,,,,,,3,144,65.5,1,1,6,1,0
1082726,010010001262A0130041,1,01,AGUASCALIENTES,001,AGUASCALIENTES,0001,AGUASCALIENTES,1,MC034,1,2,52,0,1,,,,120,77,122,71,1,13:52,1,2016/09/29,0,1,222,2,2o50,2,3661.9234449034097,1,4,,2,,2,,,,,,,,,,,,,,,,,,,,,,3,1,3,121,74,0,2,4,1,1
1082722,010010001262A0130151,2,01,AGUASCALIENTES,001,AGUASCALIENTES,0001,AGUASCALIENTES,2,MC034,1,2,28,10,1,,4,,94,68,90,63,1,16:01,1,2016/09/29,0,1,222,2,2o50,2,10264.211421493463,2,,,,,,,,,,,,,,,,,,,,,,,,,,,,,3,92,65.5,0,0,1,0,
1082737,010010001262A0130201,1,01,AGUASCALIENTES,001,AGUASCALIENTES,0001,AGUASCALIENTES,1,MC034,1,1,56,2,1,10,,,136,88,135,95,1,17:07,1,2016/09/29,0,1,222,2,2o50,2,5822.859040476992,2,,,,,,,,,,,,,,,,,,,,,,,,,,,,,3,135.5,91.5,1,1,4,1,0
1082702,010010001262A0130261,4,01,AGUASCALIENTES,001,AGUASCALIENTES,0001,AGUASCALIENTES,4,MC034,1,2,29,6,1,10,4,,110,59,106,,1,07:25,1,2016/09/29,0,1,222,2,2o50,2,25660.52855373366,2,,,,,,,,,,,,,,,,,,,,,,,,,,,,,3,,,,,1,,
1082108,010010001262A0170051,1,01,AGUASCALIENTES,001,AGUASCALIENTES,0001,AGUASCALIENTES,1,MC032,1,2,64,11,1,,,,161,85,157,91,1,20:05,1,2016/09/29,0,1,222,2,2o50,2,3303.841216150655,2,,,,,,,,,,,,,,,,,,,,,,,,,,,,,3,159,88,1,1,5,1,0
1082093,010010001262A0170081,1,01,AGUASCALIENTES,001,AGUASCALIENTES,0001,AGUASCALIENTES,1,MC032,1,1,56,8,1,10,,,126,93,124,89,1,08:08,1,2016/09/29,0,1,222,2,2o50,2,10506.938216055894,1,3,,,,1,,,,,,,,1,,,,,,,,,,,,,1,3,2,3,125,91,1,2,4,1,0
1082075,010010001262A0170131,2,01,AGUASCALIENTES,001,AGUASCALIENTES,0001,AGUASCALIENTES,2,MC032,1,2,28,11,1,12,4,,117,67,119,67,1,12:23,1,2016/09/29,0,1,222,2,2o50,2,9260.52257941424,2,,,,,,,,,,,,,,,,,,,,,,,,,,,,,3,118,67,0,0,1,0,
1082088,010010001262A0170161,1,01,AGUASCALIENTES,001,AGUASCALIENTES,0001,AGUASCALIENTES,1,MC032,1,2,48,0,1,,4,,136,93,137,97,1,03:55,1,2016/09/29,0,1,222,2,2o50,2,3124.3867069210405,2,,,,,,,,,,,,,,,,,,,,,,,,,,,,,3,136.5,95,1,1,3,1,0
1082070,010010001262A0170191,1,01,AGUASCALIENTES,001,AGUASCALIENTES,0001,AGUASCALIENTES,1,MC032,1,1,49,7,1,,,,166,94,144,95,1,20:40,1,2016/09/29,0,1,222,2,2o50,2,9594.62915189982,2,,,,,,,,,,,,,,,,,,,,,,,,,,,,,3,155,94.5,1,1,3,1,0
1082083,010010001262A0220031,1,01,AGUASCALIENTES,001,AGUASCALIENTES,0001,AGUASCALIENTES,1,MC032,1,2,63,6,1,,,,114,69,111,66,1,12:00,1,2016/09/29,0,1,222,2,2o50,2,5206.261509973727,2,,,,,,,,,,,,,,,,,,,,,,,,,,,,,3,112.5,67.5,0,0,5,0,
1082086,010010001262A0220121,3,01,AGUASCALIENTES,001,AGUASCALIENTES,0001,AGUASCALIENTES,3,MC032,1,2,24,5,1,13,4,,93,63,91,64,1,21:55,1,2016/09/29,0,1,222,2,2o50,2,21889.385315384578,2,,,,,,,,,,,,,,,,,,,,,,,,,,,,,3,92,63.5,0,0,1,0,
1082106,010010001262A0220151,1,01,AGUASCALIENTES,001,AGUASCALIENTES,0001,AGUASCALIENTES,1,MC032,1,2,45,5,1,12,4,,91,57,95,64,1,12:19,1,2016/09/29,0,1,222,2,2o50,2,4923.47337244879,1,,19,1,1,,,,,,,,,,,,,,,,,,,,,,,1,1,3,93,60.5,0,2,3,1,1
1083455,010010001262A0280211,1,01,AGUASCALIENTES,001,AGUASCALIENTES,0001,AGUASCALIENTES,1,MC036,1,1,39,2,1,12,,,117,67,115,65,1,18:42,1,2016/09/29,0,1,222,2,2o50,2,17266.181948912723,2,,,,,,,,,,,,,,,,,,,,,,,,,,,,,3,116,66,0,0,2,0,
1083477,010010001262A0280291,1,01,AGUASCALIENTES,001,AGUASCALIENTES,0001,AGUASCALIENTES,1,MC036,1,2,45,7,1,10,4,,108,74,103,72,1,16:05,1,2016/09/29,0,1,222,2,2o50,2,5622.544499260934,2,,,,,,,,,,,,,,,,,,,,,,,,,,,,,3,105.5,73,0,0,3,0,
1083463,010010001262A0280361,1,01,AGUASCALIENTES,001,AGUASCALIENTES,0001,AGUASCALIENTES,1,MC036,1,1,56,2,1,10,,,122,73,116,67,1,22:45,1,2016/09/29,0,1,222,2,2o50,2,18907.943610148166,2,,,,,,,,,,,,,,,,,,,,,,,,,,,,,3,119,70,0,0,4,0,
1083459,010010001262A0280431,2,01,AGUASCALIENTES,001,AGUASCALIENTES,0001,AGUASCALIENTES,2,MC036,1,2,74,5,1,,,,127,71,126,71,1,14:21,1,2016/09/29,0,1,222,2,2o50,2,13876.823019823956,1,,16,2,,1,3,1,,,,,,,,,,,,,,,,,,,1,3,1,3,126.5,71,0,2,6,1,1
1083467,010010001262A0280511,3,01,AGUASCALIENTES,001,AGUASCALIENTES,0001,AGUASCALIENTES,3,MC036,1,2,21,8,1,,4,,107,77,101,73,1,14:20,1,2016/09/29,0,1,222,2,2o50,2,33329.86929807922,2,,,,,,,,,,,,,,,,,,,,,,,,,,,,,3,104,75,0,0,1,0,
1082656,01001000127230010011,1,01,AGUASCALIENTES,001,AGUASCALIENTES,0001,AGUASCALIENTES,1,MC034,1,1,60,9,1,10,,,134,,127,76,1,17:21,1,2016/09/29,0,1,223,2,2o71,2,8494.15982207352,2,,,,,,,,,,,,,,,,,,,,,,,,,,,,,3,,,,,5,,
1082684,01001000127230010131,1,01,AGUASCALIENTES,001,AGUASCALIENTES,0001,AGUASCALIENTES,1,MC034,1,2,52,9,1,,,,150,84,141,80,1,10:32,1,2016/09/29,0,1,223,2,2o71,2,1559.0979983532147,1,,8,2,,1,12,1,,,,,,,,,,,,,,,,,,,1,1,1,3,145.5,82,1,2,4,1,0
1082664,01001000127230010191,4,01,AGUASCALIENTES,001,AGUASCALIENTES,0001,AGUASCALIENTES,4,MC034,1,1,23,4,1,10,,,117,54,110,58,1,08:12,1,2016/09/29,0,1,223,2,2o71,2,28228.99067992894,2,,,,,,,,,,,,,,,,,,,,,,,,,,,,,3,113.5,56,0,0,1,0,
1082067,01001000127230070011,2,01,AGUASCALIENTES,001,AGUASCALIENTES,0001,AGUASCALIENTES,2,MC032,1,1,47,11,1,10,,,120,76,116,76,1,08:50,1,2016/09/29,0,1,223,2,2o71,2,3028.7631369394603,2,,,,,,,,,,,,,,,,,,,,,,,,,,,,,3,118,76,0,0,3,0,
1082081,01001000127230070101,3,01,AGUASCALIENTES,001,AGUASCALIENTES,0001,AGUASCALIENTES,3,MC032,1,1,23,8,1,10,,,120,88,126,92,1,21:50,1,2016/09/29,0,1,223,2,2o71,2,34379.57805897596,2,,,,,,,,,,,,,,,,,,,,,,,,,,,,,3,123,90,1,1,1,1,0
1082063,01001000127230070361,1,01,AGUASCALIENTES,001,AGUASCALIENTES,0001,AGUASCALIENTES,1,MC032,1,2,65,1,1,,,,190,92,190,90,1,02:55,1,2016/09/29,0,1,223,2,2o71,2,2216.1309455403903,2,,,,,,,,,,,,,,,,,,,,,,,,,,,,,3,190,91,1,1,5,1,0
1082090,01001000127230070541,1,01,AGUASCALIENTES,001,AGUASCALIENTES,0001,AGUASCALIENTES,1,MC032,1,2,30,2,1,10,4,,134,89,143,91,1,21:05,1,2016/09/29,0,1,223,2,2o71,2,5901.90981036006,2,,,,,,,,,,,,,,,,,,,,,,,,,,,,,3,138.5,90,1,1,2,1,0
1083442,01001000127230130011,1,01,AGUASCALIENTES,001,AGUASCALIENTES,0001,AGUASCALIENTES,1,MC036,1,1,47,7,1,10,,,155,97,147,98,1,19:26,1,2016/09/29,0,1,223,2,2o71,2,3872.8446669061955,2,,,,,,,,,,,,,,,,,,,,,,,,,,,,,3,151,97.5,1,1,3,1,0
1083460,01001000127230130051,1,01,AGUASCALIENTES,001,AGUASCALIENTES,0001,AGUASCALIENTES,1,MC036,1,1,41,1,1,13,,,110,60,111,60,1,17:50,1,2016/09/29,0,1,223,2,2o71,2,3872.8446669061955,2,,,,,,,,,,,,,,,,,,,,,,,,,,,,,3,110.5,60,0,0,3,0,
1083476,01001000127230130091,1,01,AGUASCALIENTES,001,AGUASCALIENTES,0001,AGUASCALIENTES,1,MC036,1,1,47,5,1,10,,,143,73,118,71,1,08:30,1,2016/09/29,0,1,223,2,2o71,2,1936.4223334530977,2,,,,,,,,,,,,,,,,,,,,,,,,,,,,,3,130.5,72,0,0,3,0,
1083436,01001000127230130161,1,01,AGUASCALIENTES,001,AGUASCALIENTES,0001,AGUASCALIENTES,1,MC036,1,2,30,8,1,,4,,110,70,109,70,1,21:16,1,2016/09/29,0,1,223,2,2o71,2,7546.70434767352,2,,,,,,,,,,,,,,,,,,,,,,,,,,,,,3,109.5,70,0,0,2,0,
1083462,01001000127230130241,1,01,AGUASCALIENTES,001,AGUASCALIENTES,0001,AGUASCALIENTES,1,MC036,1,2,79,1,1,,,,202,67,194,83,1,20:01,1,2016/09/29,0,1,223,2,2o71,2,2139.3097440240363,1,,8,2,,1,10,1,,,,,,,,,,,,,,,,1,,1,,1,1,3,198,75,1,2,6,1,0
1082681,01001000127230220081,3,01,AGUASCALIENTES,001,AGUASCALIENTES,0001,AGUASCALIENTES,3,MC034,1,1,26,4,1,13,,,111,56,109,56,1,20:40,1,2016/09/29,0,1,223,2,2o71,2,40579.174102397854,2,,,,,,,,,,,,,,,,,,,,,,,,,,,,,3,110,56,0,0,1,0,
1082719,01001000127230220271,1,01,AGUASCALIENTES,001,AGUASCALIENTES,0001,AGUASCALIENTES,1,MC034,1,2,36,0,1,12,4,,114,82,111,78,1,10:06,1,2016/09/29,0,1,223,2,2o71,2,4166.6280139869505,2,,,,,,,,,,,,,,,,,,,,,,,,,,,,,3,112.5,80,0,0,2,0,
1082670,01001000127230220391,2,01,AGUASCALIENTES,001,AGUASCALIENTES,0001,AGUASCALIENTES,2,MC034,1,2,67,1,1,12,,,143,71,139,70,1,07:57,1,2016/09/29,0,1,223,2,2o71,2,9873.737280110938,1,,4,2,,1,12,,,1,,,,,,,,,,,,,,,,,1,3,2,3,141,70.5,1,2,5,1,0
1082089,01001000127230320011,1,01,AGUASCALIENTES,001,AGUASCALIENTES,0001,AGUASCALIENTES,1,MC032,1,2,45,11,1,,4,,114,72,103,69,1,19:00,1,2016/09/29,0,1,223,2,2o71,2,5669.546623137671,1,2,,1,1,,,,,,,,,,,,,,,,,,,,,,,3,6,3,108.5,70.5,0,2,3,1,1
1082053,01001000127230320101,1,01,AGUASCALIENTES,001,AGUASCALIENTES,0001,AGUASCALIENTES,1,MC032,1,1,61,8,1,15,,,128,81,117,74,1,13:40,1,2016/09/29,0,1,223,2,2o71,2,11076.450833476127,1,,2,,,1,4,,,,,,,1,,,,,,,1,,,,,,,3,4,3,122.5,77.5,0,2,5,1,1
1082055,01001000127230320181,1,01,AGUASCALIENTES,001,AGUASCALIENTES,0001,AGUASCALIENTES,1,MC032,1,2,30,6,1,,4,,104,65,115,85,1,02:30,1,2016/09/29,0,1,223,2,2o71,2,9478.919424282914,2,,,,,,,,,,,,,,,,,,,,,,,,,,,,,3,109.5,75,0,0,2,0,
1082077,01001000127230320261,1,01,AGUASCALIENTES,001,AGUASCALIENTES,0001,AGUASCALIENTES,1,MC032,1,2,36,10,1,,4,,99,67,98,71,1,19:55,1,2016/09/29,0,1,223,2,2o71,2,5669.546623137671,2,,,,,,,,,,,,,,,,,,,,,,,,,,,,,3,98.5,69,0,0,2,0,
1082103,01001000127230320351,1,01,AGUASCALIENTES,001,AGUASCALIENTES,0001,AGUASCALIENTES,1,MC032,1,2,34,3,1,,4,,106,67,102,64,1,18:45,1,2016/09/29,0,1,223,2,2o71,2,9478.919424282914,2,,,,,,,,,,,,,,,,,,,,,,,,,,,,,3,104,65.5,0,0,2,0,
1082050,01001000127230320431,1,01,AGUASCALIENTES,001,AGUASCALIENTES,0001,AGUASCALIENTES,1,MC032,1,2,46,7,1,12,4,,110,57,115,59,1,18:00,1,2016/09/29,0,1,223,2,2o71,2,5669.546623137671,2,,,,,,,,,,,,,,,,,,,,,,,,,,,,,3,112.5,58,0,0,3,0,
1082068,01001000127230320511,1,01,AGUASCALIENTES,001,AGUASCALIENTES,0001,AGUASCALIENTES,1,MC032,1,2,29,5,1,10,4,,136,94,135,89,1,11:25,1,2016/09/29,0,1,223,2,2o71,2,9478.919424282914,2,,,,,,,,,,,,,,,,,,,,,,,,,,,,,3,135.5,91.5,1,1,1,1,0
1083399,01001000127230380011,1,01,AGUASCALIENTES,001,AGUASCALIENTES,0001,AGUASCALIENTES,1,MC036,1,1,47,5,1,10,,,149,92,157,92,1,20:45,1,2016/09/29,0,1,223,2,2o71,2,2686.892723341093,1,,1,,,2,,,,,,,,,,,,,,,,,,,,,,3,1,3,153,92,1,2,3,1,0
1083411,01001000127230380101,4,01,AGUASCALIENTES,001,AGUASCALIENTES,0001,AGUASCALIENTES,4,MC036,1,2,25,7,1,,4,,,,103,60,1,19:18,1,2016/09/29,0,1,223,2,2o71,2,26178.670642591143,2,,,,,,,,,,,,,,,,,,,,,,,,,,,,,3,,,,,1,,
1083422,01001000127230380181,2,01,AGUASCALIENTES,001,AGUASCALIENTES,0001,AGUASCALIENTES,2,MC036,1,2,32,7,1,,4,,104,77,103,78,1,15:45,1,2016/09/29,0,1,223,2,2o71,2,10471.468257036458,2,,,,,,,,,,,,,,,,,,,,,,,,,,,,,3,103.5,77.5,0,0,2,0,
1083417,01001000127230380271,2,01,AGUASCALIENTES,001,AGUASCALIENTES,0001,AGUASCALIENTES,2,MC036,1,2,48,7,1,12,4,,119,72,117,72,2,09:45,1,2016/09/29,0,1,223,2,2o71,2,9394.817305422808,2,,,,,,,,,,,,,,,,,,,,,,,,,,,,,3,118,72,0,0,3,0,
1083433,01001000127230380351,2,01,AGUASCALIENTES,001,AGUASCALIENTES,0001,AGUASCALIENTES,2,MC036,1,2,50,2,1,,,,119,71,109,71,1,18:20,1,2016/09/29,0,1,223,2,2o71,2,3368.942649307823,2,,,,,,,,,,,,,,,,,,,,,,,,,,,,,3,114,71,0,0,4,0,
1083435,01001000127230380431,1,01,AGUASCALIENTES,001,AGUASCALIENTES,0001,AGUASCALIENTES,1,MC036,1,1,25,4,1,10,,,120,81,126,77,1,20:46,1,2016/09/29,0,1,223,2,2o71,2,7624.74927401743,2,,,,,,,,,,,,,,,,,,,,,,,,,,,,,3,123,79,0,0,1,0,
1083405,01001000127230380521,2,01,AGUASCALIENTES,001,AGUASCALIENTES,0001,AGUASCALIENTES,2,MC036,1,2,63,9,1,10,,,189,117,190,109,1,15:45,1,2016/09/29,0,1,223,2,2o71,2,6737.885298615646,2,,,,,,,,,,,,,,,,,,,,,,,,,,,,,3,189.5,113,1,1,5,1,0
1074229,02002000143500020021,1,02,BAJA CALIFORNIA,002,MEXICALI,0001,MEXICALI,1,MC006,1,1,41,0,1,,,,120,77,117,75,1,15:43,1,2016/09/29,0,1,122,1,1a45,2,15592.940655413948,2,,,,,,,,,,,,,,,,,,,,,,,,,,,,,3,118.5,76,0,0,3,0,
1074234,02002000143500020091,2,02,BAJA CALIFORNIA,002,MEXICALI,0001,MEXICALI,2,MC006,1,2,46,0,1,,4,,98,58,97,55,1,19:32,1,2016/09/29,0,1,122,1,1a45,2,8322.019125338114,2,,,,,,,,,,,,,,,,,,,,,,,,,,,,,3,97.5,56.5,0,0,3,0,
1074371,02002000143500020111,1,02,BAJA CALIFORNIA,002,MEXICALI,0001,MEXICALI,1,MC006,1,2,62,0,1,10,,,122,73,119,70,1,18:04,1,2016/09/29,0,1,122,1,1a45,2,3854.746964306945,1,,32,1,1,,,,,,,,,,,,,,,,,,,,,,,3,1,3,120.5,71.5,0,2,5,1,1
1074373,02002000143500020131,1,02,BAJA CALIFORNIA,002,MEXICALI,0001,MEXICALI,1,MC006,1,1,63,4,1,10,,,117,65,115,63,1,19:40,1,2016/09/29,0,1,122,1,1a45,2,12136.95432208717,2,,,,,,,,,,,,,,,,,,,,,,,,,,,,,3,116,64,0,0,5,0,
1074250,02002000143500020151,2,02,BAJA CALIFORNIA,002,MEXICALI,0001,MEXICALI,2,MC006,1,2,22,0,1,10,4,,121,72,112,75,1,15:45,1,2016/09/29,0,1,122,1,1a45,2,8452.497910210075,2,,,,,,,,,,,,,,,,,,,,,,,,,,,,,3,116.5,73.5,0,0,1,0,
1074237,02002000143500070081,1,02,BAJA CALIFORNIA,002,MEXICALI,0001,MEXICALI,1,MC006,2,1,23,0,1,12,,,134,91,145,91,1,10:39,1,2016/09/29,0,1,122,1,1a45,2,10724.155678624089,,,,,,,,,,,,,,,,,,,,,,,,,,,,,,1,139.5,91,1,,1,,
1074252,02002000143500070161,1,02,BAJA CALIFORNIA,002,MEXICALI,0001,MEXICALI,1,MC006,1,2,27,8,1,10,4,,85,57,91,52,1,22:12,1,2016/09/29,0,1,122,1,1a45,2,4279.915608503197,2,,,,,,,,,,,,,,,,,,,,,,,,,,,,,3,88,54.5,0,0,1,0,
1074238,02002000143500070241,1,02,BAJA CALIFORNIA,002,MEXICALI,0001,MEXICALI,1,MC006,1,2,57,0,1,,,,140,70,136,72,1,15:00,1,2016/09/29,0,1,122,1,1a45,2,11711.088396323006,1,,1,,,1,6,1,,,,,,,,,,,,,1,,,,,,,3,1,3,138,71,0,2,4,1,1
1074242,02002000143500070281,1,02,BAJA CALIFORNIA,002,MEXICALI,0001,MEXICALI,1,MC006,1,1,50,0,1,10,,,131,81,146,81,1,13:45,1,2016/09/29,0,1,122,1,1a45,2,12291.074376970817,2,,,,,,,,,,,,,,,,,,,,,,,,,,,,,3,138.5,81,0,0,4,0,
1073671,02002000143500130021,3,02,BAJA CALIFORNIA,002,MEXICALI,0001,MEXICALI,3,MC004,1,2,22,9,1,10,4,,102,54,100,53,1,17:36,1,2016/09/29,0,1,122,1,1a45,2,14362.374497836638,2,,,,,,,,,,,,,,,,,,,,,,,,,,,,,3,101,53.5,0,0,1,0,
1073678,02002000143500130051,1,02,BAJA CALIFORNIA,002,MEXICALI,0001,MEXICALI,1,MC004,1,1,72,0,1,,,,181,84,177,71,1,13:40,1,2016/09/29,0,1,122,1,1a45,2,12055.359709826753,1,,70,,,1,2,,,,,,,,,,1,,,,,,,,,,1,2,2,3,179,77.5,1,2,6,1,0
1073762,02002000143500130071,2,02,BAJA CALIFORNIA,002,MEXICALI,0001,MEXICALI,2,MC004,1,2,68,1,1,,,,130,62,131,61,1,14:19,1,2016/09/29,0,1,122,1,1a45,2,6868.275815768003,1,,,2,,1,11,1,,,,,,,,,,,,,,,,,,,1,3,1,3,130.5,61.5,0,2,5,1,1
1073759,02002000143500130091,1,02,BAJA CALIFORNIA,002,MEXICALI,0001,MEXICALI,1,MC004,1,2,49,11,1,10,4,,122,73,128,75,1,09:25,1,2016/09/29,0,1,122,1,1a45,2,4713.555547955734,2,,,,,,,,,,,,,,,,,,,,,,,,,,,,,3,125,74,0,0,3,0,
1073765,02002000143500130131,3,02,BAJA CALIFORNIA,002,MEXICALI,0001,MEXICALI,3,MC004,1,1,31,5,1,,,,117,77,119,79,1,20:30,1,2016/09/29,0,1,122,1,1a45,2,26990.7786949391,2,,,,,,,,,,,,,,,,,,,,,,,,,,,,,3,118,78,0,0,2,0,
1073681,02002000143500130151,1,02,BAJA CALIFORNIA,002,MEXICALI,0001,MEXICALI,1,MC004,1,1,68,9,1,10,,,138,56,127,52,1,16:35,1,2016/09/29,0,1,122,1,1a45,2,8036.906473217836,2,,,,,,,,,,,,,,,,,,,,,,,,,,,,,3,132.5,54,0,0,5,0,
1073676,02002000143500130171,2,02,BAJA CALIFORNIA,002,MEXICALI,0001,MEXICALI,2,MC004,1,2,65,3,1,10,,,126,82,132,94,1,13:28,1,2016/09/29,0,1,122,1,1a45,2,8875.54371723879,2,,,,,,,,,,,,,,,,,,,,,,,,,,,,,3,129,88,0,0,5,0,
1073767,02002000143500130191,1,02,BAJA CALIFORNIA,002,MEXICALI,0001,MEXICALI,1,MC004,1,1,32,1,1,,,,121,78,121,76,1,14:9,1,2016/09/29,0,1,122,1,1a45,2,8996.926231646366,2,,,,,,,,,,,,,,,,,,,,,,,,,,,,,3,121,77,0,0,2,0,
1073095,02002000143500190011,1,02,BAJA CALIFORNIA,002,MEXICALI,0001,MEXICALI,1,MC002,2,1,39,2,1,12,,,136,73,131,76,1,17:15,1,2016/09/29,0,1,122,1,1a45,2,10005.470253890617,2,,,,,,,,,,,,,,,,,,,,,,,,,,,,,3,133.5,74.5,0,0,2,0,
1073105,02002000143500190021,2,02,BAJA CALIFORNIA,002,MEXICALI,0001,MEXICALI,2,MC002,1,2,23,3,1,12,4,,119,71,120,72,1,17:25,1,2016/09/29,0,1,122,1,1a45,2,5423.686159051466,2,,,,,,,,,,,,,,,,,,,,,,,,,,,,,3,119.5,71.5,0,0,1,0,
1073098,02002000143500190041,1,02,BAJA CALIFORNIA,002,MEXICALI,0001,MEXICALI,1,MC002,1,1,40,4,1,,,,133,74,135,75,1,18:35,1,2016/09/29,0,1,122,1,1a45,2,10005.470253890617,2,,,,,,,,,,,,,,,,,,,,,,,,,,,,,3,134,74.5,0,0,3,0,
1073101,02002000143500190051,2,02,BAJA CALIFORNIA,002,MEXICALI,0001,MEXICALI,2,MC002,1,1,30,1,1,,,,123,54,122,,1,12:49,1,2016/09/29,0,1,122,1,1a45,2,20385.140751177692,2,,,,,,,,,,,,,,,,,,,,,,,,,,,,,3,,,,,2,,
1073690,02002000143500270021,2,02,BAJA CALIFORNIA,002,MEXICALI,0001,MEXICALI,2,MC004,1,2,49,9,1,,4,,124,74,122,79,1,18:40,1,2016/09/29,0,1,122,1,1a45,2,5695.959756898087,2,,,,,,,,,,,,,,,,,,,,,,,,,,,,,3,123,76.5,0,0,3,0,
1073685,02002000143500270031,3,02,BAJA CALIFORNIA,002,MEXICALI,0001,MEXICALI,3,MC004,1,2,69,3,1,12,,,103,57,100,57,1,19:39,1,2016/09/29,0,1,122,1,1a45,2,12449.65363658158,1,,13,2,,1,12,1,,,,,,,,,,,,,,,,,,,1,3,12,3,101.5,57,0,2,5,1,1
1073205,02002000143500340031,1,02,BAJA CALIFORNIA,002,MEXICALI,0001,MEXICALI,1,MC002,1,2,64,9,1,10,,,110,79,111,78,1,19:38,1,2016/09/29,0,1,122,1,1a45,2,3533.5180506146994,1,,3,2,,1,12,,,1,,,,,,,,,,,,,,,,,1,3,1,3,110.5,78.5,0,2,5,1,1
1073108,02002000143500340051,1,02,BAJA CALIFORNIA,002,MEXICALI,0001,MEXICALI,1,MC002,1,1,26,0,1,12,,,141,68,138,65,1,21:13,1,2016/09/29,0,1,122,1,1a45,2,29121.629644539542,2,,,,,,,,,,,,,,,,,,,,,,,,,,,,,3,139.5,66.5,0,0,1,0,
1073103,02002000143500340061,1,02,BAJA CALIFORNIA,002,MEXICALI,0001,MEXICALI,1,MC002,1,1,43,5,1,10,,,115,69,125,74,1,16:40,1,2016/09/29,0,1,122,1,1a45,2,7146.764467064725,2,,,,,,,,,,,,,,,,,,,,,,,,,,,,,3,120,71.5,0,0,3,0,
1073203,02002000143500340081,1,02,BAJA CALIFORNIA,002,MEXICALI,0001,MEXICALI,1,MC002,1,1,42,2,1,10,,,126,79,114,80,1,16:20,1,2016/09/29,0,1,122,1,1a45,2,14293.52893412945,2,,,,,,,,,,,,,,,,,,,,,,,,,,,,,3,120,79.5,0,0,3,0,
1073068,02002012435799990011,1,02,BAJA CALIFORNIA,002,MEXICALI,0124,CAMPO LA CURVA (COLONIA SILVA),1,MC002,1,2,82,3,1,,,,157,78,172,86,1,08:45,1,2016/09/29,0,1,111,1,1o01,1,200.93611922838608,1,,13,2,,1,3,1,,,,,,,,,,,,,,,,,,,1,3,31,3,164.5,82,1,2,99,1,0
1073070,02002012435799990021,2,02,BAJA CALIFORNIA,002,MEXICALI,0124,CAMPO LA CURVA (COLONIA SILVA),2,MC002,1,2,49,2,1,12,4,,159,100,157,100,1,11:55,1,2016/09/29,0,1,111,1,1o01,1,1339.9746573678215,1,,10,2,,1,12,,,,,,,1,,,,,,,,,,,,,1,3,1,3,158,100,1,2,3,1,0
1073060,02002012435799990031,2,02,BAJA CALIFORNIA,002,MEXICALI,0124,CAMPO LA CURVA (COLONIA SILVA),2,MC002,1,2,39,5,1,10,4,,122,79,117,80,1,12:10,1,2016/09/29,0,1,111,1,1o01,1,893.3164382452143,1,,7,1,2,1,1,,,,,,,1,,,,,,,,,,,,,1,3,2,3,119.5,79.5,0,2,2,1,1
1073075,02002012435799990041,3,02,BAJA CALIFORNIA,002,MEXICALI,0124,CAMPO LA CURVA (COLONIA SILVA),3,MC002,1,1,21,11,1,12,,,102,65,103,58,1,13:30,1,2016/09/29,0,1,111,1,1o01,1,998.2696421306705,2,,,,,,,,,,,,,,,,,,,,,,,,,,,,,3,102.5,61.5,0,0,1,0,
1073064,02002012435799990051,1,02,BAJA CALIFORNIA,002,MEXICALI,0124,CAMPO LA CURVA (COLONIA SILVA),1,MC002,1,1,42,1,1,10,,,120,78,122,84,1,15:56,1,2016/09/29,0,1,111,1,1o01,1,359.0072225815169,2,,,,,,,,,,,,,,,,,,,,,,,,,,,,,3,121,81,0,0,3,0,