﻿FOLIO_I,FOLIO_INT,maquina,t_hora,t_min,t_sumai,t_sumaf,hora_ini_1,fecha_ini_1,hora_fin_1,fecha_fin_1,tiempo1,resultado_1,hora_ini_2,fecha_ini_2,hora_fin_2,fecha_fin_2,tiempo2,resultado_2,hora_ini_3,fecha_ini_3,hora_fin_3,fecha_fin_3,tiempo3,resultado_3,hora_ini_4,fecha_ini_4,hora_fin_4,fecha_fin_4,tiempo4,resultado_4,hora_ini,fecha_ini,localizado,entidad,desc_ent,municipio,desc_mun,vivienda,hogar,upm,nota1,region,h0302,h0303,fech_nac,nota01,an01_1,an01_2,an02,an03,nota02,an04_1,an04_2,an05,an06,an07,nota03,an08_1,an08_2,an09,nota04,an10,an11,an12_1,an12_2,an13,an14,an15_1,an15_2,an16,an17_1,an18,an19,an20,an21_1,an21_2,an22,nota05,an23,an24,an25,an26,nota06,an27_01s,an27_01d,an27_02s,an27_02d,an27_03s,an27_03d,an28,an29,an30,comentario,tiempo,hora_fin,fecha_fin,completa,otroent,ponde_f,estrato,est_sel,x_region
01001004,01001004_01,MQ323,20,56,1253,1256,20:53:03,11/11/2021,20:56:08,11/11/2021,3,1, , , , ,0,0, , , , ,0,0, , , , ,0,0,20:53:03,11/11/2021,1,01,01 AGUASCALIENTES,001,001 AGUASCALIENTES,0006,1,0100100010341,1,4,2,74,23081947, , , , , , , , , , , , , , , ,1,1,4,72.1,72.05,1,1,159,158.8,1,50.5,1,31.9,1,95,95,1, , , , , ,1,117,70,119,61,114,71,14:50,1,1, ,3,20:56:08,11/11/2021,1, ,3801.80463199199,3,13,5
01001012,01001012_02,MQ323,20,58,1256,1258,20:56:09,11/11/2021,20:58:58,11/11/2021,2,1, , , , ,0,0, , , , ,0,0, , , , ,0,0,20:56:09,11/11/2021,1,01,01 AGUASCALIENTES,001,001 AGUASCALIENTES,0026,1,0100100010341,1,4,1,32,28081989,1,97.65,97.55,1,1,1,183.4,183.2,1, , ,1,98.8,98.8,1, , , , , , , , , , , , , , , , , , , , , , ,1,133,86,128,81,127,79,15:18,1,1, ,2,20:58:58,11/11/2021,1, ,39689.581341889,3,13,5
01001013,01001013_05,MQ323,18,26,1104,1106,18:24:14,12/11/2021,18:26:56,12/11/2021,2,1, , , , ,0,0, , , , ,0,0, , , , ,0,0,18:24:14,12/11/2021,1,01,01 AGUASCALIENTES,001,001 AGUASCALIENTES,0032,1,0100100010341,1,4,1,19,29062002,1,59.3,59.45,1,1,1,169.7,169.8,1, , , , , , , , , , , , , , , , , , , , , , , , , , , , , , , , , , , , , , , ,2,18:26:56,12/11/2021,1, ,15447.0461484362,3,13,5
01001017,01001017_01,MQ326,20,53,1249,1253,20:49:45,11/11/2021,20:53:07,11/11/2021,4,1, , , , ,0,0, , , , ,0,0, , , , ,0,0,20:49:45,11/11/2021,1,01,01 AGUASCALIENTES,001,001 AGUASCALIENTES,0003,1,0100100010341,1,4,2,71,30041950, , , , , , , , , , , , , , , ,1,2,4,222.22,222.22,4,2,222.2,222.2,2,52,1,43.6,1,222.2,222.2,2, , , , , ,1,109,61,114,66,113,71,14:20,1,1, ,4,20:53:07,11/11/2021,1, ,3237.09213109962,3,13,5
01001017,01001017_05,MQ326,20,54,1253,1254,20:53:08,11/11/2021,20:54:59,11/11/2021,1,1, , , , ,0,0, , , , ,0,0, , , , ,0,0,20:53:08,11/11/2021,1,01,01 AGUASCALIENTES,001,001 AGUASCALIENTES,0003,1,0100100010341,1,4,2,8,24052013,1,23.8,23.8,2,1,1,131.6,131.6,1, , , , , , , , , , , , , , , , , , , , , , , , , , , , , , , , , , , , , , , ,1,20:54:59,11/11/2021,1, ,4436.15617001879,3,13,5
01001019,01001019_02,MQ326,21,1,1257,1261,20:57:19,11/11/2021,21:01:44,11/11/2021,4,1, , , , ,0,0, , , , ,0,0, , , , ,0,0,20:57:19,11/11/2021,1,01,01 AGUASCALIENTES,001,001 AGUASCALIENTES,0011,1,0100100010341,1,4,2,42,08031979,1,66.8,66.75,2,1,1,160.2,159.8,1,4, ,1,77.7,77.7,1, , , , , , , , , , , , , , , , , , , , , , ,1,105,68,106,66,104,66,19:30,1,1, ,4,21:01:44,11/11/2021,1, ,5625.65156648308,3,13,5
01001019,01001019_03,MQ326,21,5,1261,1265,21:01:45,11/11/2021,21:05:14,11/11/2021,4,1, , , , ,0,0, , , , ,0,0, , , , ,0,0,21:01:45,11/11/2021,1,01,01 AGUASCALIENTES,001,001 AGUASCALIENTES,0011,1,0100100010341,1,4,1,21,28072000,1,66.9,66.7,2,1,1,171.5,171.5,1, , ,1,76.7,76.9,1, , , , , , , , , , , , , , , , , , , , , , ,1,117,66,119,57,109,56,19:00,1,1, ,4,21:05:14,11/11/2021,1, ,6184.34130293928,3,13,5
01001019,01001019_04,MQ326,21,7,1265,1267,21:05:16,11/11/2021,21:07:21,11/11/2021,2,1, , , , ,0,0, , , , ,0,0, , , , ,0,0,21:05:16,11/11/2021,1,01,01 AGUASCALIENTES,001,001 AGUASCALIENTES,0011,1,0100100010341,1,4,1,12,99032009,1,36.6,36.55,2,1,1,149,148.8,1, , , , , , , , , , , , , , , , , , , , , , , , , , , , , , , , , , , , , , , ,2,21:07:21,11/11/2021,1, ,4190.77068996675,3,13,5
01001021,01001021_02,MQ326,21,10,1267,1270,21:07:29,11/11/2021,21:10:22,11/11/2021,3,1, , , , ,0,0, , , , ,0,0, , , , ,0,0,21:07:29,11/11/2021,1,01,01 AGUASCALIENTES,001,001 AGUASCALIENTES,0022,1,0100100010341,1,4,1,48,13111972,1,79.5,79.55,2,1,1,164.3,164.2,1, , ,1,97.4,97.2,1, , , , , , , , , , , , , , , , , , , , , , ,1,131,79,129,80,125,84,20:20,1,1, ,3,21:10:22,11/11/2021,1, ,5364.35155307092,3,13,5
01001023,01001023_02,MQ326,20,49,1245,1249,20:45:06,11/11/2021,20:49:41,11/11/2021,4,1, , , , ,0,0, , , , ,0,0, , , , ,0,0,20:45:06,11/11/2021,1,01,01 AGUASCALIENTES,001,001 AGUASCALIENTES,0032,1,0100100010341,1,4,2,62,02101959, , , , , , , , , , , , , , , ,1,2,4,81,81,2,1,160.1,160,1,51,1,46.6,1,222.2,222.2,3, , , , , ,1,125,79,117,64,111,76,15:00,1,1, ,4,20:49:41,11/11/2021,1, ,8092.73032774905,3,13,5
01001028,01001028_01,MQ316,17,50,1068,1070,17:48:12,11/11/2021,17:50:19,11/11/2021,2,1, , , , ,0,0, , , , ,0,0, , , , ,0,0,17:48:12,11/11/2021,1,01,01 AGUASCALIENTES,001,001 AGUASCALIENTES,0010,1,0100100010341,1,4,1,80,01111940, , , , , , , , , , , , , , , ,1,9,4,63.5,63.6,1,1,170,169.5,1,57.3,1,34.5,1,92.5,92.9,1, , , , , ,1,147,60,144,61,144,56,18:00,1,1, ,2,17:50:19,11/11/2021,1, ,6515.7719385079,3,13,5
01001030,01001030_02,MQ316,17,55,1072,1075,17:52:20,11/11/2021,17:55:20,11/11/2021,3,1, , , , ,0,0, , , , ,0,0, , , , ,0,0,17:52:20,11/11/2021,1,01,01 AGUASCALIENTES,001,001 AGUASCALIENTES,0014,1,0100100010341,1,4,2,85,26101935, , , , , , , , , , , , , , , ,1,8,5, , , , , , , ,222.2,3,222.2,3, , , ,1,222.2,3,222.2,3,1,120,80,120,80,120,80,15:30,1,1, ,3,17:55:20,11/11/2021,1, ,9400.82599910748,3,13,5
01001030,01001030_03,MQ316,17,52,1070,1072,17:50:21,11/11/2021,17:52:19,11/11/2021,2,1, , , , ,0,0, , , , ,0,0, , , , ,0,0,17:50:21,11/11/2021,1,01,01 AGUASCALIENTES,001,001 AGUASCALIENTES,0014,1,0100100010341,1,4,2,20,23052001,1,152.8,152.5,1,1,1,152.8,152.5,1,4, ,1,67.9,67.4,1, , , , , , , , , , , , , , , , , , , , , , ,1,114,71,110,70,103,66,16:55,1,1, ,2,17:52:19,11/11/2021,1, ,10441.2191503067,3,13,5
01001031,01001031_02,MQ316,16,12,969,972,16:09:58,11/11/2021,16:12:32,11/11/2021,3,1, , , , ,0,0, , , , ,0,0, , , , ,0,0,16:09:58,11/11/2021,1,01,01 AGUASCALIENTES,001,001 AGUASCALIENTES,0003,1,0100100010341,1,4,2,60,03081961, , , , , , , , , , , , , , , ,1,9,4,77.25,77.25,1,1,156,155.5,1,56.9,1,36.5,1,111.5,111.6,1, , , , , ,1,122,80,120,80,119,74,14:00,1,1, ,3,16:12:32,11/11/2021,1, ,9124.33111678079,3,13,5
01001031,01001031_04,MQ316,16,14,972,974,16:12:34,11/11/2021,16:14:22,11/11/2021,2,1, , , , ,0,0, , , , ,0,0, , , , ,0,0,16:12:34,11/11/2021,1,01,01 AGUASCALIENTES,001,001 AGUASCALIENTES,0003,1,0100100010341,1,4,2,24,16121996,1,78.1,78.15,1,1,1,159.7,159.5,1,4, ,1,93.3,93.7,1, , , , , , , , , , , , , , , , , , , , , , ,1,114,81,109,75,109,71,12:30,1,1, ,2,16:14:22,11/11/2021,1, ,20268.2489388306,3,13,5
01001101,01001101_04,MQ326,18,9,1083,1089,18:03:28,12/11/2021,18:09:53,12/11/2021,6,1, , , , ,0,0, , , , ,0,0, , , , ,0,0,18:03:28,12/11/2021,1,01,01 AGUASCALIENTES,001,001 AGUASCALIENTES,0001,1,0100100012507,1,4,2,18,26042003,1,60.3,60.2,2,1,1,153.8,153.6,1,4, , , , , , , , , , , , , , , , , , , , , , , , , , , , , , , , , , , , , , ,6,18:09:53,12/11/2021,1, ,3709.7808437057,3,13,5
01001101,01001101_05,MQ326,18,15,1090,1095,18:10:29,12/11/2021,18:15:25,12/11/2021,5,1, , , , ,0,0, , , , ,0,0, , , , ,0,0,18:10:29,12/11/2021,1,01,01 AGUASCALIENTES,001,001 AGUASCALIENTES,0001,1,0100100012507,1,4,1,3,22052018,1,14.95,14.9,2,1,1,94.7,94.7,1, , , , , , , , , , , , , , , , , , , , , , , , , , , , , , , , , , , , , , , ,5,18:15:25,12/11/2021,1, ,4618.19855619097,3,13,5
01001103,01001103_01,MQ326,20,48,1237,1248,20:37:53,12/11/2021,20:48:36,12/11/2021,11,1, , , , ,0,0, , , , ,0,0, , , , ,0,0,20:37:53,12/11/2021,1,01,01 AGUASCALIENTES,001,001 AGUASCALIENTES,0009,1,0100100012507,1,4,2,30,02121990,1,65.4,65.4,2,1,1,161.5,161.6,1,4, ,1,82.6,82.8,1, , , , , , , , , , , , , , , , , , , , , , ,1,91,51,86,49,87,49,19:36,1,1, ,11,20:48:36,12/11/2021,1, ,3778.72693058718,3,13,5
01001104,01001104_02,MQ326,17,59,1072,1079,17:52:05,12/11/2021,17:59:52,12/11/2021,7,1, , , , ,0,0, , , , ,0,0, , , , ,0,0,17:52:05,12/11/2021,1,01,01 AGUASCALIENTES,001,001 AGUASCALIENTES,0013,1,0100100012507,1,4,2,38,23071983,1,110.7,110.55,2,1,1,160.5,160.1,1,4, ,1,132.5,132.1,1, , , , , , , , , , , , , , , , , , , , , , ,1,113,79,118,78,114,75,12:15,1,1, ,7,17:59:52,12/11/2021,1, ,5255.63939504407,3,13,5
01001104,01001104_03,MQ326,18,3,1079,1083,17:59:54,12/11/2021,18:03:22,12/11/2021,4,1, , , , ,0,0, , , , ,0,0, , , , ,0,0,17:59:54,12/11/2021,1,01,01 AGUASCALIENTES,001,001 AGUASCALIENTES,0013,1,0100100012507,1,4,1,16,14022005,1,99,98.95,2,1,1,174.1,174,1, , , , , , , , , , , , , , , , , , , , , , , , , , , , , , , , , , , , , , , ,4,18:03:22,12/11/2021,1, ,2936.35047516209,3,13,5
01001105,01001105_01,MQ326,18,19,1095,1099,18:15:31,12/11/2021,18:19:31,12/11/2021,4,1, , , , ,0,0, , , , ,0,0, , , , ,0,0,18:15:31,12/11/2021,1,01,01 AGUASCALIENTES,001,001 AGUASCALIENTES,0018,1,0100100012507,1,4,1,74,15031947, , , , , , , , , , , , , , , ,1,3,4,222.22,222.22,4,2,222.2,222.2,2,51.1,1,32.9,1,222.2,222.2,2, , , , , ,1,97,57,93,54,94,58,14:38,1,1, ,4,18:19:31,12/11/2021,1, ,3930.14815338572,3,13,5
01001105,01001105_03,MQ326,19,0,1135,1140,18:55:58,12/11/2021,19:00:09,12/11/2021,5,1, , , , ,0,0, , , , ,0,0, , , , ,0,0,18:55:58,12/11/2021,1,01,01 AGUASCALIENTES,001,001 AGUASCALIENTES,0018,1,0100100012507,1,4,2,42,23041979,1,99.05,99,2,1,1,163,162.6,1,4, ,1,116,115.9,1, , , , , , , , , , , , , , , , , , , , , , ,1,113,72,113,72,114,72,15:24,1,1, ,5,19:00:09,12/11/2021,1, ,3941.72954628305,3,13,5
01001105,01001105_05,MQ326,19,1,1140,1141,18:19:32,12/11/2021,18:25:48,12/11/2021,6,2,19:00:11,12/11/2021,19:01:25,12/11/2021,1,1, , , , ,0,0, , , , ,0,0,18:19:32,12/11/2021,1,01,01 AGUASCALIENTES,001,001 AGUASCALIENTES,0018,1,0100100012507,1,4,2,11,14022010,1,33.2,33.2,2,1,1,139.1,138.8,1, , , , , , , , , , , , , , , , , , , , , , , , , , , , , , , , , , , , , , , ,7,19:01:25,12/11/2021,1, ,3709.7808437057,3,13,5
01001108,01001108_01,MQ326,20,37,1233,1237,20:33:55,12/11/2021,20:37:40,12/11/2021,4,1, , , , ,0,0, , , , ,0,0, , , , ,0,0,20:33:55,12/11/2021,1,01,01 AGUASCALIENTES,001,001 AGUASCALIENTES,0030,1,0100100012507,1,4,1,51,27101969,1,69.3,69.2,2,1,1,165.9,165.3,1, , ,1,92.1,92,1, , , , , , , , , , , , , , , , , , , , , , ,1,124,68,114,64,111,62,19:30,1,1, ,4,20:37:40,12/11/2021,1, ,3930.14815338572,3,13,5
01001108,01001108_02,MQ326,19,6,1141,1146,19:01:29,12/11/2021,19:06:22,12/11/2021,5,1, , , , ,0,0, , , , ,0,0, , , , ,0,0,19:01:29,12/11/2021,1,01,01 AGUASCALIENTES,001,001 AGUASCALIENTES,0030,1,0100100012507,1,4,2,46,16121974,1,84.9,84.85,2,1,1,170.4,170,1,4, ,1,94.4,94.5,1, , , , , , , , , , , , , , , , , , , , , , ,1,119,67,107,62,106,65,13:41,1,1, ,5,19:06:22,12/11/2021,1, ,1970.86477314152,3,13,5
01001108,01001108_03,MQ326,19,9,1146,1149,19:06:50,12/11/2021,19:09:04,12/11/2021,3,1, , , , ,0,0, , , , ,0,0, , , , ,0,0,19:06:50,12/11/2021,1,01,01 AGUASCALIENTES,001,001 AGUASCALIENTES,0030,1,0100100012507,1,4,1,22,23011999,1,69.5,69.5,2,1,1,180.1,179.9,1, , ,1,81,81.2,1, , , , , , , , , , , , , , , , , , , , , , ,1,118,73,128,77,109,75,12:53,1,1, ,3,19:09:04,12/11/2021,1, ,4333.18710730851,3,13,5
01001108,01001108_04,MQ326,20,33,1231,1233,20:31:11,12/11/2021,20:33:54,12/11/2021,2,1, , , , ,0,0, , , , ,0,0, , , , ,0,0,20:31:11,12/11/2021,1,01,01 AGUASCALIENTES,001,001 AGUASCALIENTES,0030,1,0100100012507,1,4,2,14,11022007,1,57.85,57.85,2,1,1,176.3,176.3,1,4, , , , , , , , , , , , , , , , , , , , , , , , , , , , , , , , , , , , , , ,2,20:33:54,12/11/2021,1, ,3709.7808437057,3,13,5
01001112,01001112_02,MQ323,20,26,1223,1226,20:23:32,12/11/2021,20:26:10,12/11/2021,3,1, , , , ,0,0, , , , ,0,0, , , , ,0,0,20:23:32,12/11/2021,1,01,01 AGUASCALIENTES,001,001 AGUASCALIENTES,0012,1,0100100012507,1,4,2,72,08041949, , , , , , , , , , , , , , , ,1,1,4,74.4,74.4,1,1,154.5,154.5,1,51,1,39.1,1,112.1,111.5,1, , , , , ,1,121,73,122,70,120,70,18:30,1,1, ,3,20:26:10,12/11/2021,1, ,4597.57256069607,3,13,5
01001113,01001113_01,MQ323,18,32,1108,1112,18:28:05,12/11/2021,18:32:28,12/11/2021,4,1, , , , ,0,0, , , , ,0,0, , , , ,0,0,18:28:05,12/11/2021,1,01,01 AGUASCALIENTES,001,001 AGUASCALIENTES,0016,1,0100100012507,1,4,2,48,18091973,1,64.1,64.3,1,1,1,147.6,147.1,1,4, ,1,94.5,94.3,1, , , , , , , , , , , , , , , , , , , , , , ,1,124,83,125,81,119,83,17:52,1,1, ,4,18:32:28,12/11/2021,1, ,1997.49808088668,3,13,5
01001116,01001116_01,MQ316,14,23,861,863,14:21:38,12/11/2021,14:23:47,12/11/2021,2,1, , , , ,0,0, , , , ,0,0, , , , ,0,0,14:21:38,12/11/2021,1,01,01 AGUASCALIENTES,001,001 AGUASCALIENTES,0001,1,0100100012507,1,4,1,82,05021939, , , , , , , , , , , , , , , ,1,9,5, , , , , , , ,222.2,3,222.2,3, , , ,1,84,1,36.6,1,1,149,79,146,67,134,65,12:03,1,1, ,2,14:23:47,12/11/2021,1, ,6710.00904236587,3,13,5
01001117,01001117_01,MQ316,14,26,863,866,14:23:48,12/11/2021,14:26:11,12/11/2021,3,1, , , , ,0,0, , , , ,0,0, , , , ,0,0,14:23:48,12/11/2021,1,01,01 AGUASCALIENTES,001,001 AGUASCALIENTES,0002,1,0100100012507,1,4,2,65,12061956, , , , , , , , , , , , , , , ,1,9,4,77.3,77.3,1,1,150.7,150.4,1,50.5,1,43.5,1,113.5,113.8,1, , , , , ,1,128,66,120,60,115,60,12:30,1,1, ,3,14:26:11,12/11/2021,1, ,1452.16011368327,3,13,5
01001117,01001117_02,MQ316,14,29,867,869,14:27:28,12/11/2021,14:29:18,12/11/2021,2,1, , , , ,0,0, , , , ,0,0, , , , ,0,0,14:27:28,12/11/2021,1,01,01 AGUASCALIENTES,001,001 AGUASCALIENTES,0002,1,0100100012507,1,4,2,42,27021979,1,74.16,74.2,1,1,1,149.5,149,1,4, ,1,106,107,1, , , , , , , , , , , , , , , , , , , , , , ,1,118,72,111,68,109,69,12:40,1,1, ,2,14:29:18,12/11/2021,1, ,1682.44553804764,3,13,5
01001117,01001117_06,MQ316,14,27,866,867,14:26:12,12/11/2021,14:27:26,12/11/2021,1,1, , , , ,0,0, , , , ,0,0, , , , ,0,0,14:26:12,12/11/2021,1,01,01 AGUASCALIENTES,001,001 AGUASCALIENTES,0002,1,0100100012507,1,4,2,7,08102014,1,22.1,22.15,1,1,1,115,115.4,1, , , , , , , , , , , , , , , , , , , , , , , , , , , , , , , , , , , , , , , ,1,14:27:26,12/11/2021,1, ,2653.41394365686,3,13,5
01001119,01001119_03,MQ316,14,31,869,871,14:29:26,12/11/2021,14:31:32,12/11/2021,2,1, , , , ,0,0, , , , ,0,0, , , , ,0,0,14:29:26,12/11/2021,1,01,01 AGUASCALIENTES,001,001 AGUASCALIENTES,0009,1,0100100012507,1,4,2,28,21051993,1,61.6,61.6,1,1,1,157,157,1,4, ,1,78,78,1, , , , , , , , , , , , , , , , , , , , , , ,1,119,65,112,62,106,64,13:01,1,1, ,2,14:31:32,12/11/2021,1, ,5376.23750286793,3,13,5
01001119,01001119_05,MQ316,14,33,871,873,14:31:34,12/11/2021,14:33:11,12/11/2021,2,1, , , , ,0,0, , , , ,0,0, , , , ,0,0,14:31:34,12/11/2021,1,01,01 AGUASCALIENTES,001,001 AGUASCALIENTES,0009,1,0100100012507,1,4,2,5,12032016,1,17.45,17.45,1,1,1,108.5,108.5,1, , , , , , , , , , , , , , , , , , , , , , , , , , , , , , , , , , , , , , , ,2,14:33:11,12/11/2021,1, ,5306.82788731373,3,13,5
01001121,01001121_02,MQ316,19,18,1157,1158,19:17:19,12/11/2021,19:18:58,12/11/2021,1,1, , , , ,0,0, , , , ,0,0, , , , ,0,0,19:17:19,12/11/2021,1,01,01 AGUASCALIENTES,001,001 AGUASCALIENTES,0016,1,0100100012507,1,4,2,38,06091983,1,79.6,79.58,1,1,1,156.2,156.2,1,4, ,1,117.5,117.5,1, , , , , , , , , , , , , , , , , , , , , , ,1,117,67,116,67,113,61,19:09,1,1, ,1,19:18:58,12/11/2021,1, ,2804.07589674607,3,13,5
01001121,01001121_03,MQ316,19,20,1159,1160,19:19:00,12/11/2021,19:20:03,12/11/2021,1,1, , , , ,0,0, , , , ,0,0, , , , ,0,0,19:19:00,12/11/2021,1,01,01 AGUASCALIENTES,001,001 AGUASCALIENTES,0016,1,0100100012507,1,4,1,15,05072006,1,48.7,48.65,1,1,1,175,175.1,1, , , , , , , , , , , , , , , , , , , , , , , , , , , , , , , , , , , , , , , ,1,19:20:03,12/11/2021,1, ,2506.64064952861,3,13,5
01001121,01001121_04,MQ316,19,21,1160,1161,19:20:09,12/11/2021,19:21:26,12/11/2021,1,1, , , , ,0,0, , , , ,0,0, , , , ,0,0,19:20:09,12/11/2021,1,01,01 AGUASCALIENTES,001,001 AGUASCALIENTES,0016,1,0100100012507,1,4,1,3,17012018,1,17.4,17.4,1,1,1,106,106.1,1, , , , , , , , , , , , , , , , , , , , , , , , , , , , , , , , , , , , , , , ,1,19:21:26,12/11/2021,1, ,3942.36462113864,3,13,5
01001123,01001123_02,MQ316,19,17,1155,1157,19:15:17,12/11/2021,19:17:18,12/11/2021,2,1, , , , ,0,0, , , , ,0,0, , , , ,0,0,19:15:17,12/11/2021,1,01,01 AGUASCALIENTES,001,001 AGUASCALIENTES,0024,1,0100100012507,1,4,2,45,15091976,1,75.25,75.2,1,1,1,161.9,161.9,1,9, ,1,92,92,1, , , , , , , , , , , , , , , , , , , , , , ,1,159,94,142,90,151,90,17:08,1,1, ,2,19:17:18,12/11/2021,1, ,5608.15179349214,3,13,5
01001125,01001125_03,MQ323,20,28,1226,1228,20:26:11,12/11/2021,20:28:44,12/11/2021,2,1, , , , ,0,0, , , , ,0,0, , , , ,0,0,20:26:11,12/11/2021,1,01,01 AGUASCALIENTES,001,001 AGUASCALIENTES,0011,1,0100100012507,1,4,2,34,05031987,1,82.15,82.15,1,1,1,149.5,149.6,1,4, ,1,114.4,114.2,1, , , , , , , , , , , , , , , , , , , , , , ,1,105,82,103,80,103,81,19:16,1,1, ,2,20:28:44,12/11/2021,1, ,15240.8652867016,3,13,5
01001125,01001125_05,MQ323,20,30,1228,1230,20:28:45,12/11/2021,20:30:27,12/11/2021,2,1, , , , ,0,0, , , , ,0,0, , , , ,0,0,20:28:45,12/11/2021,1,01,01 AGUASCALIENTES,001,001 AGUASCALIENTES,0011,1,0100100012507,1,4,1,11,05022010,1,44.4,44.3,1,1,1,142,141.3,1, , , , , , , , , , , , , , , , , , , , , , , , , , , , , , , , , , , , , , , ,2,20:30:27,12/11/2021,1, ,3552.98407494612,3,13,5
01001125,01001125_06,MQ323,20,32,1230,1232,20:30:29,12/11/2021,20:32:17,12/11/2021,2,1, , , , ,0,0, , , , ,0,0, , , , ,0,0,20:30:29,12/11/2021,1,01,01 AGUASCALIENTES,001,001 AGUASCALIENTES,0011,1,0100100012507,1,4,2,8,26112012,1,30.95,30.95,1,1,1,123.4,123.5,1, , , , , , , , , , , , , , , , , , , , , , , , , , , , , , , , , , , , , , , ,2,20:32:17,12/11/2021,1, ,3761.0247355662,3,13,5
01001211,01001211_04,MQ326,14,34,870,874,14:30:54,15/11/2021,14:34:18,15/11/2021,4,1, , , , ,0,0, , , , ,0,0, , , , ,0,0,14:30:54,15/11/2021,1,01,01 AGUASCALIENTES,001,001 AGUASCALIENTES,0010,1,0100100013717,1,4,2,22,24071999,1,73.2,73.1,2,1,1,150.1,150.1,1,1,7, , , , , , , , , , , , , , , , , , , , , , , , , , ,1,97,68,96,59,99,59,13:41,1,1, ,4,14:34:18,15/11/2021,1, ,23552.4012288218,3,13,5
01001211,01001211_06,MQ326,14,35,874,875,14:34:19,15/11/2021,14:35:57,15/11/2021,1,1, , , , ,0,0, , , , ,0,0, , , , ,0,0,14:34:19,15/11/2021,1,01,01 AGUASCALIENTES,001,001 AGUASCALIENTES,0010,1,0100100013717,1,4,2,3,13082018,1,11.4,11.4,2,1,1,89.1,89.1,1, , , , , , , , , , , , , , , , , , , , , , , , , , , , , , , , , , , , , , , ,1,14:35:57,15/11/2021,1, ,10959.5411322867,3,13,5
01001234,01001234_01,MQ326,21,12,1269,1272,21:09:30,15/11/2021,21:12:23,15/11/2021,3,1, , , , ,0,0, , , , ,0,0, , , , ,0,0,21:09:30,15/11/2021,1,01,01 AGUASCALIENTES,001,001 AGUASCALIENTES,0017,1,0100100013717,1,4,1,52,23011969,1,73.85,73.9,2,1,1,166,165.4,1, , ,1,96.5,96,1, , , , , , , , , , , , , , , , , , , , , , ,1,142,82,159,78,138,76,12:20,1,1, ,3,21:12:23,15/11/2021,1, ,20606.4410265503,3,13,5
01001234,01001234_03,MQ326,21,15,1272,1275,21:12:26,15/11/2021,21:15:42,15/11/2021,3,1, , , , ,0,0, , , , ,0,0, , , , ,0,0,21:12:26,15/11/2021,1,01,01 AGUASCALIENTES,001,001 AGUASCALIENTES,0017,1,0100100013717,1,4,2,18,24022003,1,51.2,51.25,2,1,1,156.7,156.4,1,4, , , , , , , , , , , , , , , , , , , , , , , , , , , , , , , , , , , , , , ,3,21:15:42,15/11/2021,1, ,12301.2591821808,3,13,5
01001235,01001235_02,MQ326,16,20,876,980,14:36:05,15/11/2021,16:20:00,15/11/2021,104,1, , , , ,0,0, , , , ,0,0, , , , ,0,0,14:36:05,15/11/2021,1,01,01 AGUASCALIENTES,001,001 AGUASCALIENTES,0022,1,0100100013717,1,4,2,41,01081980,1,60,60.1,2,1,1,154.2,154,1,4, ,1,75.8,75.7,1, , , , , , , , , , , , , , , , , , , , , , ,1,103,67,98,67,97,62,11:59,1,1, ,104,16:20:00,15/11/2021,1, ,17427.1702535229,3,13,5
01001237,01001237_01,MQ316,14,20,858,860,14:18:43,15/11/2021,14:20:56,15/11/2021,2,1, , , , ,0,0, , , , ,0,0, , , , ,0,0,14:18:43,15/11/2021,1,01,01 AGUASCALIENTES,001,001 AGUASCALIENTES,0004,1,0100100013717,1,4,1,22,13041999,1,47.75,47.75,1,1,1,160.9,160.4,1, , ,1,68,68.1,1, , , , , , , , , , , , , , , , , , , , , , ,1,119,69,126,67,103,70,14:02,1,1, ,2,14:20:56,15/11/2021,1, ,15951.7726221359,3,13,5
01001238,01001238_01,MQ316,12,14,732,734,12:12:12,15/11/2021,12:14:07,15/11/2021,2,1, , , , ,0,0, , , , ,0,0, , , , ,0,0,12:12:12,15/11/2021,1,01,01 AGUASCALIENTES,001,001 AGUASCALIENTES,0007,1,0100100013717,1,4,1,43,15081978,1,81.8,81.65,1,1,1,169.2,169,1, , ,1,99.5,99.8,1, , , , , , , , , , , , , , , , , , , , , , ,1,130,70,129,77,129,85,11:50,1,1, ,2,12:14:07,15/11/2021,1, ,25032.3377688037,3,13,5
01001238,01001238_03,MQ316,12,15,734,735,12:14:09,15/11/2021,12:15:45,15/11/2021,1,1, , , , ,0,0, , , , ,0,0, , , , ,0,0,12:14:09,15/11/2021,1,01,01 AGUASCALIENTES,001,001 AGUASCALIENTES,0007,1,0100100013717,1,4,2,17,26092004,1,76.35,76.45,1,1,1,162,162,1,9, , , , , , , , , , , , , , , , , , , , , , , , , , , , , , , , , , , , , , ,1,12:15:45,15/11/2021,1, ,20797.750485258,3,13,5
01001240,01001240_01,MQ316,13,20,799,800,13:16:26,15/11/2021,13:18:56,15/11/2021,2,2,13:19:08,15/11/2021,13:20:25,15/11/2021,1,1, , , , ,0,0, , , , ,0,0,13:16:26,15/11/2021,1,01,01 AGUASCALIENTES,001,001 AGUASCALIENTES,0014,1,0100100013717,1,4,1,37,27061984,1,130.8,130.8,1,1,1,181,181,1, , ,1,128,128,1, , , , , , , , , , , , , , , , , , , , , , ,1,135,90,127,88,130,90,12:04,1,1, ,3,13:20:25,15/11/2021,1, ,25032.3377688037,3,13,5
01001241,01001241_02,MQ316,14,23,860,863,14:20:58,15/11/2021,14:23:22,15/11/2021,3,1, , , , ,0,0, , , , ,0,0, , , , ,0,0,14:20:58,15/11/2021,1,01,01 AGUASCALIENTES,001,001 AGUASCALIENTES,0017,1,0100100013717,1,4,1,47,99999999,1,92.8,92.7,1,1,1,170,170,1, , ,1,106.1,105.4,1, , , , , , , , , , , , , , , , , , , , , , ,1,154,100,147,95,157,98,13:36,1,1, ,3,14:23:22,15/11/2021,1, ,25032.3377688037,3,13,5
01001306,01001306_01,MQ316,17,58,1074,1078,17:54:51,14/11/2021,17:58:50,14/11/2021,4,1, , , , ,0,0, , , , ,0,0, , , , ,0,0,17:54:51,14/11/2021,1,01,01 AGUASCALIENTES,001,001 AGUASCALIENTES,0002,1,0100100001068,1,4,2,69,05051952, , , , , , , , , , , , , , , ,1,9,4,55.75,55.7,1,1,144.9,144.5,1,46.5,1,38.8,1,87,87,1, , , , , ,1,137,61,130,70,128,67,17:05,1,1, ,4,17:58:50,14/11/2021,1, ,2719.68633053547,1,11,5
01001307,01001307_01,MQ316,18,3,1079,1083,17:59:05,14/11/2021,18:03:12,14/11/2021,4,1, , , , ,0,0, , , , ,0,0, , , , ,0,0,17:59:05,14/11/2021,1,01,01 AGUASCALIENTES,001,001 AGUASCALIENTES,0003,1,0100100001068,1,4,2,57,99101964,1,98.2,98.45,1,1,1,153.5,153.2,1, , ,1,118.7,118,1, , , , , , , , , , , , , , , , , , , , , , ,1,116,70,108,70,108,67,15:37,1,1, ,4,18:03:12,14/11/2021,1, ,3626.24844071396,1,11,5
01001319,01001319_01,MQ316,18,6,1083,1086,18:03:14,14/11/2021,18:06:33,14/11/2021,3,1, , , , ,0,0, , , , ,0,0, , , , ,0,0,18:03:14,14/11/2021,1,01,01 AGUASCALIENTES,001,001 AGUASCALIENTES,0015,1,0100100001068,1,4,1,58,02081963,1,70.35,70.1,1,1,1,171,170,1, , ,1,85.8,85.9,1, , , , , , , , , , , , , , , , , , , , , , ,1,131,82,134,86,133,81,17:40,1,1, ,3,18:06:33,14/11/2021,1, ,9171.46886350258,1,11,5
01001323,01001323_02,MQ316,18,9,1086,1089,18:06:36,14/11/2021,18:09:54,14/11/2021,3,1, , , , ,0,0, , , , ,0,0, , , , ,0,0,18:06:36,14/11/2021,1,01,01 AGUASCALIENTES,001,001 AGUASCALIENTES,0019,1,0100100001068,1,4,2,49,07011972,1,72.75,72.65,1,1,1,155.9,155.5,1,4, ,1,91,91,1, , , , , , , , , , , , , , , , , , , , , , ,1,147,70,134,79,129,74,12:10,1,1, ,3,18:09:54,14/11/2021,1, ,3214.94765917565,1,11,5
01001325,01001325_03,MQ316,18,15,1090,1095,18:10:08,14/11/2021,18:15:55,14/11/2021,5,1, , , , ,0,0, , , , ,0,0, , , , ,0,0,18:10:08,14/11/2021,1,01,01 AGUASCALIENTES,001,001 AGUASCALIENTES,0021,1,0100100001068,1,4,2,22,13041999,1,68.1,68.15,1,1,1,164,164,1,4, ,1,81,81.5,1, , , , , , , , , , , , , , , , , , , , , , ,1,136,68,121,68,120,70,13:05,1,1, ,5,18:15:55,14/11/2021,1, ,4361.14897963837,1,11,5