﻿FOLIO_I,FOLIO_INT,maquina,hora_ini_1,fecha_ini_1,hora_fin_1,fecha_fin_1,tiempo1,resultado_1,hora_ini_2,fecha_ini_2,hora_fin_2,fecha_fin_2,tiempo2,resultado_2,hora_ini_3,fecha_ini_3,hora_fin_3,fecha_fin_3,tiempo3,resultado_3,hora_ini_4,fecha_ini_4,hora_fin_4,fecha_fin_4,tiempo4,resultado_4,hora_ini,fecha_ini,entidad,desc_ent,municipio,desc_mun,vivienda,hogar,upm,region,h0302,h0303,fech_nac,meses,lac01_id,lac02,LAC03A,LAC03B,LAC03C,LAC03D,LAC03E,LAC03F,LAC03G,LAC03H,LAC03I,LAC03J,LAC03K,LAC03L,LAC03M,LAC03N,LAC03O,LAC03P,LAC03Q,lac03esp,lac04,lac04h,lac04d,lac05a,LAC05BA,LAC05BB,LAC05BC,LAC05BD,LAC05BE,LAC05BF,LAC05BG,LAC05BH,LAC05BI,LAC05BJ,LAC05BK,LAC05BL,LAC05BM,LAC05BN,lac05esp,lac06,lac07,lac08,lac09,lac10,lac10d,lac10m,lac11a,LAC11BA,LAC11BB,LAC11BC,LAC11BD,LAC11BE,lac12,LAC13A,LAC13B,LAC13C,LAC13D,LAC13E,LAC13F,LAC13G,LAC13H,LAC13I,LAC13J,LAC13K,LAC13L,LAC13M,LAC13N,lac13esp,lac14b,lac15b,lac16b1,lac16b1_1,lac16b1_2,lac16b2,lac16b2_1,lac16b2_2,lac16b3,lac16b3_1,lac16b3_2,lac17b,lac17b1,lac18ba,lac18bb,lac18bc,lac18bd,lac19b,lac20b,lac21b,lac22b,lac23b,lac24b,lac25b,lac26b,lac27b,LAC28BA,LAC28BB,LAC28BC,LAC28BD,lac29b,lac14c,lac14d,lac14dd,lac14dm,lac15c,lac15d,lac15dd,lac15dm,lac16c1,lac16d1,lac16dd1,lac16dm1,lac16c2,lac16d2,lac16dd2,lac16dm2,lac16c3,lac16d3,lac16dd3,lac16dm3,lac17c,lac17d,lac17dd,lac17dm,lac18c,lac18d,lac18dd,lac18dm,lac19c,lac19d,lac19dd,lac19dm,lac20c,lac20d,lac20dd,lac20dm,lac21c,lac21d,lac21dd,lac21dm,lac22c,lac22d,lac22dd,lac22dm,lac23c,lac23d,lac23dd,lac23dm,lac24c,lac24d,lac24dd,lac24dm,lac25c,lac25d,lac25dd,lac25dm,lac26c,lac26d,lac26dd,lac26dm,lac27c,lac27d,lac27dd,lac27dm,lac28c,lac28d,lac28dd,lac28dm,lac30a,lac30,lac31,lac32,lac33,lac34,comentario,tiempo,hora_fin,fecha_fin,completa,otroent,ponde_f,estrato,est_sel,x_region
01001218,01001218_04,MQ337,13:42:21,15/11/2021,13:55:41,15/11/2021,13,1, , , , ,0,0, , , , ,0,0, , , , ,0,0,13:42:21,15/11/2021,01,01 AGUASCALIENTES,001,001 AGUASCALIENTES,0007,1,0100100013717,4,2,0,08062021,4,02,1, , , , , , , , , , , , , , , , , , ,1,2, ,2, , , , , , , , , , , , , , , ,2, , , ,2, ,1,2, , , , , ,1,13, , , , , , , , , , , , , ,NO SE LLENABA,2,1,1,10,NIDAL BEBE,2, , ,2, , ,2, ,2,2,2,2,2,2,2,2,2,2,2,2,2,4, , , ,2,1,2, ,4,3, , , ,1,1,1, ,2, , , ,2, , , ,3, , , ,2,2, ,4,4, , , ,11, , , ,3, , , ,3, , , ,4, , , ,3, , , ,3, , , ,4,2, ,4,4, , , ,4, , , ,1,0,1.58,999.9,25,999.9,NINGUNO,13,13:55:41,15/11/2021,1, ,7405.32053539385,3,13,5
01001219,01001219_04,MQ337,11:58:44,15/11/2021,12:07:01,15/11/2021,9,1, , , , ,0,0, , , , ,0,0, , , , ,0,0,11:58:44,15/11/2021,01,01 AGUASCALIENTES,001,001 AGUASCALIENTES,0014,1,0100100013717,4,1,2,29042019,5,02,1, , , , , , , , , , , , , , , , , , ,1,1, ,2, , , , , , , , , , , , , , , ,2, , , ,2, ,6,2, , , , , ,2, , , , , , , , , , , , , , , ,2,1,2, , ,2, , ,2, , ,2, ,2,2,2,2,2,1,2,2,2,1,1,1,2,4, , , ,2,1,2, ,12,3, , , ,2, , , ,1,2, ,7,2, , , ,3, , , ,9,2, ,9,2,2, ,18,1,2, ,9,2,2, ,12,2,2, ,12,1,2, ,12,1,2, ,18,1,2, ,12,2,2, ,9,4, , , ,4, , , ,1,3,1.45,999.9,99.9,79,EL PESO FUE HACE UNA SEMANA Y ESTA EN EMBARAZO,9,12:07:01,15/11/2021,1, ,7731.96246412729,3,13,5
01001222,01001222_06,MQ337,12:19:35,15/11/2021,12:28:56,15/11/2021,9,1, , , , ,0,0, , , , ,0,0, , , , ,0,0,12:19:35,15/11/2021,01,01 AGUASCALIENTES,001,001 AGUASCALIENTES,0035,1,0100100013717,4,2,2,10042019,6,02,1, , , , , , , , , , , , , , , , , , ,1,1, ,2, , , , , , , , , , , , , , , ,2, , , ,2, ,11,2, , , , , ,1,13, , , , , , , , , , , , , ,NO LLENABA,1,1,2, , ,2, , ,1,3,AMANECER,2, ,2,1,2,2,2,1,2,2,2,1,1,2,2,4, , , ,1,1,2, ,5,3, , , ,1,2, ,4,1,2, ,8,1,2, ,15,2,2, ,18,8,2, ,7,2,2, ,20,1,2, ,7,2,2, ,7,1,2, ,18,1,2, ,12,1,2, ,9,1,2, ,8,2,2, ,7,4, , , ,2,2, ,6,1,1,9.99,64,5,66.2,NINGUNA,9,12:28:56,15/11/2021,1, ,7405.32053539385,3,13,5
01001336,01001336_06,MQ337,18:05:17,14/11/2021,18:16:18,14/11/2021,11,1, , , , ,0,0, , , , ,0,0, , , , ,0,0,18:05:17,14/11/2021,01,01 AGUASCALIENTES,001,001 AGUASCALIENTES,0011,1,0100100001068,4,2,2,13082019,1,02,1, , , , , , , , , , , , , , , , , , ,2, ,1,2, , , , , , , , , , , , , , , ,2, , , ,2, ,3,1,9, , , , ,1,13, , , , , , , , , , , , , ,NO SE LLENABA,1,1,2, , ,2, , ,1,2,SAN MARCOS,2, ,1,1,1,2,2,1,1,2,2,2,1,2,2,2, , , ,1,1,2, ,5,3, , , ,1,2, ,3,2, , , ,1,2, ,12,3, , , ,8,2, ,6,4, , , ,1,2, ,6,2,2, ,8,2,2, ,7,1,2, ,7,3, , , ,1,2, ,9,4,2, ,9,4, , , ,2,2, ,8,1,3,1.78,85,88.8,80,NINGUNO,11,18:16:18,14/11/2021,1, ,2538.62168485528,1,11,5
01001345,01001345_09,MQ337,13:04:35,14/11/2021,13:16:36,14/11/2021,12,1, , , , ,0,0, , , , ,0,0, , , , ,0,0,13:04:35,14/11/2021,01,01 AGUASCALIENTES,001,001 AGUASCALIENTES,0020,1,0100100001068,4,2,2,01092019,1,05,1, , , , , , , , , , , , , , , , , , ,1,2, ,2, , , , , , , , , , , , , , , ,1,1,1,2, , , ,2, , , , , ,2, , , , , , , , , , , , , , , ,1,2,2, , ,2, , ,1,1,LA GRANJA,2, ,2,2,2,2,2,1,1,1,2,2,2,2,2,2, , , ,2,1,2, ,3,3, , , ,2, , , ,2, , , ,1,2, ,7,3, , , ,2,2, ,6,3,2, ,6,1,2, ,6,1,2, ,6,2,2, ,8,1,2, ,7,1,2, ,7,1,2, ,5,4,2, ,4,4, , , ,2,2, ,4,1,3,1.68,100,10,109,NINGUNA,12,13:16:36,14/11/2021,1, ,2538.62168485528,1,11,5
01002015,01002015_04,MQ361,12:28:40,14/11/2021,12:39:03,14/11/2021,11,1, , , , ,0,0, , , , ,0,0, , , , ,0,0,12:28:40,14/11/2021,01,01 AGUASCALIENTES,002,002 ASIENTOS,0007,1,0100200250404,4,1,1,26052020,4,02,2,4, , , , , , , , , , , , , , , , , , , , , , , , , , , , , , , , , , , , , , , , , , , ,1,1, , , , ,1,1, , , , , , , , , , , , , , ,1,1,1,3,NIDO,2, , ,2, , ,2, ,1,2,2,2,2,1,1,2,2,2,1,2,2,2, , , ,1,1,2, ,13,1,2, ,10,1,1,1, ,2, , , ,2, , , ,3, , , ,9,2, ,14,4, , , ,1,2, ,14,2,2, ,12,2,2, ,12,1,2, ,14,3, , , ,1,2, ,16,4,2, ,13,4, , , ,2,2, ,15,1,3,9.99,80,10,85,NINGUNA,11,12:39:03,14/11/2021,1, ,6022.04499857387,2,12,5
02001010,02001010_12,MQ338,19:02:47,06/11/2021,19:15:12,06/11/2021,13,1, , , , ,0,0, , , , ,0,0, , , , ,0,0,19:02:47,06/11/2021,02,02 BAJA CALIFORNIA,001,001 ENSENADA,0010,1,0200100010488,1,1,1,16042020,5,03,1, , , , , , , , , , , , , , , , , , ,0, , ,2, , , , , , , , , , , , , , , ,2, , , ,2, ,4,2, , , , , ,1,13, , , , , , , , , , , , , ,EMPEZÓ A TRABAJAR,1,2,1,1,NIDO,2, , ,1,1,AZUCENA,2, ,2,1,2,2,2,1,1,2,1,2,1,1,2,4, , , ,2,1,2, ,11,1,2, ,3,1,2, ,4,1,2, ,12,1,2, ,15,3, , , ,9,2, ,6,4, , , ,8,2, ,12,2,2, ,6,1,2, ,12,1,2, ,12,1,2, ,12,1,2, ,6,3,2, ,10,4, , , ,2,2, ,8,1,1,1.56,68,11,76, ,13,19:15:12,06/11/2021,1, ,5780.93388291088,3,23,1
02001010,02001010_13,MQ338,19:39:27,06/11/2021,19:57:23,06/11/2021,18,1, , , , ,0,0, , , , ,0,0, , , , ,0,0,19:39:27,06/11/2021,02,02 BAJA CALIFORNIA,001,001 ENSENADA,0010,1,0200100010488,1,2,1,16082020,1,08,1, , , , , , , , , , , , , , , , , , ,0, , ,2, , , , , , , , , , , , , , , ,2, , , ,2, ,3,2, , , , , ,1,2, , , , , , , , , , , , , , ,1,2,1,4,NIDO KINDER,2, , ,2, , ,2, ,2,1,2,2,2,1,1,2,1,2,1,2,2,2, , , ,2,1,2, ,4,2,2, ,3,1,2, ,3,2, , , ,2, , , ,3, , , ,6,2, ,8,1,2, ,9,8,2, ,8,2,2, ,5,3, , , ,1,2, ,11,1,2, ,12,1,2, ,11,4,2, ,8,4, , , ,2,2, ,6,1,1,1.64,65,10,70, ,18,19:57:23,06/11/2021,1, ,6024.13151013919,3,23,1
02001014,02001014_04,MQ338,20:05:52,06/11/2021,20:17:56,06/11/2021,12,1, , , , ,0,0, , , , ,0,0, , , , ,0,0,20:05:52,06/11/2021,02,02 BAJA CALIFORNIA,001,001 ENSENADA,0025,1,0200100010488,1,2,1,26012020,8,02,1, , , , , , , , , , , , , , , , , , ,0, , ,1,11, , , , , , , , , , , , , , ,1,1,1,2, , , ,2, , , , , ,1,8, , , , , , , , , , , , , , ,1,2,2, , ,2, , ,2, , ,2, ,1,1,2,2,1,1,1,1,1,2,1,1,2,2, , , ,1,1,1,22, ,2,1,22, ,2, , , ,2, , , ,1,2, ,15,3, , , ,9,2, ,3,2,2, ,5,10,2, ,5,1,2, ,3,3, , , ,1,2, ,7,1,2, ,7,2,2, ,3,4,2, ,5,1,2, ,3,2,2, ,3,111,3,1.66,87,88.8,70, ,12,20:17:56,06/11/2021,1, ,6024.13151013919,3,23,1
02002055,02002055_07,MQ338,18:27:31,11/11/2021,18:37:01,11/11/2021,10,1, , , , ,0,0, , , , ,0,0, , , , ,0,0,18:27:31,11/11/2021,02,02 BAJA CALIFORNIA,002,002 MEXICALI,0020,1,020020001597A,1,2,1,12122019,10,04,1, , , , , , , , , , , , , , , , , , ,0, , ,2, , , , , , , , , , , , , , , ,2, , , ,2, ,9,2, , , , , ,1,2, , , , , , , , , , , , , , ,1,2,2, , ,2, , ,1,2,LALA,2, ,2,1,1,2,2,1,1,1,1,1,2,2,2,4, , , ,2,1,2, ,10,1,2, ,15,2, , , ,2, , , ,1,2, ,12,3, , , ,9,2, ,12,4, , , ,9,2, ,14,2,2, ,12,1,2, ,15,1,2, ,15,1,2, ,15,3, , , ,1,2, ,15,4, , , ,2,2, ,12,1,0,1.6,72,10,80, ,10,18:37:01,11/11/2021,1, ,5214.09640424154,3,23,1
02002065,02002065_03,MQ343,18:47:40,11/11/2021,19:03:35,11/11/2021,16,1, , , , ,0,0, , , , ,0,0, , , , ,0,0,18:47:40,11/11/2021,02,02 BAJA CALIFORNIA,002,002 MEXICALI,0002,1,020020001597A,1,1,1,21092020,0,02,1, , , , , , , , , , , , , , , , , , ,2, ,1,1,11, , , , , , , , , , , , , , ,2, , , ,1,4, ,2, , , , , ,1,1, , , , , , , , , , , , , , ,1,2,2, , ,1,3,NIDO KINDER,2, , ,2, ,1,2,2,2,2,1,1,2,2,1,1,2,2,2, , , ,1,1,2, ,7,1,2, ,8,2, , , ,1,2, ,12,2, , , ,3, , , ,6,2, ,7,3,2, ,6,2,2, ,9,1,2, ,6,3, , , ,4, , , ,1,2, ,12,1,2, ,12,3,2, ,9,4, , , ,2,2, ,12,1,4,1.6,50,8,58, ,16,19:03:35,11/11/2021,1, ,4484.70846772365,3,23,1
02002114,02002114_05,MQ338,18:44:48,12/11/2021,18:56:00,12/11/2021,12,1, , , , ,0,0, , , , ,0,0, , , , ,0,0,18:44:48,12/11/2021,02,02 BAJA CALIFORNIA,002,002 MEXICALI,0008,1,0200200003511,1,1,1,20012020,9,03,1, , , , , , , , , , , , , , , , , , ,0, , ,1,11, , , , , , , , , , , , , , ,2, , , ,1,7, ,1,1,2, , , ,1,5, , , , , , , , , , , , , , ,1,2,2, , ,2, , ,1,3,GREAT VALUE,2, ,2,2,2,2,2,1,2,1,2,2,1,2,2,4, , , ,2,1,2, ,12,1,2, ,16,2, , , ,2, , , ,1,2, ,14,3, , , ,8,2, ,15,4, , , ,2,2, ,18,2,2, ,12,1,2, ,18,1,2, ,18,1,2, ,21,3, , , ,5, , , ,4, , , ,2,2, ,5,1,0,1.64,999.9,8,67, ,12,18:56:00,12/11/2021,1, ,9070.18514458141,1,21,1
02002129,02002129_03,MQ343,21:30:12,12/11/2021,21:44:43,12/11/2021,14,1, , , , ,0,0, , , , ,0,0, , , , ,0,0,21:30:12,12/11/2021,02,02 BAJA CALIFORNIA,002,002 MEXICALI,0008,1,0200200003511,1,2,1,27062020,3,02,1, , , , , , , , , , , , , , , , , , ,0, , ,1,3, , , , , , , , , , , , , , ,1,1,1,2, , , ,1,1, , , , ,1,1, , , , , , , , , , , , , , ,1,2,2, , ,2, , ,2, , ,2, ,2,2,2,2,2,1,1,2,2,2,2,2,2,4, , , ,2,1,2, ,3,1,2, ,12,2, , , ,2, , , ,2, , , ,3, , , ,9,2, ,8,4, , , ,1,2, ,10,1,2, ,10,1,2, ,12,1,2, ,10,1,2, ,10,1,2, ,10,3,2, ,10,4, , , ,2,2, ,10,1,99,1.43,33,8,36.7, ,14,21:44:43,12/11/2021,1, ,4961.63186013031,1,21,1
02004027,02004027_03,MQ338,16:24:28,10/11/2021,16:38:35,10/11/2021,14,1, , , , ,0,0, , , , ,0,0, , , , ,0,0,16:24:28,10/11/2021,02,02 BAJA CALIFORNIA,004,004 TIJUANA,0027,1,0200400010615,1,1,1,24032020,6,02,1, , , , , , , , , , , , , , , , , , ,0, , ,2, , , , , , , , , , , , , , , ,2, , , ,2, ,1,1,1, , , , ,1,8, , , , , , , , , , , , , , ,1,2,2, , ,2, , ,2, , ,2, ,2,1,2,2,2,1,1,2,2,1,1,2,2,4, , , ,2,1,2, ,6,2,2, ,7,1,2, ,2,2, , , ,1,2, ,17,3, , , ,9,2, ,6,1,2, ,12,8,2, ,6,1,2, ,6,3, , , ,1,2, ,6,1,2, ,12,2,2, ,6,4,2, ,7,4, , , ,2,2, ,12,1,1,1.64,66,15,70, ,14,16:38:35,10/11/2021,1, ,19712.916224881,3,23,1
02004081,02004081_05,MQ245,16:15:24,09/11/2021,16:32:25,09/11/2021,17,1, , , , ,0,0, , , , ,0,0, , , , ,0,0,16:15:24,09/11/2021,02,02 BAJA CALIFORNIA,004,004 TIJUANA,0009,1,0200400016347,1,1,1,16012020,9,01,1, , , , , , , , , , , , , , , , , , ,0, , ,2, , , , , , , , , , , , , , , ,1,1,1,2, , , ,2, , , , , ,2, , , , , , , , , , , , , , , ,1,2,2, , ,2, , ,2, , ,2, ,2,1,2,2,2,2,1,2,2,1,1,2,2,4, , , ,2,1,2, ,7,1,2, ,8,2, , , ,2, , , ,2, , , ,3, , , ,6,2, ,8,4, , , ,3,2, ,8,1,2, ,8,3, , , ,1,2, ,8,1,2, ,8,1,2, ,8,3,2, ,8,4, , , ,4, , , ,1,0,1.49,50,7,62.4, ,17,16:32:25,09/11/2021,1, ,11392.606188169,3,23,1
02004099,02004099_07,MQ338,16:43:30,09/11/2021,16:55:16,09/11/2021,12,1, , , , ,0,0, , , , ,0,0, , , , ,0,0,16:43:30,09/11/2021,02,02 BAJA CALIFORNIA,004,004 TIJUANA,0013,1,0200400016347,1,1,2,99992019,1,06,1, , , , , , , , , , , , , , , , , , ,0, , ,2, , , , , , , , , , , , , , , ,2, , , ,2, ,24,2, , , , , ,1,2, , , , , , , , , , , , , , ,1,2,2, , ,2, , ,2, , ,2, ,1,1,2,2,2,1,1,2,2,2,1,2,2,4, , , ,1,1,99, , ,2,2, ,4,2, , , ,2, , , ,1,2, ,12,3, , , ,9,2, ,9,2,2, ,12,1,2, ,12,2,2, ,6,2,2, ,7,2,2, ,12,1,2, ,14,1,2, ,12,4,2, ,4,4, , , ,2,2, ,9,1,0,1.49,999.9,99.9,999.9, ,12,16:55:16,09/11/2021,1, ,10187.6189951896,3,23,1
02004163,02004163_04,MQ338,14:50:25,08/11/2021,15:05:25,08/11/2021,15,1, , , , ,0,0, , , , ,0,0, , , , ,0,0,14:50:25,08/11/2021,02,02 BAJA CALIFORNIA,004,004 TIJUANA,0025,1,0200400018150,1,2,2,19082019,1,01,1, , , , , , , , , , , , , , , , , , ,0, , ,1,11, , , , , , , , , , , , , , ,2, , , ,2, ,9,2, , , , , ,1,13, , , , , , , , , , , , , ,PORQUE TRABAJABA Y LO TENÍA QUE DEJAR CON LAS FAMI,1,1,1,2,NAN3,2, , ,2, , ,2, ,2,1,1,2,1,1,1,2,1,2,1,2,2,1,2, , ,2,1,2, ,11,2,2, ,6,1,1,1, ,2, , , ,2, , , ,3, , , ,9,2, ,7,2,2, ,11,9,2, ,12,2,2, ,11,3, , , ,2,2, ,11,1,2, ,12,1,2, ,12,4,2, ,12,4, , , ,3,2, ,12,1,0,1.69,68,10,55, ,15,15:05:25,08/11/2021,1, ,13473.88721604,3,23,1
02006004,02006004_06,MQ343,16:33:14,05/11/2021,16:52:21,05/11/2021,19,1, , , , ,0,0, , , , ,0,0, , , , ,0,0,16:33:14,05/11/2021,02,02 BAJA CALIFORNIA,006,006 SAN QUINTÍN,0005,1,0200601210323,1,1,1,24022020,7,02,1, , , , , , , , , , , , , , , , , , ,0, , ,2, , , , , , , , , , , , , , , ,1,1,1,2, , , ,2, , , , , ,1,4, , , , , , , , , , , , , , ,1,2,2, , ,1,2,NIDO KINDER 1,2, , ,2, ,2,1,1,2,2,1,1,2,2,1,1,1,2,2, , , ,2,1,2, ,3,2,2, ,1,2, , , ,1,2, ,6,1,2, ,8,3, , , ,9,2, ,6,3,2, ,18,1,2, ,6,2,2, ,5,3, , , ,1,2, ,6,1,2, ,5,1,2, ,5,3,2, ,5,4, , , ,2,2, ,5,1,4,9.99,999.9,9.9,999.9,"no es la mama, es quien lo cuida la que dio la información",19,16:52:21,05/11/2021,1, ,12192.1288500662,2,22,1
02006044,02006044_03,MQ338,16:24:05,05/11/2021,16:40:47,05/11/2021,16,1, , , , ,0,0, , , , ,0,0, , , , ,0,0,16:24:05,05/11/2021,02,02 BAJA CALIFORNIA,006,006 SAN QUINTÍN,0009,1,0200601210323,1,1,2,20122018,9,02,1, , , , , , , , , , , , , , , , , , ,2, ,2,2, , , , , , , , , , , , , , , ,2, , , ,2, ,2,2, , , , , ,1,1,2, , , , , , , , , , , , , ,1,2,1,1,NIDO KINDER,2, , ,1,1,YERSEY,2, ,2,1,2,2,2,1,2,2,2,2,1,2,2,2, , , ,1,2, , , ,1,2, ,11,1,1,1, ,1,1,5, ,2, , , ,3, , , ,8,2, ,3,2,2, ,7,1,2, ,6,1,2, ,3,3, , , ,1,2, ,6,1,2, ,6,1,2, ,6,4,2, ,8,4, , , ,2,2, ,8,1,0,1.51,78,14,92, ,16,16:40:47,05/11/2021,1, ,10797.266651118,2,22,1
03001006,03001006_04,MQ245,18:35:05,29/10/2021,18:48:15,29/10/2021,13,1, , , , ,0,0, , , , ,0,0, , , , ,0,0,18:35:05,29/10/2021,03,03 BAJA CALIFORNIA SUR,001,001 COMONDÚ,0006,1,0300101332991,1,2,1,21022020,7,02,1, , , , , , , , , , , , , , , , , , ,0, , ,2, , , , , , , , , , , , , , , ,2, , , ,2, ,9,2, , , , , ,1,4, , , , , , , , , , , , , , ,1,2,1,2,NOVAMILK,2, , ,2, , ,2, ,2,2,2,2,2,2,1,2,1,1,1,2,2,4, , , ,2,1,2, ,12,2,1,30, ,1,2, ,12,2, , , ,2, , , ,3, , , ,9,2, ,6,2,2, ,7,4,2, ,6,2,2, ,5,1,2, ,8,2,2, ,9,1,2, ,9,1,2, ,14,5, , , ,4, , , ,2,2, ,14,1,1,1.57,62,15,72.6, ,13,18:48:15,29/10/2021,1, ,1565.88032760712,2,32,1
03001029,03001029_04,MQ338,16:56:34,28/10/2021,17:11:54,28/10/2021,15,1, , , , ,0,0, , , , ,0,0, , , , ,0,0,16:56:34,28/10/2021,03,03 BAJA CALIFORNIA SUR,001,001 COMONDÚ,0005,2,0300101332991,1,1,0,14042021,5,02,1, , , , , , , , , , , , , , , , , , ,0, , ,2, , , , , , , , , , , , , , , ,2, , , ,2, ,1,1,1, , , , ,1,1, , , , , , , , , , , , , , ,2,1,1,4,NAN2,2, , ,2, , ,2, ,2,2,2,2,2,2,2,2,2,2,2,1,2,2,3, , ,1,1,2, ,4,3, , , ,1,2, ,1,2, , , ,2, , , ,3, , , ,6,2, ,5,4, , , ,1,2, ,5,3, , , ,3, , , ,4, , , ,3, , , ,1,2, ,5,4,2, ,5,4, , , ,3,2, ,5,1,1,1.55,98,0,101, ,15,17:11:54,28/10/2021,1, ,897.13314351136,2,32,1
03001032,03001032_05,MQ338,15:27:19,29/10/2021,15:46:07,29/10/2021,19,1, , , , ,0,0, , , , ,0,0, , , , ,0,0,15:27:19,29/10/2021,03,03 BAJA CALIFORNIA SUR,001,001 COMONDÚ,0008,1,0300101332991,1,2,1,08012020,8,01,1, , , , , , , , , , , , , , , , , , ,0, , ,1,11, , , , , , , , , , , , , , ,2, , , ,2, ,7,1,1, , , , ,1,4, , , , , , , , , , , , , , ,1,2,2, , ,2, , ,1,3,CARACOL,2, ,2,1,2,2,2,2,1,2,2,1,2,2,2,3, , , ,2,1,2, ,1,2,2, ,1,2, , , ,2, , , ,1,2, ,9,3, , , ,9,2, ,3,1,2, ,6,9,2, ,3,1,2, ,4,1,2, ,4,1,2, ,3,1,2, ,9,3, , , ,1,2, ,9,4, , , ,3,2, ,8,11,2,1.63,87,99.9,82.4, ,19,15:46:07,29/10/2021,1, ,696.711865353184,2,32,1
03002017,03002017_03,MQ343,19:40:05,03/11/2021,19:55:00,03/11/2021,15,1, , , , ,0,0, , , , ,0,0, , , , ,0,0,19:40:05,03/11/2021,03,03 BAJA CALIFORNIA SUR,002,002 MULEGÉ,0001,1,0300200013959,1,2,2,08102018,11,02,1, , , , , , , , , , , , , , , , , , ,0, , ,2, , , , , , , , , , , , , , , ,2, , , ,2, ,24,2, , , , , ,2, , , , , , , , , , , , , , , ,1,2,2, , ,2, , ,1,2,SANTA CLARA,2, ,2,1,2,2,2,1,1,2,1,1,1,1,2,2, , , ,2,1,2, ,6,2,2, ,6,2, , , ,2, , , ,1,2, ,24,3, , , ,6,2, ,12,4, , , ,2,2, ,8,1,2, ,6,1,2, ,18,1,2, ,8,1,2, ,24,1,2, ,12,3,2, ,6,4, , , ,2,2, ,12,1,8,1.61,72,10,999.9, ,15,19:55:00,03/11/2021,1, ,1636.99355051934,2,32,1
03002023,03002023_03,MQ343,20:12:08,03/11/2021,22:05:00,03/11/2021,113,1, , , , ,0,0, , , , ,0,0, , , , ,0,0,20:12:08,03/11/2021,03,03 BAJA CALIFORNIA SUR,002,002 MULEGÉ,0007,1,0300200013959,1,1,1,29092020,0,02,1, , , , , , , , , , , , , , , , , , ,0, , ,2, , , , , , , , , , , , , , , ,2, , , ,2, ,6,2, , , , , ,1,13, , , , , , , , , , , , , ,ESTA ESTUDIANDO Y NO PODIA AMAMANTARLO,1,2,1,2,NAN 3,2, , ,2, , ,2, ,2,2,2,2,2,1,1,2,1,2,1,1,2,4, , , ,2,1,2, ,6,3, , , ,1,2, ,6,2, , , ,2, , , ,3, , , ,11, , , ,2,2, ,6,8,2, ,6,2,2, ,6,1,2, ,6,1,2, ,6,3, , , ,1,2, ,6,1,2, ,10,4, , , ,4, , , ,1,4,1.57,57,7,61, ,113,22:05:00,03/11/2021,1, ,2107.90319918086,2,32,1
03002032,03002032_04,MQ245,17:25:45,31/10/2021,17:41:00,31/10/2021,16,1, , , , ,0,0, , , , ,0,0, , , , ,0,0,17:25:45,31/10/2021,03,03 BAJA CALIFORNIA SUR,002,002 MULEGÉ,0010,1,0300200013959,1,1,2,19102018,11,02,1, , , , , , , , , , , , , , , , , , ,1,1, ,2, , , , , , , , , , , , , , , ,2, , , ,2, ,12,2, , , , , ,2, , , , , , , , , , , , , , , ,1,2,2, , ,1,3,NIDO KINDER,2, , ,2, ,2,1,2,2,2,2,1,2,2,2,2,2,2,4, , , ,2,1,2, ,2,1,2, ,2,2, , , ,1,2, ,12,2, , , ,3, , , ,6,2, ,7,1,2, ,2,2,2, ,6,1,2, ,7,3, , , ,1,2, ,8,3, , , ,1,2, ,8,4,2, ,6,4, , , ,2,2, ,10,1,0,1.5,67,3,74, ,16,17:41:00,31/10/2021,1, ,948.171372423285,2,32,1
03002041,03002041_03,MQ338,08:57:28,03/11/2021,09:07:59,03/11/2021,10,1, , , , ,0,0, , , , ,0,0, , , , ,0,0,08:57:28,03/11/2021,03,03 BAJA CALIFORNIA SUR,002,002 MULEGÉ,0004,1,0300200003107,1,2,2,09052019,4,02,1, , , , , , , , , , , , , , , , , , ,0, , ,2, , , , , , , , , , , , , , , ,2, , , ,2, ,3,2, , , , , ,2, , , , , , , , , , , , , , , ,1,2,2, , ,1,2,NAN3,2, , ,2, ,2,2,1,1,2,2,2,2,2,2,2,2,2,4, , , ,2,1,2, ,6,2,2, ,4,1,2, ,6,1,2, ,4,2, , , ,3, , , ,8,2, ,5,2,2, ,6,1,2, ,4,1,2, ,4,3, , , ,4, , , ,1,2, ,7,2,2, ,7,4,2, ,5,4, , , ,2,2, ,7,1,0,9.99,47,8,44, ,10,09:07:59,03/11/2021,1, ,513.973699722649,1,31,1
03002050,03002050_06,MQ245,17:34:46,02/11/2021,17:44:08,02/11/2021,10,1, , , , ,0,0, , , , ,0,0, , , , ,0,0,17:34:46,02/11/2021,03,03 BAJA CALIFORNIA SUR,002,002 MULEGÉ,0013,1,0300200003107,1,2,1,26102019,11,02,1, , , , , , , , , , , , , , , , , , ,0, , ,2, , , , , , , , , , , , , , , ,1,1,1,2, , , ,2, , , , , ,1,4, , , , , , , , , , , , , , ,1,2,2, , ,1,1,NIDO ENTERA,2, , ,2, ,2,1,1,1,2,1,2,2,1,2,2,2,2,2, , , ,1,1,2, ,3,1,2, ,2,1,2, ,1,1,2, ,18,2, , , ,3, , , ,9,2, ,3,4, , , ,1,2, ,3,2,2, ,3,3, , , ,1,2, ,4,1,2, ,5,1,2, ,4,4,2, ,3,4, , , ,2,2, ,5,1,1,1.42,75,6,72.6, ,10,17:44:08,02/11/2021,1, ,513.973699722649,1,31,1
03002055,03002055_05,MQ338,19:30:18,01/11/2021,19:39:47,01/11/2021,9,1, , , , ,0,0, , , , ,0,0, , , , ,0,0,19:30:18,01/11/2021,03,03 BAJA CALIFORNIA SUR,002,002 MULEGÉ,0003,1,0300200003107,1,1,2,30062019,3,02,1, , , , , , , , , , , , , , , , , , ,2, ,1,2, , , , , , , , , , , , , , , ,2, , , ,2, ,3,2, , , , , ,1,8, , , , , , , , , , , , , , ,1,2,2, , ,2, , ,2, , ,2, ,2,2,2,2,2,2,2,2,2,2,1,2,2,4, , , ,2,1,2, ,9,2,2, ,7,1,2, ,6,1,2, ,8,1,2, ,18,3, , , ,8,2, ,12,4, , , ,8,2, ,13,1,2, ,7,3, , , ,1,2, ,14,1,2, ,14,1,2, ,18,5, , , ,4, , , ,2,2, ,16,1,0,1.52,999.9,99.9,66, ,9,19:39:47,01/11/2021,1, ,1592.44258849472,1,31,1
03002055,03002055_06,MQ338,19:18:00,01/11/2021,19:30:16,01/11/2021,12,1, , , , ,0,0, , , , ,0,0, , , , ,0,0,19:18:00,01/11/2021,03,03 BAJA CALIFORNIA SUR,002,002 MULEGÉ,0003,1,0300200003107,1,1,1,06072020,2,02,1, , , , , , , , , , , , , , , , , , ,2, ,3,2, , , , , , , , , , , , , , , ,2, , , ,2, ,3,2, , , , , ,1,8, , , , , , , , , , , , , , ,1,2,2, , ,1,3,NUTRIRINDE,2, , ,2, ,2,2,2,2,2,2,2,2,2,2,2,2,2,4, , , ,2,1,2, ,6,1,2, ,7,1,2, ,3,1,2, ,4,1,2, ,8,3, , , ,8,2, ,9,4, , , ,8,2, ,12,1,2, ,14,3, , , ,1,2, ,14,1,2, ,14,3, , , ,1,2, ,14,4, , , ,4, , , ,1,0,1.52,86,12,76, ,12,19:30:16,01/11/2021,1, ,1592.44258849472,1,31,1
03002061,03002061_03,MQ343,21:36:29,01/11/2021,21:52:23,01/11/2021,16,1, , , , ,0,0, , , , ,0,0, , , , ,0,0,21:36:29,01/11/2021,03,03 BAJA CALIFORNIA SUR,002,002 MULEGÉ,0009,1,0300200003107,1,1,2,12122018,9,01,1, , , , , , , , , , , , , , , , , , ,2, ,90,1,11, , , , , , , , , , , , , , ,2, , , ,2, ,12,2, , , , , ,1,4, , , , , , , , , , , , , , ,1,2,2, , ,1,1,NIDO,2, , ,2, ,1,1,1,2,2,1,1,2,1,1,2,1,2,2, , , ,1,1,2, ,12,1,2, ,18,2, , , ,1,2, ,18,1,2, ,26,3, , , ,3,2, ,24,1,2, ,24,1,2, ,24,1,2, ,18,1,2, ,24,1,2, ,24,1,2, ,30,1,2, ,24,4,2, ,24,4, , , ,2,2, ,24,1,4,1.47,50,1,66, ,16,21:52:23,01/11/2021,1, ,1592.44258849472,1,31,1
03003017,03003017_07,MQ338,13:45:25,11/10/2021,13:58:49,11/10/2021,13,1, , , , ,0,0, , , , ,0,0, , , , ,0,0,13:45:25,11/10/2021,03,03 BAJA CALIFORNIA SUR,003,003 LA PAZ,0005,1,0300300013195,1,1,1,05092020,0,04,1, , , , , , , , , , , , , , , , , , ,2, ,5,1,11, , , , , , , , , , , , , , ,1,1,1,2, , , ,2, , , , , ,1,1, , , , , , , , , , , , , , ,1,2,2, , ,2, , ,2, , ,2, ,2,1,2,2,2,1,1,2,2,1,1,1,2,4, , , ,2,1,1,2, ,2,2, ,3,2, , , ,2, , , ,2, , , ,3, , , ,6,2, ,5,4, , , ,9,2, ,4,1,2, ,4,3, , , ,1,2, ,7,1,2, ,7,1,2, ,5,4,2, ,4,4, , , ,2,2, ,5,1,3,1.72,85,20,81, ,13,13:58:49,11/10/2021,1, ,673.754196636351,3,33,1
03003017,03003017_08,MQ338,13:37:22,11/10/2021,13:45:21,11/10/2021,8,1, , , , ,0,0, , , , ,0,0, , , , ,0,0,13:37:22,11/10/2021,03,03 BAJA CALIFORNIA SUR,003,003 LA PAZ,0005,1,0300300013195,1,1,0,21062021,2,05,1, , , , , , , , , , , , , , , , , , ,1,1, ,1,11, , , , , , , , , , , , , , ,1,1,1,2, , , ,2, , , , , ,1,4, , , , , , , , , , , , , , ,1,2,1,5,NAN 1,2, , ,2, , ,2, ,2,2,2,2,2,2,2,2,2,2,2,2,2,4, , , ,2,1,2, ,2,2,1,18, ,1,1,1, ,2, , , ,2, , , ,3, , , ,11, , , ,4, , , ,11, , , ,3, , , ,3, , , ,4, , , ,3, , , ,3, , , ,5, , , ,4, , , ,4, , , ,1,0,1.66,100,10,94, ,8,13:45:21,11/10/2021,1, ,673.754196636351,3,33,1
03003028,03003028_06,MQ245,15:17:30,19/10/2021,15:58:45,19/10/2021,41,1, , , , ,0,0, , , , ,0,0, , , , ,0,0,15:17:30,19/10/2021,03,03 BAJA CALIFORNIA SUR,003,003 LA PAZ,0009,1,0300300013195,1,2,2,10102018,11,02,1, , , , , , , , , , , , , , , , , , ,0, , ,1,11, , , , , , , , , , , , , , ,2, , , ,1,3, ,2, , , , , ,1,13, , , , , , , , , , , , , ,NO SE WINTIO APTS PARA DAR PECHO,1,2,2, , ,1,8,NIDO KINDER,1,2,LECHE ENTERA CARACOL,2, ,1,2,2,2,2,1,1,1,1,1,1,2,2,1,2, , ,2,1,2, ,3,2,2, ,4,1,1,4, ,1,2, ,12,1,2, ,12,3, , , ,8,2, ,4,2,2, ,6,1,2, ,6,1,2, ,4,1,2, ,12,1,2, ,4,1,2, ,12,1,2, ,4,3,2, ,6,4, , , ,2,2, ,6,1,1,1.71,90,10,85, ,41,15:58:45,19/10/2021,1, ,673.273155566534,3,33,1
03003036,03003036_03,MQ245,19:29:37,10/10/2021,19:46:40,10/10/2021,17,1, , , , ,0,0, , , , ,0,0, , , , ,0,0,19:29:37,10/10/2021,03,03 BAJA CALIFORNIA SUR,003,003 LA PAZ,0016,1,0300300013195,1,2,1,15122019,8,01,1, , , , , , , , , , , , , , , , , , ,2, ,3,2, , , , , , , , , , , , , , , ,1,1,1,2, , , ,2, , , , , ,1,13, , , , , , , , , , , , , ,POR TRABAJO Y LECHE MATERNA EN MAMILA NO LA ACEPTA,1,2,1,2,NAN 3,2, , ,2, , ,2, ,2,1,1,2,2,1,2,2,2,1,1,1,2,4, , , ,2,1,2, ,12,2,2, ,12,1,2, ,2,2, , , ,1,2, ,18,3, , , ,9,2, ,7,2,2, ,12,7,2, ,12,1,2, ,9,1,2, ,12,1,2, ,14,1,2, ,14,3, , , ,4,2, ,12,4, , , ,2,2, ,11,1,3,1.64,56,27,60, ,17,19:46:40,10/10/2021,1, ,868.103116334871,3,33,1