﻿FOLIO_I,ID_INT,FOLIO_INT,estrato,region_cv,est_sel,Upm,ENTIDAD,DESC_ENT,municipio,desc_mun,maquina,hora_ini_1,fecha_ini_1,hora_fin_1,fecha_fin_1,tiempo1,resultado_1,hora_ini_2,fecha_ini_2,hora_fin_2,fecha_fin_2,tiempo2,resultado_2,hora_ini_3,fecha_ini_3,hora_fin_3,fecha_fin_3,tiempo3,resultado_3,hora_ini_4,fecha_ini_4,hora_fin_4,fecha_fin_4,tiempo4,resultado_4,hora_ini,fecha_ini,localizado,nota1,H0302,H0303,H0304,MESES,nota01,an01_1,an01_2,an02,an03,nota02,an04_01,an04_02,an05,an06,an07,nota03,an08_01s,an08_01d,an08_02s,an08_02d,an08_03s,an08_03d,an09,an10,an11,comentario,tiempo,hora_fin,fecha_fin,completa,otroent,ponde_g,rural_20,ponde_g20,area_20
01001001,1,01001001_01,3,4,13,0100108010001,01,01 AGUASCALIENTES,001,001 AGUASCALIENTES,MQ009,22:11:59,12/10/2020,22:15:43,12/10/2020,4,1, , , , ,0,0, , , , ,0,0, , , , ,0,0,22:11:59,12/10/2020,1,1,1,71,8091949,1,1,79.05,79.05,2,1,1,163.9,163.9,1, , ,1,143,97,140,96,135,94,14:00,1,1, ,4,22:15:43,12/10/2020,1, ,9800.30881181668,3,9319.65935800019,2
01001001,2,01001001_02,3,4,13,0100108010001,01,01 AGUASCALIENTES,001,001 AGUASCALIENTES,MQ009,22:15:52,12/10/2020,22:33:28,12/10/2020,18,1, , , , ,0,0, , , , ,0,0, , , , ,0,0,22:15:52,12/10/2020,1,1,1,33,11121986,10,1,84.65,84.5,1,1,1,175.1,175,1, , ,1,137,96,130,89,133,93,20:10,1,1, ,18,22:33:28,12/10/2020,1, ,25339.6927907949,3,26458.3978028467,2
01001004,1,01001004_01,3,4,13,0100108010001,01,01 AGUASCALIENTES,001,001 AGUASCALIENTES,MQ009,21:07:31,13/10/2020,21:09:37,13/10/2020,2,1, , , , ,0,0, , , , ,0,0, , , , ,0,0,21:07:31,13/10/2020,1,1,2,71,5091949,1,1,67.1,66.95,1,1,1,149,149,1, , ,1,140,88,139,81,143,81,18:07,1,1, ,2,21:09:37,13/10/2020,1, ,11005.2594020827,3,14462.7957400202,2
01001004,2,01001004_02,3,4,13,0100108010001,01,01 AGUASCALIENTES,001,001 AGUASCALIENTES,MQ009,21:09:39,13/10/2020,21:49:57,13/10/2020,40,1, , , , ,0,0, , , , ,0,0, , , , ,0,0,21:09:39,13/10/2020,1,1,2,18,12072002,3,1,64,64.1,1,1,1,148,148.1,1,4, , , , , , , , , , , , ,40,21:49:57,13/10/2020,1, ,26252.576135898,3,18417.0776640529,2
01001006,1,01001006_01,3,4,13,0100108010001,01,01 AGUASCALIENTES,001,001 AGUASCALIENTES,MQ004,22:57:07,13/10/2020,22:59:24,13/10/2020,2,1, , , , ,0,0, , , , ,0,0, , , , ,0,0,22:57:07,13/10/2020,1,1,2,75,18061945,3,1,59.55,59.5,1,1,1,141.8,141.7,1, , ,1,117,65,117,67,118,61,12:40,1,1,NINGUNO,2,22:59:24,13/10/2020,1, ,11005.2594020827,3,14462.7957400202,2
01001007,1,01001007_01,3,4,13,0100108010001,01,01 AGUASCALIENTES,001,001 AGUASCALIENTES,MQ004,23:45:16,12/10/2020,23:47:25,12/10/2020,2,1, , , , ,0,0, , , , ,0,0, , , , ,0,0,23:45:16,12/10/2020,1,1,1,73,13061947,3,1,75.9,75.85,1,1,1,168.9,168.9,1, , ,1,145,71,151,71,142,70,11:52,1,1,NINGUNO,2,23:47:25,12/10/2020,1, ,9871.0774056127,3,9386.95715443578,2
01001008,1,01001008_01,3,4,13,0100108010001,01,01 AGUASCALIENTES,001,001 AGUASCALIENTES,MQ004,23:31:05,12/10/2020,23:32:23,12/10/2020,1,1, , , , ,0,0, , , , ,0,0, , , , ,0,0,23:31:05,12/10/2020,1,1,1,77,31011943,8,1,76.1,76.05,1,1,1,167.6,167.5,1, , ,1,122,65,131,60,126,65,20:57,1,1,NINGUNO,1,23:32:23,12/10/2020,1, ,19742.1548112254,3,18773.9143088716,2
01001008,3,01001008_03,3,4,13,0100108010001,01,01 AGUASCALIENTES,001,001 AGUASCALIENTES,MQ004,23:32:25,12/10/2020,23:35:20,12/10/2020,3,1, , , , ,0,0, , , , ,0,0, , , , ,0,0,23:32:25,12/10/2020,1,1,1,39,14101980,11,1,91.35,91.2,1,1,1,169.2,169.4,1, , ,1,141,84,145,89,134,86,17:50,1,1,PACIENTE CON HAS Y DM2 TOMA INSULINA LOSARTAN,3,23:35:20,12/10/2020,1, ,19384.9844398903,3,26380.814653192,2
01001009,2,01001009_02,3,4,13,0100108010001,01,01 AGUASCALIENTES,001,001 AGUASCALIENTES,MQ004,23:27:05,12/10/2020,23:29:45,12/10/2020,2,1, , , , ,0,0, , , , ,0,0, , , , ,0,0,23:27:05,12/10/2020,1,1,2,40,30091980,0,1,78.35,78.35,1,1,1,166.2,166.2,1,4, ,1,119,83,128,91,116,70,19:40,1,1,NINGUNO,2,23:29:45,12/10/2020,1, ,25490.3160358318,3,22527.5245626883,2
01001009,3,01001009_03,3,4,13,0100108010001,01,01 AGUASCALIENTES,001,001 AGUASCALIENTES,MQ004,23:23:58,12/10/2020,23:27:03,12/10/2020,4,1, , , , ,0,0, , , , ,0,0, , , , ,0,0,23:23:58,12/10/2020,1,1,1,16,28012004,8,1,74.65,74.55,1,1,1,169.3,169.4,1, , , , , , , , , , , , ,NINGUNO,4,23:27:03,12/10/2020,1, ,42292.6265841364,3,62210.7850942433,2
01001010,2,01001010_02,3,4,13,0100108010001,01,01 AGUASCALIENTES,001,001 AGUASCALIENTES,MQ009,23:14:32,12/10/2020,23:17:24,12/10/2020,3,1, , , , ,0,0, , , , ,0,0, , , , ,0,0,23:14:32,12/10/2020,1,1,2,35,30111984,10,1,83.4,83.55,1,1,1,157.3,157.5,1,4, ,1,109,65,102,60,108,67,17:02,1,1, ,3,23:17:24,12/10/2020,1, ,26960.8405425376,3,23827.127003799,2
01001010,3,01001010_03,3,4,13,0100108010001,01,01 AGUASCALIENTES,001,001 AGUASCALIENTES,MQ009,23:17:26,12/10/2020,23:18:48,12/10/2020,1,1, , , , ,0,0, , , , ,0,0, , , , ,0,0,23:17:26,12/10/2020,1,1,2,9,19092011,0,1,42.05,42.05,1,1,1,129.7,129.8,1, , , , , , , , , , , , , ,1,23:18:48,12/10/2020,1, ,17583.0387685872,3,16002.749882141,2
01001011,1,01001011_01,3,4,13,0100108010001,01,01 AGUASCALIENTES,001,001 AGUASCALIENTES,MQ009,21:04:04,13/10/2020,21:06:07,13/10/2020,2,1, , , , ,0,0, , , , ,0,0, , , , ,0,0,21:04:04,13/10/2020,1,1,1,78,1081942,2,1,76.75,76.9,1,1,1,158.9,158.9,1, , ,1,159,67,159,70,153,70,14:29,1,1, ,2,21:06:07,13/10/2020,1, ,23106.8027928573,3,21973.5454276974,2
01001012,1,01001012_01,3,4,13,0100108010001,01,01 AGUASCALIENTES,001,001 AGUASCALIENTES,MQ004,23:02:11,13/10/2020,23:06:52,13/10/2020,4,1, , , , ,0,0, , , , ,0,0, , , , ,0,0,23:02:11,13/10/2020,1,1,2,74,3051946,5,1,73.95,73.95,1,1,1,148.9,148.9,1, , ,1,143,80,148,74,157,76,19:15,1,1,NINGUNO,4,23:06:52,13/10/2020,1, ,12973.8951889734,3,17049.9203349121,2
01001014,1,01001014_01,3,4,13,0100108010001,01,01 AGUASCALIENTES,001,001 AGUASCALIENTES,MQ009,21:58:07,14/10/2020,22:00:22,14/10/2020,2,1, , , , ,0,0, , , , ,0,0, , , , ,0,0,21:58:07,14/10/2020,1,1,1,58,28061962,3,1,78.95,78.85,1,1,1,168.4,168.2,1, , ,1,151,87,141,89,140,84,08:51,1,1, ,2,22:00:22,14/10/2020,1, ,23106.8027928573,3,21973.5454276974,2
01001015,2,01001015_02,3,4,13,0100108010001,01,01 AGUASCALIENTES,001,001 AGUASCALIENTES,MQ004,22:59:39,13/10/2020,23:02:07,13/10/2020,3,1, , , , ,0,0, , , , ,0,0, , , , ,0,0,22:59:39,13/10/2020,1,1,2,56,26071964,2,1,69.1,69.1,1,1,1,155.5,155.5,1, , ,1,152,79,153,83,154,81,20:09,1,1,NINGUNO,3,23:02:07,13/10/2020,1, ,22307.1565238981,3,29315.4242493131,2
01001015,3,01001015_03,3,4,13,0100108010001,01,01 AGUASCALIENTES,001,001 AGUASCALIENTES,MQ004,15:37:12,09/11/2020,15:40:55,09/11/2020,3,1, , , , ,0,0, , , , ,0,0, , , , ,0,0,15:37:12,09/11/2020,1,1,2,26,21111993,10,1,74,74,1,1,1,165.8,165.8,1,4, ,1,106,79,101,78,108,79,20:02,1,1, ,3,15:40:55,09/11/2020,1, ,15547.2152501755,3,15797.1349639882,2
01001016,2,01001016_02,3,4,13,0100108010001,01,01 AGUASCALIENTES,001,001 AGUASCALIENTES,MQ004,23:42:25,12/10/2020,23:44:25,12/10/2020,2,1, , , , ,0,0, , , , ,0,0, , , , ,0,0,23:42:25,12/10/2020,1,1,2,21,3021999,8,1,51.9,51.9,1,1,1,150.2,150.4,1,4, ,1,95,56,105,56,90,52,13:05,1,1,NINGUNO,2,23:44:25,12/10/2020,1, ,28927.8399724817,3,29392.8517042169,2
01001016,3,01001016_03,3,4,13,0100108010001,01,01 AGUASCALIENTES,001,001 AGUASCALIENTES,MQ004,23:41:33,12/10/2020,23:42:23,12/10/2020,1,1, , , , ,0,0, , , , ,0,0, , , , ,0,0,23:41:33,12/10/2020,1,1,1,6,11042014,6,1,21.8,21.8,1,1,1,122,122.1,1, , , , , , , , , , , , ,NINGUNO,1,23:42:23,12/10/2020,1, ,14765.6180018005,3,15216.0815317996,2
01001016,4,01001016_04,3,4,13,0100108010001,01,01 AGUASCALIENTES,001,001 AGUASCALIENTES,MQ004,23:38:55,12/10/2020,23:39:54,12/10/2020,1,1, , , , ,0,0, , , , ,0,0, , , , ,0,0,23:38:55,12/10/2020,1,1,2,4,12112015,11,1,15.4,15.45,1,1,1,101.2,101.2,1, , , , , , , , , , , , ,NINGUNO,1,23:39:54,12/10/2020,1, ,18092.2910912282,3,19227.4974214669,2
01001016,5,01001016_05,3,4,13,0100108010001,01,01 AGUASCALIENTES,001,001 AGUASCALIENTES,MQ004,23:35:40,12/10/2020,23:38:50,12/10/2020,3,1, , , , ,0,0, , , , ,0,0, , , , ,0,0,23:35:40,12/10/2020,1,1,1,0,12052020,5,1,5.95,5.9,1,1,1,63.4,63.4,1, , , , , , , , , , , , ,NINGUNO,3,23:38:50,12/10/2020,1, ,19814.990059557,3,19602.1739317396,2
01001018,1,01001018_01,3,4,13,0100108010001,01,01 AGUASCALIENTES,001,001 AGUASCALIENTES,MQ009,23:03:14,12/10/2020,23:05:33,12/10/2020,2,1, , , , ,0,0, , , , ,0,0, , , , ,0,0,23:03:14,12/10/2020,1,1,1,62,4051958,5,1,96.55,96.4,2,1,1,172.2,172.1,1, , ,1,126,87,125,87,129,78,13:51,1,1, ,2,23:05:33,12/10/2020,1, ,19376.2987705327,3,18426.0014278803,2
01001019,2,01001019_02,3,4,13,0100108010001,01,01 AGUASCALIENTES,001,001 AGUASCALIENTES,MQ009,23:06:24,12/10/2020,23:11:46,12/10/2020,5,1, , , , ,0,0, , , , ,0,0, , , , ,0,0,23:06:24,12/10/2020,1,1,2,48,23051972,4,1,64,63.9,1,1,1,158.1,158,1,4, ,1,142,107,142,96,138,95,20:44,1,1, ,5,23:11:46,12/10/2020,1, ,25017.9366937565,3,22110.0508359385,2
01001019,4,01001019_04,3,4,13,0100108010001,01,01 AGUASCALIENTES,001,001 AGUASCALIENTES,MQ009,23:11:48,12/10/2020,23:13:53,12/10/2020,2,1, , , , ,0,0, , , , ,0,0, , , , ,0,0,23:11:48,12/10/2020,1,1,1,22,13101997,11,1,75.15,75.05,1,1,1,180.3,180.2,1, , ,1,125,64,121,59,121,62,16:24,1,1, ,2,23:13:53,12/10/2020,1, ,43270.80910087,3,45181.1428770659,2
01001021,1,01001021_01,3,4,13,0100108010001,01,01 AGUASCALIENTES,001,001 AGUASCALIENTES,MQ009,20:56:41,13/10/2020,20:58:45,13/10/2020,2,1, , , , ,0,0, , , , ,0,0, , , , ,0,0,20:56:41,13/10/2020,1,1,2,42,7011978,9,1,88.35,88.45,1,1,1,162.1,162,1,4, ,1,109,69,107,70,102,71,12:51,1,1, ,2,20:58:45,13/10/2020,1, ,25017.9366937565,3,22110.0508359385,2
01001021,3,01001021_03,3,4,13,0100108010001,01,01 AGUASCALIENTES,001,001 AGUASCALIENTES,MQ009,20:58:47,13/10/2020,21:01:32,13/10/2020,3,1, , , , ,0,0, , , , ,0,0, , , , ,0,0,20:58:47,13/10/2020,1,1,2,29,27081991,1,1,72.8,72.9,1,1,1,160,160,1,4, ,1,109,81,104,73,106,70,13:11,1,1, ,3,21:01:32,13/10/2020,1, ,15164.9066784498,3,15408.6808255295,2
01001021,4,01001021_04,3,4,13,0100108010001,01,01 AGUASCALIENTES,001,001 AGUASCALIENTES,MQ009,21:02:06,13/10/2020,21:03:21,13/10/2020,1,1, , , , ,0,0, , , , ,0,0, , , , ,0,0,21:02:06,13/10/2020,1,1,2,1,17012019,8,1,12.45,12.4,1,1,1,85,85,1, , , , , , , , , , , , , ,1,21:03:21,13/10/2020,1, ,17647.3986873456,3,18754.6901078242,2
01001022,1,01001022_01,3,4,13,0100108010001,01,01 AGUASCALIENTES,001,001 AGUASCALIENTES,MQ009,23:19:27,12/10/2020,23:21:22,12/10/2020,2,1, , , , ,0,0, , , , ,0,0, , , , ,0,0,23:19:27,12/10/2020,1,1,2,47,1101973,0,1,64.35,64.35,1,1,1,163.6,163.6,1,4, ,1,103,64,106,65,105,65,17:58,1,1, ,2,23:21:22,12/10/2020,1, ,12508.9683468783,3,11055.0254179693,2
01001022,2,01001022_02,3,4,13,0100108010001,01,01 AGUASCALIENTES,001,001 AGUASCALIENTES,MQ009,23:21:24,12/10/2020,23:23:31,12/10/2020,2,1, , , , ,0,0, , , , ,0,0, , , , ,0,0,23:21:24,12/10/2020,1,1,2,24,26111995,10,1,83.8,83.8,1,1,1,159.4,159.5,1,4, ,1,108,81,103,78,104,74,18:05,1,1, ,2,23:23:31,12/10/2020,1, ,15164.9066784498,3,15408.6808255295,2
01001022,3,01001022_03,3,4,13,0100108010001,01,01 AGUASCALIENTES,001,001 AGUASCALIENTES,MQ009,20:53:57,13/10/2020,20:56:00,13/10/2020,3,1, , , , ,0,0, , , , ,0,0, , , , ,0,0,20:53:57,13/10/2020,1,1,1,3,23022017,7,1,13.4,13.45,1,1,1,95.5,95.7,1, , , , , , , , , , , , , ,3,20:56:00,13/10/2020,1, ,19327.7362056335,3,19120.153261287,2
01009001,1,01009001_01,1,4,11,0100900340000,01,01 AGUASCALIENTES,009,009 TEPEZALÁ,MQ009,22:03:10,14/10/2020,22:05:54,14/10/2020,2,1, , , , ,0,0, , , , ,0,0, , , , ,0,0,22:03:10,14/10/2020,1,1,1,54,13021966,8,1,82.5,82.5,1,1,1,168.6,168.8,1, , ,1,142,80,124,82,126,83,14:50,1,1, ,2,22:05:54,14/10/2020,1, ,2912.74376811534,1,2975.3547451921,1
01009001,2,01009001_02,1,4,11,0100900340000,01,01 AGUASCALIENTES,009,009 TEPEZALÁ,MQ009,22:06:13,14/10/2020,22:08:13,14/10/2020,2,1, , , , ,0,0, , , , ,0,0, , , , ,0,0,22:06:13,14/10/2020,1,1,2,49,16121970,9,1,78.8,78.75,1,1,1,154.3,154.5,1,4, ,1,119,85,116,79,117,82,14:44,1,1, ,2,22:08:13,14/10/2020,1, ,3760.82347092339,1,3774.33527632999,1
01009001,3,01009001_03,1,4,11,0100900340000,01,01 AGUASCALIENTES,009,009 TEPEZALÁ,MQ009,22:08:37,14/10/2020,22:11:18,14/10/2020,3,1, , , , ,0,0, , , , ,0,0, , , , ,0,0,22:08:37,14/10/2020,1,1,1,20,28022000,7,1,94.5,94.6,1,1,1,178.8,178.8,1, , ,1,134,86,127,70,126,69,14:55,1,1, ,3,22:11:18,14/10/2020,1, ,7531.19454494651,1,6029.73349671068,1
01009002,1,01009002_01,1,4,11,0100900340000,01,01 AGUASCALIENTES,009,009 TEPEZALÁ,MQ009,20:31:31,15/10/2020,20:34:44,15/10/2020,3,1, , , , ,0,0, , , , ,0,0, , , , ,0,0,20:31:31,15/10/2020,1,1,1,59,17081961,1,1,77.4,77.4,1,1,1,176.7,176.5,1, , ,1,125,80,123,77,130,82,11:35,1,1, ,3,20:34:44,15/10/2020,1, ,5825.48753623067,1,5950.70949038419,1
01009002,3,01009002_03,1,4,11,0100900340000,01,01 AGUASCALIENTES,009,009 TEPEZALÁ,MQ009,20:34:46,15/10/2020,20:36:08,15/10/2020,2,1, , , , ,0,0, , , , ,0,0, , , , ,0,0,20:34:46,15/10/2020,1,1,1,17,30122002,9,1,57.2,57.3,1,1,1,180.4,180.5,1, , , , , , , , , , , , , ,2,20:36:08,15/10/2020,1, ,23664.1576419174,1,23493.196706416,1
01009004,2,01009004_02,1,4,11,0100900340000,01,01 AGUASCALIENTES,009,009 TEPEZALÁ,MQ004,22:19:26,14/10/2020,22:20:56,14/10/2020,1,1, , , , ,0,0, , , , ,0,0, , , , ,0,0,22:19:26,14/10/2020,1,1,2,39,18071981,2,1,97.55,97.65,1,1,1,151.7,151.7,1,4, ,1,112,78,101,62,105,62,15:14,1,1, ,1,22:20:56,14/10/2020,1, ,7521.64694184677,1,7548.67055265998,1
01009004,4,01009004_04,1,4,11,0100900340000,01,01 AGUASCALIENTES,009,009 TEPEZALÁ,MQ004,22:16:30,14/10/2020,22:19:02,14/10/2020,3,1, , , , ,0,0, , , , ,0,0, , , , ,0,0,22:16:30,14/10/2020,1,1,1,21,14081999,2,1,56.8,56.7,1,1,1,147.1,147,1, , ,1,112,79,116,83,112,79,15:24,1,1,NINGUNO,3,22:19:02,14/10/2020,1, ,15062.389089893,1,12059.4669934214,1
01009004,7,01009004_07,1,4,11,0100900340000,01,01 AGUASCALIENTES,009,009 TEPEZALÁ,MQ004,22:15:18,14/10/2020,22:16:11,14/10/2020,1,1, , , , ,0,0, , , , ,0,0, , , , ,0,0,22:15:18,14/10/2020,1,1,1,7,9062013,4,1,19.7,19.7,1,1,1,117.1,117.1,1, , , , , , , , , , , , ,NINGUNO,1,22:16:11,14/10/2020,1, ,4330.12281522663,1,3593.92109480105,1
01009004,8,01009004_08,1,4,11,0100900340000,01,01 AGUASCALIENTES,009,009 TEPEZALÁ,MQ004,22:13:01,14/10/2020,22:14:53,14/10/2020,1,1, , , , ,0,0, , , , ,0,0, , , , ,0,0,22:13:01,14/10/2020,1,1,1,2,29072018,2,1,7.8,7.8,1,1,1,83.1,83.2,1, , , , , , , , , , , , ,NINGUNO,1,22:14:53,14/10/2020,1, ,5810.88719279574,1,4726.57993763884,1
01009005,2,01009005_02,1,4,11,0100900340000,01,01 AGUASCALIENTES,009,009 TEPEZALÁ,MQ004,22:02:41,14/10/2020,22:04:23,14/10/2020,2,1, , , , ,0,0, , , , ,0,0, , , , ,0,0,22:02:41,14/10/2020,1,1,2,74,10121945,10,1,54.75,54.75,1,1,1,153.1,153.2,1, , ,1,110,67,106,66,108,66,21:15,1,1,NINGUNO,2,22:04:23,14/10/2020,1, ,6541.73278728899,1,5514.49991306539,1
01009007,1,01009007_01,1,4,11,0100900340000,01,01 AGUASCALIENTES,009,009 TEPEZALÁ,MQ009,22:44:40,14/10/2020,22:47:31,14/10/2020,3,1, , , , ,0,0, , , , ,0,0, , , , ,0,0,22:44:40,14/10/2020,1,1,2,35,28091985,0,1,51.1,51,1,1,1,157.4,157.5,1,4, ,1,135,95,140,105,149,94,20:49,1,1, ,3,22:47:31,14/10/2020,1, ,3760.82347092339,1,3774.33527632999,1
01009007,2,01009007_02,1,4,11,0100900340000,01,01 AGUASCALIENTES,009,009 TEPEZALÁ,MQ009,22:47:49,14/10/2020,22:49:14,14/10/2020,2,1, , , , ,0,0, , , , ,0,0, , , , ,0,0,22:47:49,14/10/2020,1,1,2,12,20092008,0,1,39.05,39.05,1,1,1,159.8,159.8,1,4, , , , , , , , , , , , ,2,22:49:14,14/10/2020,1, ,7802.51204376444,1,11049.3351139491,1
01009007,4,01009007_04,1,4,11,0100900340000,01,01 AGUASCALIENTES,009,009 TEPEZALÁ,MQ009,22:49:35,14/10/2020,22:51:15,14/10/2020,2,1, , , , ,0,0, , , , ,0,0, , , , ,0,0,22:49:35,14/10/2020,1,1,1,8,15052012,4,1,26.1,26.05,1,1,1,126.6,126.7,1, , , , , , , , , , , , , ,2,22:51:15,14/10/2020,1, ,8660.24563045326,1,7187.84218960211,1
01009007,5,01009007_05,1,4,11,0100900340000,01,01 AGUASCALIENTES,009,009 TEPEZALÁ,MQ009,22:51:30,14/10/2020,22:53:37,14/10/2020,2,1, , , , ,0,0, , , , ,0,0, , , , ,0,0,22:51:30,14/10/2020,1,1,2,77,9071943,3,1,46.15,46.25,1,1,1,145,144.5,1, , ,1,192,84,173,79,180,83,20:41,1,1, ,2,22:53:37,14/10/2020,1, ,3270.8663936445,1,2757.24995653269,1
01009008,1,01009008_01,1,4,11,0100900340000,01,01 AGUASCALIENTES,009,009 TEPEZALÁ,MQ009,22:11:54,14/10/2020,22:14:50,14/10/2020,3,1, , , , ,0,0, , , , ,0,0, , , , ,0,0,22:11:54,14/10/2020,1,1,2,36,7051984,5,1,68.4,68.3,1,1,1,158.6,158.5,1,4, ,1,105,74,110,70,111,77,15:54,1,1, ,3,22:14:50,14/10/2020,1, ,3760.82347092339,1,3774.33527632999,1
01009008,4,01009008_04,1,4,11,0100900340000,01,01 AGUASCALIENTES,009,009 TEPEZALÁ,MQ009,22:14:52,14/10/2020,22:17:06,14/10/2020,3,1, , , , ,0,0, , , , ,0,0, , , , ,0,0,22:14:52,14/10/2020,1,1,1,7,26032013,6,1,37.95,37.9,1,1,1,123.5,123.8,1, , , , , , , , , , , , , ,3,22:17:06,14/10/2020,1, ,8660.24563045326,1,7187.84218960211,1
01009009,1,01009009_01,1,4,11,0100900340000,01,01 AGUASCALIENTES,009,009 TEPEZALÁ,MQ009,22:17:58,14/10/2020,22:22:33,14/10/2020,5,1, , , , ,0,0, , , , ,0,0, , , , ,0,0,22:17:58,14/10/2020,1,1,1,32,8121987,10,1,87.9,87.9,1,1,1,176.5,176.4,1, , ,1,125,87,124,86,117,83,19:10,1,1, ,5,22:22:33,14/10/2020,1, ,15062.389089893,1,12059.4669934214,1
01009009,3,01009009_03,1,4,11,0100900340000,01,01 AGUASCALIENTES,009,009 TEPEZALÁ,MQ009,22:22:42,14/10/2020,22:24:36,14/10/2020,2,1, , , , ,0,0, , , , ,0,0, , , , ,0,0,22:22:42,14/10/2020,1,1,1,12,27042008,5,1,51.3,51.4,1,1,1,151.3,151,1, , , , , , , , , , , , , ,2,22:24:36,14/10/2020,1, ,11832.0788209587,1,11746.598353208,1
01009010,1,01009010_01,1,4,11,0100900340000,01,01 AGUASCALIENTES,009,009 TEPEZALÁ,MQ004,22:09:36,14/10/2020,22:12:47,14/10/2020,3,1, , , , ,0,0, , , , ,0,0, , , , ,0,0,22:09:36,14/10/2020,1,1,1,48,10051972,5,1,79.75,79.5,1,1,1,162.8,162.7,1, , ,1,151,78,144,77,149,78,18:53,1,1,NINGUNO,3,22:12:47,14/10/2020,1, ,11440.1884013589,1,9409.59918390557,1
01009010,3,01009010_03,1,4,11,0100900340000,01,01 AGUASCALIENTES,009,009 TEPEZALÁ,MQ004,22:07:12,14/10/2020,22:09:12,14/10/2020,2,1, , , , ,0,0, , , , ,0,0, , , , ,0,0,22:07:12,14/10/2020,1,1,2,65,30101954,11,1,76.2,76.3,1,1,1,160.5,160.5,1, , ,1,122,79,119,75,125,77,19:16,1,1,NINGUNO,2,22:09:12,14/10/2020,1, ,3270.8663936445,1,2757.24995653269,1
01009010,4,01009010_04,1,4,11,0100900340000,01,01 AGUASCALIENTES,009,009 TEPEZALÁ,MQ004,22:04:49,14/10/2020,22:06:50,14/10/2020,2,1, , , , ,0,0, , , , ,0,0, , , , ,0,0,22:04:49,14/10/2020,1,1,2,20,18111999,10,1,60.75,60.8,1,1,1,156.6,156.6,1,4, ,1,97,65,98,68,94,60,19:26,1,1,NINGUNO,2,22:06:50,14/10/2020,1, ,4559.3317841363,1,3631.091530511,1
01009011,2,01009011_02,1,4,11,0100900340000,01,01 AGUASCALIENTES,009,009 TEPEZALÁ,MQ009,20:58:43,15/10/2020,21:01:57,15/10/2020,3,1, , , , ,0,0, , , , ,0,0, , , , ,0,0,20:58:43,15/10/2020,1,1,2,36,4061984,4,1,65.95,66,1,1,1,162.8,162.8,1,1,2,1,110,70,104,66,105,65,13:29,1,1, ,3,21:01:57,15/10/2020,1, ,7520.85921700247,1,7547.87999769486,1
01009012,2,01009012_02,1,4,11,0100900340000,01,01 AGUASCALIENTES,009,009 TEPEZALÁ,MQ009,21:02:30,15/10/2020,21:04:18,15/10/2020,2,1, , , , ,0,0, , , , ,0,0, , , , ,0,0,21:02:30,15/10/2020,1,1,2,74,24061946,3,1,68.55,68.6,1,1,1,150.5,150.4,1, , ,1,113,57,113,56,111,54,13:15,1,1, ,2,21:04:18,15/10/2020,1, ,6541.04768660809,1,5513.92239212895,1
01009013,2,01009013_02,1,4,11,0100900340000,01,01 AGUASCALIENTES,009,009 TEPEZALÁ,MQ009,21:32:57,16/10/2020,21:35:46,16/10/2020,3,1, , , , ,0,0, , , , ,0,0, , , , ,0,0,21:32:57,16/10/2020,1,1,2,25,14011995,9,1,74.2,74.25,1,1,1,162.2,162.3,1,4, ,1,107,81,110,77,104,72,11:37,1,1, ,3,21:35:46,16/10/2020,1, ,4558.85429576872,1,3630.71125461762,1
01009013,3,01009013_03,1,4,11,0100900340000,01,01 AGUASCALIENTES,009,009 TEPEZALÁ,MQ009,21:36:32,16/10/2020,21:38:02,16/10/2020,2,1, , , , ,0,0, , , , ,0,0, , , , ,0,0,21:36:32,16/10/2020,1,1,2,1,25032019,6,1,10.8,10.8,1,1,1,79.9,79.9,1, , , , , , , , , , , , , ,2,21:38:02,16/10/2020,1, ,5305.13777768743,1,4519.24891080562,1
01009014,1,01009014_01,1,4,11,0100900340000,01,01 AGUASCALIENTES,009,009 TEPEZALÁ,MQ009,21:04:32,15/10/2020,21:06:42,15/10/2020,2,1, , , , ,0,0, , , , ,0,0, , , , ,0,0,21:04:32,15/10/2020,1,1,2,53,15071967,3,1,64.15,64.1,1,1,1,151,151,1, , ,1,135,82,133,83,135,84,15:36,1,1, ,2,21:06:42,15/10/2020,1, ,3270.52384330405,1,2756.96119606448,1
01009015,2,01009015_02,1,4,11,0100900340000,01,01 AGUASCALIENTES,009,009 TEPEZALÁ,MQ004,23:14:41,15/10/2020,23:16:27,15/10/2020,2,1, , , , ,0,0, , , , ,0,0, , , , ,0,0,23:14:41,15/10/2020,1,1,2,39,29031981,6,1,83.6,83.7,1,1,1,156.9,156.9,1,4, ,1,115,76,116,75,115,73,18:37,1,1, ,2,23:16:27,15/10/2020,1, ,3760.42960850124,1,3773.93999884743,1
01009015,4,01009015_04,1,4,11,0100900340000,01,01 AGUASCALIENTES,009,009 TEPEZALÁ,MQ004,23:16:29,15/10/2020,23:17:14,15/10/2020,1,1, , , , ,0,0, , , , ,0,0, , , , ,0,0,23:16:29,15/10/2020,1,1,2,5,13112014,11,1,21.05,21,1,1,1,117.9,117.9,1, , , , , , , , , , , , , ,1,23:17:14,15/10/2020,1, ,8864.83923182583,1,8682.26990555791,1
01009016,1,01009016_01,1,4,11,0100900340000,01,01 AGUASCALIENTES,009,009 TEPEZALÁ,MQ004,23:24:29,15/10/2020,23:25:55,15/10/2020,1,1, , , , ,0,0, , , , ,0,0, , , , ,0,0,23:24:29,15/10/2020,1,1,1,25,7041995,6,1,65.3,65.4,1,1,1,155.1,155.1,1, , ,1,105,49,92,52,98,51,11:22,1,1, ,1,23:25:55,15/10/2020,1, ,15060.8116404072,1,12058.2040330839,1
01009016,3,01009016_03,1,4,11,0100900340000,01,01 AGUASCALIENTES,009,009 TEPEZALÁ,MQ004,23:25:57,15/10/2020,23:26:46,15/10/2020,1,1, , , , ,0,0, , , , ,0,0, , , , ,0,0,23:25:57,15/10/2020,1,1,2,4,9022016,8,1,16.55,16.5,1,1,1,99.5,99.4,1, , , , , , , , , , , , , ,1,23:26:46,15/10/2020,1, ,5305.13777768743,1,4519.24891080562,1
01009017,4,01009017_04,1,4,11,0100900340000,01,01 AGUASCALIENTES,009,009 TEPEZALÁ,MQ004,23:19:32,15/10/2020,23:20:28,15/10/2020,1,1, , , , ,0,0, , , , ,0,0, , , , ,0,0,23:19:32,15/10/2020,1,1,2,13,17052007,4,1,51.5,51.5,1,1,1,160,160.1,1,4, , , , , , , , , , , , ,1,23:20:28,15/10/2020,1, ,15603.3898091235,1,22096.3558848162,1
01009017,5,01009017_05,1,4,11,0100900340000,01,01 AGUASCALIENTES,009,009 TEPEZALÁ,MQ004,23:20:31,15/10/2020,23:21:27,15/10/2020,1,1, , , , ,0,0, , , , ,0,0, , , , ,0,0,23:20:31,15/10/2020,1,1,1,5,11042015,6,1,19.6,19.6,1,1,1,110.5,110.5,1, , , , , , , , , , , , , ,1,23:21:27,15/10/2020,1, ,4329.66933138901,1,3593.54471168221,1
01009020,1,01009020_01,1,4,11,0100900340000,01,01 AGUASCALIENTES,009,009 TEPEZALÁ,MQ004,23:21:41,15/10/2020,23:23:02,15/10/2020,2,1, , , , ,0,0, , , , ,0,0, , , , ,0,0,23:21:41,15/10/2020,1,1,1,61,26081959,1,1,79.6,79.6,1,1,1,170.5,170.5,1, , ,1,118,62,122,60,115,83,14:26,1,1, ,2,23:23:02,15/10/2020,1, ,2912.43872313663,1,2975.04314310927,1
01009020,2,01009020_02,1,4,11,0100900340000,01,01 AGUASCALIENTES,009,009 TEPEZALÁ,MQ004,23:23:04,15/10/2020,23:24:17,15/10/2020,1,1, , , , ,0,0, , , , ,0,0, , , , ,0,0,23:23:04,15/10/2020,1,1,2,36,21051984,4,1,110.15,110.1,1,1,1,159.2,159.2,1,4, ,1,106,76,107,94,104,81,14:31,1,1, ,1,23:24:17,15/10/2020,1, ,3760.42960850124,1,3773.93999884743,1
01009021,3,01009021_03,1,4,11,0100900340000,01,01 AGUASCALIENTES,009,009 TEPEZALÁ,MQ004,23:17:20,15/10/2020,23:18:38,15/10/2020,1,1, , , , ,0,0, , , , ,0,0, , , , ,0,0,23:17:20,15/10/2020,1,1,2,23,17111996,10,1,80,80.1,1,1,1,157.2,157.4,1,4, ,1,120,78,121,79,118,79,19:30,1,1, ,1,23:18:38,15/10/2020,1, ,13676.5628873062,1,10892.1337638529,1
01009021,4,01009021_04,1,4,11,0100900340000,01,01 AGUASCALIENTES,009,009 TEPEZALÁ,MQ004,23:18:40,15/10/2020,23:19:26,15/10/2020,1,1, , , , ,0,0, , , , ,0,0, , , , ,0,0,23:18:40,15/10/2020,1,1,2,9,22012011,8,1,38.15,38.15,1,1,1,139.3,139.2,1, , , , , , , , , , , , , ,1,23:19:26,15/10/2020,1, ,8864.83923182583,1,8682.26990555791,1
01009021,6,01009021_06,1,4,11,0100900340000,01,01 AGUASCALIENTES,009,009 TEPEZALÁ,MQ004,23:13:46,15/10/2020,23:14:37,15/10/2020,1,1, , , , ,0,0, , , , ,0,0, , , , ,0,0,23:13:46,15/10/2020,1,1,2,2,30042018,5,1,13.55,13.55,1,1,1,90.9,90.8,1, , , , , , , , , , , , , ,1,23:14:37,15/10/2020,1, ,5305.13777768743,1,4519.24891080562,1
01009022,1,01009022_01,1,4,11,0100900340000,01,01 AGUASCALIENTES,009,009 TEPEZALÁ,MQ009,21:38:31,16/10/2020,21:40:32,16/10/2020,2,1, , , , ,0,0, , , , ,0,0, , , , ,0,0,21:38:31,16/10/2020,1,1,1,39,21031981,6,1,108.55,108.55,1,1,1,176.3,176.4,1, , ,1,131,83,126,81,131,80,20:15,1,1, ,2,21:40:32,16/10/2020,1, ,11438.990296649,1,9408.61373815022,1