﻿FOLIO_I,ID_INT,FOLIO_INT,estrato,region_cv,est_sel,Upm,ENTIDAD,DESC_ENT,municipio,desc_mun,maquina,hora_ini_1,fecha_ini_1,hora_fin_1,fecha_fin_1,tiempo1,resultado_1,hora_ini_2,fecha_ini_2,hora_fin_2,fecha_fin_2,tiempo2,resultado_2,hora_ini_3,fecha_ini_3,hora_fin_3,fecha_fin_3,tiempo3,resultado_3,hora_ini_4,fecha_ini_4,hora_fin_4,fecha_fin_4,tiempo4,resultado_4,hora_ini,fecha_ini,localizado,H0302,H0303,H0304,MESES,nota1,edad,sexo,nota2,p_t_maiz,p_t_trigo,consumo,comentario,tiempo,hora_fin,fecha_fin,completa,otroent,ponde_g,rural_20,ponde_g20,area_20
01001009,3,01001009_03,3,4,13,0100108010001,01,01 AGUASCALIENTES,001,001 AGUASCALIENTES,MQ214,19:42:57,12/10/2020,20:07:08,12/10/2020,25,1, , , , ,0,0, , , , ,0,0, , , , ,0,0,19:42:57,12/10/2020,1,1,16,28012004,8,1,16,1,1,26,0,2,NINGUNO,25,20:07:08,12/10/2020,1, ,123123.862880871,3,123676.346909925,2
01001012,3,01001012_03,3,4,13,0100108010001,01,01 AGUASCALIENTES,001,001 AGUASCALIENTES,MQ214,08:26:52,14/10/2020,09:01:47,14/10/2020,35,1, , , , ,0,0, , , , ,0,0, , , , ,0,0,08:26:52,14/10/2020,1,2,43,20101976,11,1,43,2,1,0, ,1,NINGUNO,35,09:01:47,14/10/2020,1, ,153395.481563698,3,149942.639156123,2
01009004,2,01009004_02,1,4,11,0100900340000,01,01 AGUASCALIENTES,009,009 TEPEZALÁ,MQ217,15:28:26,14/10/2020,18:56:37,14/10/2020,208,1, , , , ,0,0, , , , ,0,0, , , , ,0,0,15:28:26,14/10/2020,1,2,39,18071981,2,1,39,2,1,22, ,3, ,208,18:56:37,14/10/2020,1, ,141116.81446628,1,133976.7121406,1
01009007,2,01009007_02,1,4,11,0100900340000,01,01 AGUASCALIENTES,009,009 TEPEZALÁ,MQ214,20:43:13,14/10/2020,21:46:09,14/10/2020,63,1, , , , ,0,0, , , , ,0,0, , , , ,0,0,20:43:13,14/10/2020,1,2,12,20092008,0,1,12,2,1,22, ,3,NINGUNO,63,21:46:09,14/10/2020,1, ,24974.2717259826,1,22417.9329583171,1
01009009,3,01009009_03,1,4,11,0100900340000,01,01 AGUASCALIENTES,009,009 TEPEZALÁ,MQ217,19:11:24,14/10/2020,19:41:24,14/10/2020,30,1, , , , ,0,0, , , , ,0,0, , , , ,0,0,19:11:24,14/10/2020,1,1,12,27042008,5,1,12,1,1,20, ,1, ,30,19:41:24,14/10/2020,1, ,16795.770878587,1,14779.2608757527,1
01009013,2,01009013_02,1,4,11,0100900340000,01,01 AGUASCALIENTES,009,009 TEPEZALÁ,MQ217,10:01:28,16/10/2020,13:41:36,16/10/2020,220,1, , , , ,0,0, , , , ,0,0, , , , ,0,0,10:01:28,16/10/2020,1,2,25,14011995,9,1,25,2,1,50, ,1, ,220,13:41:36,16/10/2020,1, ,35627.09773803,1,30577.6930465442,1
01010028,5,01010028_05,2,4,12,0101001580001,01,01 AGUASCALIENTES,010,010 EL LLANO,MQ214,09:10:31,09/10/2020,10:34:17,09/10/2020,84,1, , , , ,0,0, , , , ,0,0, , , , ,0,0,09:10:31,09/10/2020,1,1,18,25099999,1,1,18,1,1,32, ,1,NINGUNO,84,10:34:17,09/10/2020,1, ,14532.9130551527,2,14640.9044937222,2
01010029,2,01010029_02,2,4,12,0101001580001,01,01 AGUASCALIENTES,010,010 EL LLANO,MQ214,18:28:15,09/10/2020,18:46:00,09/10/2020,18,1, , , , ,0,0, , , , ,0,0, , , , ,0,0,18:28:15,09/10/2020,1,2,45,20061975,3,1,45,2,1,26, ,1,NINGUNO,18,18:46:00,09/10/2020,1, ,59583.3783020847,2,65795.8636380062,2
01010029,4,01010029_04,2,4,12,0101001580001,01,01 AGUASCALIENTES,010,010 EL LLANO,MQ214,18:03:49,09/10/2020,18:28:13,09/10/2020,25,1, , , , ,0,0, , , , ,0,0, , , , ,0,0,18:03:49,09/10/2020,1,2,25,5011995,9,1,25,2,1,26, ,1,NINGUNO,25,18:28:13,09/10/2020,1, ,36490.2748302215,2,38272.2750910239,2
02001007,3,02001007_03,3,1,23,0200195850001,02,02 BAJA CALIFORNIA,001,001 ENSENADA,MQ255,18:47:35,03/11/2020,19:02:09,03/11/2020,15,1, , , , ,0,0, , , , ,0,0, , , , ,0,0,18:47:35,03/11/2020,1,1,19,16062001,4,1,19,1,1,26,40,1, ,15,19:02:09,03/11/2020,1, ,55297.9954131505,3,54406.1469548612,2
02001016,2,02001016_02,3,1,23,0200195850001,02,02 BAJA CALIFORNIA,001,001 ENSENADA,MQ209,11:48:35,02/11/2020,11:49:59,02/11/2020,1,2,13:00:07,02/11/2020,13:39:54,02/11/2020,39,2,15:53:24,03/11/2020,16:25:54,03/11/2020,32,2,23:39:11,10/11/2020,23:39:39,10/11/2020,0,1,11:48:35,02/11/2020,1,2,17,4112002,11,1,17,2,1,28,40,1, ,72,23:39:39,10/11/2020,1, ,38003.1596708156,3,36451.2796287777,2
02001018,4,02001018_04,3,1,23,0200195850001,02,02 BAJA CALIFORNIA,001,001 ENSENADA,MQ209,13:40:49,02/11/2020,13:42:35,02/11/2020,2,2,14:47:18,02/11/2020,14:47:58,02/11/2020,0,2,14:38:32,03/11/2020,15:53:00,03/11/2020,75,2,23:37:39,10/11/2020,23:39:09,10/11/2020,2,1,13:40:49,02/11/2020,1,1,13,15122006,10,1,13,1,1,30,40,1, ,79,23:39:09,10/11/2020,1, ,27478.324881226,3,27035.1532707798,2
02002001,3,02002001_03,3,1,23,0200206590001,02,02 BAJA CALIFORNIA,002,002 MEXICALI,MQ209,21:31:02,09/10/2020,23:53:21,09/10/2020,142,1, , , , ,0,0, , , , ,0,0, , , , ,0,0,21:31:02,09/10/2020,1,2,17,21042003,5,1,17,2,1,26,36,1, ,142,23:53:21,09/10/2020,1, ,38781.7404614137,3,37198.0666422133,2
02002016,4,02002016_04,3,1,23,0200206590001,02,02 BAJA CALIFORNIA,002,002 MEXICALI,MQ204,16:18:51,10/10/2020,16:55:03,10/10/2020,37,1, , , , ,0,0, , , , ,0,0, , , , ,0,0,16:18:51,10/10/2020,1,2,17,28022003,7,1,17,2,1,32,30,1, ,37,16:55:03,10/10/2020,1, ,19833.0176982378,3,19023.1254522802,2
02002017,2,02002017_02,3,1,23,0200206590001,02,02 BAJA CALIFORNIA,002,002 MEXICALI,MQ204,21:15:36,07/10/2020,21:17:15,07/10/2020,2,4,16:37:43,08/10/2020,22:22:29,08/10/2020,345,4,18:05:11,09/10/2020,16:16:42,10/10/2020,-109,2,13:49:32,11/10/2020,14:11:56,11/10/2020,22,1,21:15:36,07/10/2020,1,2,30,29051990,4,1,30,2,1,30,40,3, ,260,14:11:56,11/10/2020,1, ,194858.27977162,3,199601.35610374,2
02002021,1,02002021_01,3,1,23,0200206590001,02,02 BAJA CALIFORNIA,002,002 MEXICALI,MQ209,20:09:43,08/10/2020,23:07:34,08/10/2020,178,2,21:29:47,09/10/2020,21:30:35,09/10/2020,1,1, , , , ,0,0, , , , ,0,0,20:09:43,08/10/2020,1,1,37,1021983,8,1,37,1,1,20,26.5,1, ,179,21:30:35,09/10/2020,1, ,96171.8629852217,3,111347.956199959,2
02002022,5,02002022_05,3,1,23,0200206590001,02,02 BAJA CALIFORNIA,002,002 MEXICALI,MQ204,14:17:55,11/10/2020,14:46:46,11/10/2020,29,1, , , , ,0,0, , , , ,0,0, , , , ,0,0,14:17:55,11/10/2020,1,1,12,16102007,11,1,12,1,1,30,36,1, ,29,14:46:46,11/10/2020,1, ,13586.1454247827,3,13367.0274845995,2
02002028,2,02002028_02,3,1,23,0200227630001,02,02 BAJA CALIFORNIA,002,002 MEXICALI,MQ209,19:39:37,02/10/2020,20:12:23,02/10/2020,33,1, , , , ,0,0, , , , ,0,0, , , , ,0,0,19:39:37,02/10/2020,1,1,19,28052001,4,1,19,1,1,34,36,1, ,33,20:12:23,02/10/2020,1, ,33507.1797719713,3,32966.7745294668,2
02002047,2,02002047_02,3,1,23,0200243120001,02,02 BAJA CALIFORNIA,002,002 MEXICALI,MQ209,13:33:55,05/10/2020,23:16:03,05/10/2020,583,1, , , , ,0,0, , , , ,0,0, , , , ,0,0,13:33:55,05/10/2020,1,2,50,19121969,9,1,50,2,1,28, ,1, ,583,23:16:03,05/10/2020,1, ,70329.1727357818,3,69851.7978245205,2
02002064,3,02002064_03,3,1,23,0200243120001,02,02 BAJA CALIFORNIA,002,002 MEXICALI,MQ209,20:31:03,06/10/2020,21:51:27,07/10/2020,80,5,13:55:43,08/10/2020,18:30:38,08/10/2020,275,2,14:34:07,09/10/2020,17:26:42,09/10/2020,172,2,23:50:01,13/10/2020,00:04:13,14/10/2020,-1426,1,20:31:03,06/10/2020,1,1,22,6061998,4,1,22,1,1,26,36,1, ,-899,00:04:13,14/10/2020,1, ,245182.962037839,3,227184.621367528,2
02002075,2,02002075_02,3,1,23,02002501A0001,02,02 BAJA CALIFORNIA,002,002 MEXICALI,MQ209,14:03:26,01/10/2020,14:18:01,01/10/2020,15,1, , , , ,0,0, , , , ,0,0, , , , ,0,0,14:03:26,01/10/2020,1,1,33,1011987,8,1,33,1,1,32, ,1, ,15,14:18:01,01/10/2020,1, ,340931.969422537,3,315904.905224985,2
02002103,1,02002103_01,3,1,23,0200267510001,02,02 BAJA CALIFORNIA,002,002 MEXICALI,MQ204,19:59:14,16/10/2020,20:47:32,16/10/2020,48,2,21:17:16,16/10/2020,21:19:14,16/10/2020,2,1, , , , ,0,0, , , , ,0,0,19:59:14,16/10/2020,1,2,50,99011970,1,1,50,2,1,26,32,3, ,50,21:19:14,16/10/2020,1, ,32279.3909708413,3,32060.2874210503,2
02002103,2,02002103_02,3,1,23,0200267510001,02,02 BAJA CALIFORNIA,002,002 MEXICALI,MQ204,19:44:55,16/10/2020,19:59:07,16/10/2020,15,2,21:16:14,16/10/2020,21:17:14,16/10/2020,1,1, , , , ,0,0, , , , ,0,0,19:44:55,16/10/2020,1,2,24,99091996,1,1,24,2,1,26, ,3, ,16,21:17:14,16/10/2020,1, ,165293.065254469,3,169316.490004964,2
02002112,3,02002112_03,3,1,23,0200267510001,02,02 BAJA CALIFORNIA,002,002 MEXICALI,MQ204,19:52:10,15/10/2020,20:30:51,15/10/2020,38,1, , , , ,0,0, , , , ,0,0, , , , ,0,0,19:52:10,15/10/2020,1,1,17,1102003,0,1,17,1,1,34, ,3, ,38,20:30:51,15/10/2020,1, ,11939.6210428341,3,11747.0583189948,2
02002116,3,02002116_03,3,1,23,0200267510001,02,02 BAJA CALIFORNIA,002,002 MEXICALI,MQ204,20:48:32,16/10/2020,21:16:12,16/10/2020,28,1, , , , ,0,0, , , , ,0,0, , , , ,0,0,20:48:32,16/10/2020,1,2,18,15082002,2,1,18,2,1,26,32,3, ,28,21:16:12,16/10/2020,1, ,19225.122762286,3,18440.054242222,2
02002119,1,02002119_01,3,1,23,0200267510001,02,02 BAJA CALIFORNIA,002,002 MEXICALI,MQ204,20:59:00,15/10/2020,21:38:33,15/10/2020,39,1, , , , ,0,0, , , , ,0,0, , , , ,0,0,20:59:00,15/10/2020,1,2,51,25081969,1,1,51,2,1,26, ,3, ,39,21:38:33,15/10/2020,1, ,36886.7069234668,3,36636.330191318,2
02002121,3,02002121_03,3,1,23,0200267510001,02,02 BAJA CALIFORNIA,002,002 MEXICALI,MQ209,15:40:39,15/10/2020,15:43:19,15/10/2020,3,2,14:11:59,16/10/2020,14:12:08,16/10/2020,1,2,20:04:51,16/10/2020,20:28:28,16/10/2020,24,2,18:19:43,17/10/2020,18:21:02,17/10/2020,2,1,15:40:39,15/10/2020,1,2,17,13992003,1,1,17,2,1,28,30,1, ,30,18:21:02,17/10/2020,1, ,14659.6825334819,3,14061.0462899857,2
02002130,1,02002130_01,3,1,23,0200267510001,02,02 BAJA CALIFORNIA,002,002 MEXICALI,MQ209,13:59:24,15/10/2020,14:30:11,15/10/2020,31,2,14:30:40,15/10/2020,14:30:50,15/10/2020,0,2,16:32:07,15/10/2020,16:32:43,15/10/2020,0,1, , , , ,0,0,13:59:24,15/10/2020,1,2,55,1061965,4,1,55,2,1,26, ,1, ,31,16:32:43,15/10/2020,1, ,63765.9012943118,3,63333.0760485745,2
02002149,3,02002149_03,1,1,21,02002348A0000,02,02 BAJA CALIFORNIA,002,002 MEXICALI,MQ204,13:35:09,19/10/2020,14:17:37,19/10/2020,42,1, , , , ,0,0, , , , ,0,0, , , , ,0,0,13:35:09,19/10/2020,1,1,20,1042000,6,1,20,1,1,28,36,3, ,42,14:17:37,19/10/2020,1, ,46920.457302291,2,45789.9154080787,2
02002152,2,02002152_02,1,1,21,02002348A0000,02,02 BAJA CALIFORNIA,002,002 MEXICALI,MQ209,13:14:06,19/10/2020,14:07:17,19/10/2020,53,2,14:19:54,19/10/2020,14:23:25,19/10/2020,4,1, , , , ,0,0, , , , ,0,0,13:14:06,19/10/2020,1,2,51,28121968,9,1,51,2,1,26,38,1, ,57,14:23:25,19/10/2020,1, ,43271.3059524417,2,46584.9164719412,2
02002153,3,02002153_03,1,1,21,02002348A0000,02,02 BAJA CALIFORNIA,002,002 MEXICALI,MQ209,15:55:34,19/10/2020,17:46:50,19/10/2020,111,2,19:02:26,19/10/2020,19:29:28,19/10/2020,27,1, , , , ,0,0, , , , ,0,0,15:55:34,19/10/2020,1,1,14,8082006,2,1,14,1,1,36, ,1, ,138,19:29:28,19/10/2020,1, ,20646.9490317957,2,20373.4831225886,2
02002154,4,02002154_04,1,1,21,02002348A0000,02,02 BAJA CALIFORNIA,002,002 MEXICALI,MQ209,14:18:18,19/10/2020,14:19:42,19/10/2020,1,2,18:35:25,19/10/2020,19:02:10,19/10/2020,27,2,19:29:35,19/10/2020,19:30:53,19/10/2020,1,1, , , , ,0,0,14:18:18,19/10/2020,1,1,17,22092003,0,1,17,1,1,36,36,1, ,29,19:30:53,19/10/2020,1, ,20646.9490317957,2,20373.4831225886,2
02002156,3,02002156_03,1,1,21,02002348A0000,02,02 BAJA CALIFORNIA,002,002 MEXICALI,MQ209,17:52:09,19/10/2020,18:21:06,19/10/2020,29,1, , , , ,0,0, , , , ,0,0, , , , ,0,0,17:52:09,19/10/2020,1,2,13,7022007,8,1,13,2,1,25, ,1, ,29,18:21:06,19/10/2020,1, ,17820.0181403524,2,18419.1702681053,2
02002158,2,02002158_02,2,1,22,0200251130289,02,02 BAJA CALIFORNIA,002,002 MEXICALI,MQ028,21:58:53,13/10/2020,22:14:57,13/10/2020,16,1, , , , ,0,0, , , , ,0,0, , , , ,0,0,21:58:53,13/10/2020,1,1,12,3032008,7,1,12,1,1,36, ,2, ,16,22:14:57,13/10/2020,1, ,10929.701209463,3,10753.4265163137,2
02002161,2,02002161_02,2,1,22,0200251130289,02,02 BAJA CALIFORNIA,002,002 MEXICALI,MQ204,16:08:03,13/10/2020,16:28:31,13/10/2020,20,1, , , , ,0,0, , , , ,0,0, , , , ,0,0,16:08:03,13/10/2020,1,2,13,11102007,0,1,13,2,1,34, ,1, ,20,16:28:31,13/10/2020,1, ,9103.97288691445,3,8732.2071193089,2
02002169,4,02002169_04,2,1,22,0200251130289,02,02 BAJA CALIFORNIA,002,002 MEXICALI,MQ204,14:23:00,13/10/2020,14:46:54,13/10/2020,23,1, , , , ,0,0, , , , ,0,0, , , , ,0,0,14:23:00,13/10/2020,1,2,15,26122004,9,1,15,2,1,19, ,3, ,23,14:46:54,13/10/2020,1, ,16310.3963899053,3,15644.3523331881,2
02002175,3,02002175_03,2,1,22,0200251130289,02,02 BAJA CALIFORNIA,002,002 MEXICALI,MQ209,20:35:42,13/10/2020,21:08:23,13/10/2020,33,2,00:06:43,14/10/2020,00:07:01,14/10/2020,1,1, , , , ,0,0, , , , ,0,0,20:35:42,13/10/2020,1,1,16,21032004,6,1,16,1,1,22,22,1, ,34,00:07:01,14/10/2020,1, ,8383.57763225856,3,8248.36693012702,2
02002176,1,02002176_01,2,1,22,0200251130289,02,02 BAJA CALIFORNIA,002,002 MEXICALI,MQ209,13:19:17,13/10/2020,13:53:22,13/10/2020,34,1, , , , ,0,0, , , , ,0,0, , , , ,0,0,13:19:17,13/10/2020,1,2,47,1061973,4,1,47,2,1,34, ,1, ,34,13:53:22,13/10/2020,1, ,32181.6876379857,3,30811.6931781297,2
02002178,3,02002178_03,2,1,22,0200251130289,02,02 BAJA CALIFORNIA,002,002 MEXICALI,MQ209,19:12:57,14/10/2020,19:29:41,14/10/2020,17,1, , , , ,0,0, , , , ,0,0, , , , ,0,0,19:12:57,14/10/2020,1,2,33,20101986,11,1,33,2,1,24, ,1, ,17,19:29:41,14/10/2020,1, ,57321.6727180254,3,58716.9486565437,2
02002180,3,02002180_03,2,1,22,0200251130289,02,02 BAJA CALIFORNIA,002,002 MEXICALI,MQ209,12:35:52,17/10/2020,18:17:19,17/10/2020,342,2,18:21:05,17/10/2020,18:33:43,17/10/2020,12,2,21:36:50,17/10/2020,21:40:00,17/10/2020,4,1, , , , ,0,0,12:35:52,17/10/2020,1,2,30,11071990,3,1,30,2,1,24,32,1, ,358,21:40:00,17/10/2020,1, ,57321.6727180254,3,58716.9486565437,2
02002183,1,02002183_01,2,1,22,0200251130289,02,02 BAJA CALIFORNIA,002,002 MEXICALI,MQ209,14:57:09,13/10/2020,18:40:49,13/10/2020,223,2,00:06:13,14/10/2020,00:06:42,14/10/2020,0,1, , , , ,0,0, , , , ,0,0,14:57:09,13/10/2020,1,1,31,28031989,6,1,31,1,1,28,22,1, ,223,00:06:42,14/10/2020,1, ,205730.326422782,3,190628.116748848,2
02004013,2,02004013_02,3,1,23,0200416470001,02,02 BAJA CALIFORNIA,004,004 TIJUANA,MQ209,15:57:38,28/10/2020,19:50:09,28/10/2020,233,1, , , , ,0,0, , , , ,0,0, , , , ,0,0,15:57:38,28/10/2020,1,2,52,16081968,2,1,52,2,1,32,32,1, ,233,19:50:09,28/10/2020,1, ,171675.712372122,3,170510.425269041,2
02004032,2,02004032_02,3,1,23,0200430370001,02,02 BAJA CALIFORNIA,004,004 TIJUANA,MQ209,09:43:21,27/10/2020,14:35:18,27/10/2020,292,2,13:50:21,02/11/2020,13:51:51,02/11/2020,1,1, , , , ,0,0, , , , ,0,0,09:43:21,27/10/2020,1,1,46,26051974,5,1,46,1,1,28, ,1, ,293,13:51:51,02/11/2020,1, ,135978.147427883,3,157435.744031266,2
02004043,2,02004043_02,2,1,22,0200477731599,02,02 BAJA CALIFORNIA,004,004 TIJUANA,MQ209,13:40:57,06/11/2020,13:43:48,06/11/2020,3,2,09:42:49,07/11/2020,18:36:54,07/11/2020,534,1, , , , ,0,0, , , , ,0,0,13:40:57,06/11/2020,1,2,44,14021976,8,1,44,2,1,26, ,1, ,537,18:36:54,07/11/2020,1, ,179471.235661691,3,171831.033527922,2
02004044,3,02004044_03,2,1,22,0200477731599,02,02 BAJA CALIFORNIA,004,004 TIJUANA,MQ209,12:19:32,23/10/2020,12:20:01,23/10/2020,1,2,11:40:25,24/10/2020,16:09:34,24/10/2020,269,2,17:00:01,24/10/2020,00:48:10,25/10/2020,-972,2,10:18:13,26/10/2020,10:51:52,26/10/2020,33,1,12:19:32,23/10/2020,1,1,12,29092008,0,1,12,1,1,32, ,1, ,-669,10:51:52,26/10/2020,1, ,17338.2009051899,3,17058.5696521712,2
02004047,2,02004047_02,2,1,22,0200477731599,02,02 BAJA CALIFORNIA,004,004 TIJUANA,MQ204,14:46:57,23/10/2020,15:21:58,23/10/2020,35,1, , , , ,0,0, , , , ,0,0, , , , ,0,0,14:46:57,23/10/2020,1,2,61,4071959,3,1,61,2,1,32, ,1, ,35,15:21:58,23/10/2020,1, ,34499.2860999556,3,34265.114517952,2
02004053,1,02004053_01,2,1,22,0200477731599,02,02 BAJA CALIFORNIA,004,004 TIJUANA,MQ204,07:56:09,24/10/2020,08:54:04,24/10/2020,58,1, , , , ,0,0, , , , ,0,0, , , , ,0,0,07:56:09,24/10/2020,1,1,50,17091970,1,1,50,1,1,34, ,1, ,58,08:54:04,24/10/2020,1, ,26627.43635666,3,28684.1746458679,2
02004071,4,02004071_04,2,1,22,0200480571883,02,02 BAJA CALIFORNIA,004,004 TIJUANA,MQ209,12:26:52,28/10/2020,12:27:16,28/10/2020,1,2,19:50:33,28/10/2020,20:45:00,28/10/2020,55,2,13:52:12,02/11/2020,13:54:21,02/11/2020,2,1, , , , ,0,0,12:26:52,28/10/2020,1,1,17,4062003,4,1,17,1,1,40,36,1, ,58,13:54:21,02/11/2020,1, ,70152.2358193589,2,69223.0794136493,2
02004075,3,02004075_03,2,1,22,0200480571883,02,02 BAJA CALIFORNIA,004,004 TIJUANA,MQ209,21:08:21,28/10/2020,21:11:00,28/10/2020,3,2,10:03:50,29/10/2020,10:48:06,29/10/2020,45,2,13:54:46,02/11/2020,13:55:58,02/11/2020,1,2,13:56:29,02/11/2020,13:56:56,02/11/2020,0,1,21:08:21,28/10/2020,1,1,18,17022002,8,1,18,1,1,28,32,1, ,49,13:56:56,02/11/2020,1, ,41539.4191394134,2,40989.2354292002,2
03008018,2,03008018_02,2,1,32,0300815850054,03,03 BAJA CALIFORNIA SUR,008,008 LOS CABOS,MQ205,13:26:29,07/11/2020,13:43:45,07/11/2020,17,1, , , , ,0,0, , , , ,0,0, , , , ,0,0,13:26:29,07/11/2020,1,2,15,17032005,7,1,15,2,1,26, ,3, ,17,13:43:45,07/11/2020,1, ,113007.638022882,3,108392.908627625,2
03008026,1,03008026_01,2,1,32,0300815850054,03,03 BAJA CALIFORNIA SUR,008,008 LOS CABOS,MQ210,20:10:47,07/11/2020,20:50:37,07/11/2020,40,1, , , , ,0,0, , , , ,0,0, , , , ,0,0,20:10:47,07/11/2020,1,2,66,23061954,4,1,66,2,1,22,0,1,NINGUNA,40,20:50:37,07/11/2020,1, ,88215.1259833193,3,87616.3461839835,2
04002010,2,04002010_02,3,9,43,0400211430001,04,04 CAMPECHE,002,002 CAMPECHE,MQ221,14:09:37,23/10/2020,16:41:47,23/10/2020,152,1, , , , ,0,0, , , , ,0,0, , , , ,0,0,14:09:37,23/10/2020,1,2,61,2011959,9,1,61,2,1,17, ,1, ,152,16:41:47,23/10/2020,1, ,127750.940204445,3,129776.000708479,2
04002012,3,04002012_03,3,9,43,0400211430001,04,04 CAMPECHE,002,002 CAMPECHE,MQ221,08:04:59,24/10/2020,08:50:38,24/10/2020,46,1, , , , ,0,0, , , , ,0,0, , , , ,0,0,08:04:59,24/10/2020,1,2,23,24101996,11,1,23,2,1,16, ,1, ,46,08:50:38,24/10/2020,1, ,80878.7622448044,3,84735.8756130764,2
04002014,3,04002014_03,3,9,43,0400211430001,04,04 CAMPECHE,002,002 CAMPECHE,MQ221,09:14:47,24/10/2020,09:36:32,24/10/2020,22,1, , , , ,0,0, , , , ,0,0, , , , ,0,0,09:14:47,24/10/2020,1,2,17,24122002,10,1,17,2,1,17, ,1, ,22,09:36:32,24/10/2020,1, ,10620.1237293642,3,10418.635660029,2
04002017,2,04002017_02,3,9,43,0400211430001,04,04 CAMPECHE,002,002 CAMPECHE,MQ221,10:31:19,24/10/2020,11:04:12,24/10/2020,33,1, , , , ,0,0, , , , ,0,0, , , , ,0,0,10:31:19,24/10/2020,1,2,27,24061993,4,1,27,2,1,17, ,1, ,33,11:04:12,24/10/2020,1, ,94802.9447558147,3,99324.1032827268,2
04009002,1,04009002_01,2,9,42,04009017A0002,04,04 CAMPECHE,009,009 ESCÁRCEGA,MQ215,11:39:02,27/10/2020,12:04:40,27/10/2020,25,1, , , , ,0,0, , , , ,0,0, , , , ,0,0,11:39:02,27/10/2020,1,1,38,20121981,10,1,38,1,1,999, ,1, ,25,12:04:40,27/10/2020,1, ,85644.2084251365,2,87126.0227866525,2
04009003,2,04009003_02,2,9,42,04009017A0002,04,04 CAMPECHE,009,009 ESCÁRCEGA,MQ215,12:46:09,27/10/2020,14:42:28,27/10/2020,116,1, , , , ,0,0, , , , ,0,0, , , , ,0,0,12:46:09,27/10/2020,1,2,54,13121965,10,1,54,2,1,28, ,1, ,116,14:42:28,27/10/2020,1, ,139133.57844788,2,153202.367100624,2
04009018,1,04009018_01,2,9,42,04009017A0002,04,04 CAMPECHE,009,009 ESCÁRCEGA,MQ221,17:38:24,26/10/2020,20:40:18,26/10/2020,182,1, , , , ,0,0, , , , ,0,0, , , , ,0,0,17:38:24,26/10/2020,1,1,79,15091941,1,1,79,1,1,999, ,1, ,182,20:40:18,26/10/2020,1, ,35920.0204366178,2,39364.268221965,2
04009019,1,04009019_01,2,9,42,04009017A0002,04,04 CAMPECHE,009,009 ESCÁRCEGA,MQ221,16:18:52,26/10/2020,17:37:41,26/10/2020,79,1, , , , ,0,0, , , , ,0,0, , , , ,0,0,16:18:52,26/10/2020,1,2,41,3051979,5,1,41,2,1,999, ,1, ,79,17:37:41,26/10/2020,1, ,119170.429431182,2,131833.062373627,2
04009022,6,04009022_06,1,9,41,0400902920000,04,04 CAMPECHE,009,009 ESCÁRCEGA,MQ215,11:45:46,28/10/2020,12:02:21,28/10/2020,17,1, , , , ,0,0, , , , ,0,0, , , , ,0,0,11:45:46,28/10/2020,1,2,13,15102007,0,1,13,2,1,999, ,1, ,17,12:02:21,28/10/2020,1, ,21944.1480748996,1,19733.486658762,1
04009023,5,04009023_05,1,9,41,0400902920000,04,04 CAMPECHE,009,009 ESCÁRCEGA,MQ221,14:22:53,28/10/2020,14:35:27,28/10/2020,13,1, , , , ,0,0, , , , ,0,0, , , , ,0,0,14:22:53,28/10/2020,1,2,13,25012007,9,1,13,2,1,52, ,1, ,13,14:35:27,28/10/2020,1, ,65832.4442246989,1,59200.4599762859,1
04009025,1,04009025_01,1,9,41,0400902920000,04,04 CAMPECHE,009,009 ESCÁRCEGA,MQ221,14:01:58,28/10/2020,14:17:24,28/10/2020,16,1, , , , ,0,0, , , , ,0,0, , , , ,0,0,14:01:58,28/10/2020,1,1,42,21031978,7,1,42,1,1,25, ,1, ,16,14:17:24,28/10/2020,1, ,63604.9993324882,1,57474.1331878591,1
04009037,1,04009037_01,1,9,41,0400902920000,04,04 CAMPECHE,009,009 ESCÁRCEGA,MQ215,13:23:01,28/10/2020,13:35:55,28/10/2020,12,1, , , , ,0,0, , , , ,0,0, , , , ,0,0,13:23:01,28/10/2020,1,1,46,14041974,6,1,46,1,1,999, ,1, ,12,13:35:55,28/10/2020,1, ,127209.998664976,1,114948.266375718,1
05002004,4,05002004_04,3,2,53,0500218810001,05,05 COAHUILA DE ZARAGOZA,002,002 ACUÑA,MQ232,13:25:09,19/10/2020,13:36:45,19/10/2020,11,1, , , , ,0,0, , , , ,0,0, , , , ,0,0,13:25:09,19/10/2020,1,2,17,25082003,1,1,17,2,1,24,999.9,1, ,11,13:36:45,19/10/2020,1, ,33114.9657244922,3,31839.8626300286,2
05002007,4,05002007_04,3,2,53,0500218810001,05,05 COAHUILA DE ZARAGOZA,002,002 ACUÑA,MQ232,13:05:24,17/10/2020,13:21:37,17/10/2020,16,1, , , , ,0,0, , , , ,0,0, , , , ,0,0,13:05:24,17/10/2020,1,1,19,2082001,2,1,19,1,1,24,999.9,1, ,16,13:21:37,17/10/2020,1, ,23125.9777333293,3,22808.2774976563,2
05006012,1,05006012_01,2,2,52,0500604160001,05,05 COAHUILA DE ZARAGOZA,006,006 CASTAÑOS,MQ232,08:59:28,14/10/2020,09:18:55,14/10/2020,19,1, , , , ,0,0, , , , ,0,0, , , , ,0,0,08:59:28,14/10/2020,1,1,55,7121964,10,1,55,1,1,999.9,13,1, ,19,09:18:55,14/10/2020,1, ,54647.1906995344,2,58694.7218567781,2
05006013,1,05006013_01,2,2,52,0500604160001,05,05 COAHUILA DE ZARAGOZA,006,006 CASTAÑOS,MQ232,17:24:21,13/10/2020,18:00:42,13/10/2020,36,1, , , , ,0,0, , , , ,0,0, , , , ,0,0,17:24:21,13/10/2020,1,1,54,15111965,10,1,54,1,1,999.9,13,1, ,36,18:00:42,13/10/2020,1, ,23235.813368306,2,24956.8108682364,2
05006013,2,05006013_02,2,2,52,0500604160001,05,05 COAHUILA DE ZARAGOZA,006,006 CASTAÑOS,MQ232,08:29:34,14/10/2020,08:50:00,14/10/2020,21,1, , , , ,0,0, , , , ,0,0, , , , ,0,0,08:29:34,14/10/2020,1,2,40,6101980,0,1,40,2,1,999.9,13,3, ,21,08:50:00,14/10/2020,1, ,127871.939745742,2,138642.598775294,2
05006018,2,05006018_02,2,2,52,0500604160001,05,05 COAHUILA DE ZARAGOZA,006,006 CASTAÑOS,MQ230,13:06:03,14/10/2020,13:22:52,14/10/2020,16,1, , , , ,0,0, , , , ,0,0, , , , ,0,0,13:06:03,14/10/2020,1,2,12,22052008,4,1,12,2,1,17, ,1, ,16,13:22:52,14/10/2020,1, ,32696.810474278,2,33878.2613203468,2
05006031,1,05006031_01,2,2,52,0500604160001,05,05 COAHUILA DE ZARAGOZA,006,006 CASTAÑOS,MQ230,18:13:00,13/10/2020,18:48:21,13/10/2020,35,1, , , , ,0,0, , , , ,0,0, , , , ,0,0,18:13:00,13/10/2020,1,1,54,6011966,9,1,54,1,1,17, ,1, ,35,18:48:21,13/10/2020,1, ,45345.5412187626,2,48704.1309024329,2
05025003,1,05025003_01,3,2,53,0502511610001,05,05 COAHUILA DE ZARAGOZA,025,025 PIEDRAS NEGRAS,MQ230,18:34:44,20/10/2020,19:13:18,20/10/2020,39,1, , , , ,0,0, , , , ,0,0, , , , ,0,0,18:34:44,20/10/2020,1,1,51,21031969,6,1,51,1,1,0, ,1, ,39,19:13:18,20/10/2020,1, ,90512.4258050804,3,97740.6021306097,2
05025008,2,05025008_02,3,2,53,0502511610001,05,05 COAHUILA DE ZARAGOZA,025,025 PIEDRAS NEGRAS,MQ232,08:49:12,21/10/2020,09:07:00,21/10/2020,18,1, , , , ,0,0, , , , ,0,0, , , , ,0,0,08:49:12,21/10/2020,1,1,24,23081996,1,1,24,1,1,18,999.9,2, ,18,09:07:00,21/10/2020,1, ,107598.128503982,3,99941.7990122255,2
05027007,2,05027007_02,2,2,52,0502715940001,05,05 COAHUILA DE ZARAGOZA,027,027 RAMOS ARIZPE,MQ230,16:03:21,10/10/2020,16:36:07,10/10/2020,33,1, , , , ,0,0, , , , ,0,0, , , , ,0,0,16:03:21,10/10/2020,1,2,12,11112007,10,1,12,2,1,17,23,1, ,33,16:36:07,10/10/2020,1, ,59509.0470180467,3,57217.6307855011,2
05027012,2,05027012_02,2,2,52,0502715940001,05,05 COAHUILA DE ZARAGOZA,027,027 RAMOS ARIZPE,MQ232,13:55:29,11/10/2020,14:17:24,11/10/2020,22,1, , , , ,0,0, , , , ,0,0, , , , ,0,0,13:55:29,11/10/2020,1,2,18,21052002,4,1,18,2,1,999.9,999.9,1, ,22,14:17:24,11/10/2020,1, ,30839.3238452898,3,29651.8451206113,2
05030007,1,05030007_01,3,2,53,0503043100001,05,05 COAHUILA DE ZARAGOZA,030,030 SALTILLO,MQ203,12:40:28,30/10/2020,12:59:34,30/10/2020,19,2,12:59:53,30/10/2020,13:11:46,30/10/2020,12,1, , , , ,0,0, , , , ,0,0,12:40:28,30/10/2020,1,2,79,10061941,4,1,79,2,1,0,0,1,NO TIENE TORTILLAS DE NINGUNA,31,13:11:46,30/10/2020,1, ,135695.477448951,3,135101.837478155,2