﻿FOLIO_I,ID_INT,FOLIO_INT,estrato,region_cv,est_sel,Upm,ENTIDAD,DESC_ENT,municipio,desc_mun,maquina,hora_ini_1,fecha_ini_1,hora_fin_1,fecha_fin_1,tiempo1,resultado_1,hora_ini_2,fecha_ini_2,hora_fin_2,fecha_fin_2,tiempo2,resultado_2,hora_ini_3,fecha_ini_3,hora_fin_3,fecha_fin_3,tiempo3,resultado_3,hora_ini_4,fecha_ini_4,hora_fin_4,fecha_fin_4,tiempo4,resultado_4,hora_ini,fecha_ini,localizado,H0902A,H0904,H0401,VIVO,H0302,H0303,H0304,MESES,sv,scv,nota1,nota01,san01,san02,Etiqueta,comentario,tiempo,hora_fin,fecha_fin,completa,otroent,Sexo,Edad,valor,diag_1,fecdeterm,timegen,con_datos,ponde_g,rural_20,ponde_g20,area_20
01001001,1,01001001_01,3,4,13,0100108010001,01,01 AGUASCALIENTES,001,001 AGUASCALIENTES,MQ009,08:02:33,13/10/2020,08:16:35,13/10/2020,14,1, , , , ,0,0, , , , ,0,0, , , , ,0,0,08:02:33,13/10/2020,1,3,2,1,1,1,71,8091949,1,1,0,1,1,1,08:13,009C0154, ,14,08:16:35,13/10/2020,1, ,1,71,2,.08,12/15/2020 0:00:00,12/18/2020 17:43:23,1,9150.31888787399,3,9238.13985992956,2
01001001,2,01001001_02,3,4,13,0100108010001,01,01 AGUASCALIENTES,001,001 AGUASCALIENTES,MQ009,08:16:37,13/10/2020,08:21:46,13/10/2020,5,1, , , , ,0,0, , , , ,0,0, , , , ,0,0,08:16:37,13/10/2020,1,9,9,2,1,1,33,11121986,10,1,0,1,1,1,08:18,009C0155, ,5,08:21:46,13/10/2020,1, ,1,33,2,.081,12/7/2020 0:00:00,12/18/2020 17:43:23,1,28111.879160772,3,28381.6853374157,2
01001003,1,01001003_01,3,4,13,0100108010001,01,01 AGUASCALIENTES,001,001 AGUASCALIENTES,MQ009,14:40:54,12/10/2020,14:55:09,12/10/2020,15,1, , , , ,0,0, , , , ,0,0, , , , ,0,0,14:40:54,12/10/2020,1,9,2,1,1,2,92,16061928,3,0,1,1,1,1,14:50,009C0148, ,15,14:55:09,12/10/2020,1, ,2,92,2,.082,12/8/2020 0:00:00,12/18/2020 17:43:23,1,9937.00800225789,3,10182.8395073312,2
01001004,1,01001004_01,3,4,13,0100108010001,01,01 AGUASCALIENTES,001,001 AGUASCALIENTES,MQ009,17:59:31,13/10/2020,18:30:45,13/10/2020,31,1, , , , ,0,0, , , , ,0,0, , , , ,0,0,17:59:31,13/10/2020,1,3,2,2,1,2,71,5091949,1,0,1,1,1,1,18:28,009C0160, ,31,18:30:45,13/10/2020,1, ,2,71,2,.088,12/8/2020 0:00:00,12/18/2020 17:43:23,1,9937.00800225789,3,10182.8395073312,2
01001004,2,01001004_02,3,4,13,0100108010001,01,01 AGUASCALIENTES,001,001 AGUASCALIENTES,MQ009,18:30:53,13/10/2020,18:36:24,13/10/2020,6,1, , , , ,0,0, , , , ,0,0, , , , ,0,0,18:30:53,13/10/2020,1,9,2,2,1,2,18,12072002,3,0,1,1,1,1,18:33,009C0161, ,6,18:36:24,13/10/2020,1, ,2,18,2,.191,12/3/2020 0:00:00,12/18/2020 17:43:23,1,20529.6110290071,3,21037.4927954989,2
01001007,1,01001007_01,3,4,13,0100108010001,01,01 AGUASCALIENTES,001,001 AGUASCALIENTES,MQ004,11:56:35,12/10/2020,12:07:14,12/10/2020,11,1, , , , ,0,0, , , , ,0,0, , , , ,0,0,11:56:35,12/10/2020,1,1,2,1,1,1,73,13061947,3,0,1,1,1,1,12:02,004C0139,NINGUNO,11,12:07:14,12/10/2020,1, ,1,73,2,.078,12/15/2020 0:00:00,12/18/2020 17:43:23,1,9216.39386703171,3,9304.84899937931,2
01001008,1,01001008_01,3,4,13,0100108010001,01,01 AGUASCALIENTES,001,001 AGUASCALIENTES,MQ004,20:31:21,12/10/2020,21:11:17,12/10/2020,40,1, , , , ,0,0, , , , ,0,0, , , , ,0,0,20:31:21,12/10/2020,1,3,2,2,1,1,77,31011943,8,0,1,1,1,1,21:10,004C0146,NINGUNO,40,21:11:17,12/10/2020,1, ,1,77,2,.075,12/8/2020 0:00:00,12/18/2020 17:43:23,1,18432.7877340634,3,18609.6979987586,2
01001008,3,01001008_03,3,4,13,0100108010001,01,01 AGUASCALIENTES,001,001 AGUASCALIENTES,MQ004,17:56:01,12/10/2020,18:20:00,12/10/2020,24,1, , , , ,0,0, , , , ,0,0, , , , ,0,0,17:56:01,12/10/2020,1,1,2,2,1,1,39,14101980,11,0,1,1,1,1,18:16,004C0143,NINGUNO,24,18:20:00,12/10/2020,1, ,1,39,2,.069,12/4/2020 0:00:00,12/18/2020 17:43:23,1,20309.8595943219,3,20504.7852175424,2
01001009,2,01001009_02,3,4,13,0100108010001,01,01 AGUASCALIENTES,001,001 AGUASCALIENTES,MQ004,19:49:31,12/10/2020,19:56:50,12/10/2020,7,1, , , , ,0,0, , , , ,0,0, , , , ,0,0,19:49:31,12/10/2020,1,9,1,2,1,2,40,30091980,0,0,1,1,1,1,19:55,004C0144,NINGUNO,7,19:56:50,12/10/2020,1, ,2,40,2,.139,12/14/2020 0:00:00,12/18/2020 17:43:23,1,25435.34804081,3,26064.5927681479,2
01001009,3,01001009_03,3,4,13,0100108010001,01,01 AGUASCALIENTES,001,001 AGUASCALIENTES,MQ004,20:01:46,12/10/2020,20:12:42,12/10/2020,11,1, , , , ,0,0, , , , ,0,0, , , , ,0,0,20:01:46,12/10/2020,1,9,2,2,1,1,16,28012004,8,0,1,1,1,1,20:12,004C0145,NINGUNO,11,20:12:42,12/10/2020,1, ,1,16,2,.147,12/7/2020 0:00:00,12/18/2020 17:43:23,1,77442.9337637761,3,78186.1989772959,2
01001010,2,01001010_02,3,4,13,0100108010001,01,01 AGUASCALIENTES,001,001 AGUASCALIENTES,MQ009,17:01:09,12/10/2020,17:30:49,12/10/2020,29,1, , , , ,0,0, , , , ,0,0, , , , ,0,0,17:01:09,12/10/2020,1,2,1,2,1,2,35,30111984,10,0,1,1,1,1,17:40,009C0150, ,29,17:30:49,12/10/2020,1, ,2,35,1,12.74,11/26/2020 0:00:00,12/18/2020 17:43:23,1,29770.2847924434,3,30506.771460797,2
01001011,1,01001011_01,3,4,13,0100108010001,01,01 AGUASCALIENTES,001,001 AGUASCALIENTES,MQ009,14:47:02,13/10/2020,14:48:44,13/10/2020,1,1, , , , ,0,0, , , , ,0,0, , , , ,0,0,14:47:02,13/10/2020,1,3,2,2,1,1,78,1081942,2,0,1,1,1,1,14:46,009C0159, ,1,14:48:44,13/10/2020,1, ,1,78,2,.073,12/15/2020 0:00:00,12/18/2020 17:43:23,1,21574.2807796959,3,21781.3417939283,2
01001012,1,01001012_01,3,4,13,0100108010001,01,01 AGUASCALIENTES,001,001 AGUASCALIENTES,MQ004,08:29:23,14/10/2020,08:35:57,14/10/2020,6,1, , , , ,0,0, , , , ,0,0, , , , ,0,0,08:29:23,14/10/2020,1,9,2,2,1,2,74,3051946,5,1,0,1,1,1,08:33,004C0149, ,6,08:35:57,14/10/2020,1, ,2,74,2,.085,12/8/2020 0:00:00,12/18/2020 17:43:23,1,11714.5535241891,3,12004.3597036205,2
01001015,2,01001015_02,3,4,13,0100108010001,01,01 AGUASCALIENTES,001,001 AGUASCALIENTES,MQ004,20:19:53,13/10/2020,20:25:52,13/10/2020,6,1, , , , ,0,0, , , , ,0,0, , , , ,0,0,20:19:53,13/10/2020,1,1,2,1,1,2,56,26071964,2,0,1,1,1,1,20:25,004C0148, ,6,20:25:52,13/10/2020,1, ,2,56,2,.085,12/17/2020 0:00:00,12/18/2020 17:43:23,1,20141.8598859783,3,20640.1490822454,2
01001015,3,01001015_03,3,4,13,0100108010001,01,01 AGUASCALIENTES,001,001 AGUASCALIENTES,MQ004,20:00:17,13/10/2020,20:19:50,13/10/2020,19,1, , , , ,0,0, , , , ,0,0, , , , ,0,0,20:00:17,13/10/2020,1,9,2,2,1,2,26,21111993,10,0,1,1,1,1,20:15,004C0147,NINGUNO,19,20:19:50,13/10/2020,1, ,2,26,2,.094,12/4/2020 0:00:00,12/18/2020 17:43:23,1,16306.8092289371,3,16710.2231594463,2
01001016,2,01001016_02,3,4,13,0100108010001,01,01 AGUASCALIENTES,001,001 AGUASCALIENTES,MQ004,12:53:11,12/10/2020,13:30:27,12/10/2020,37,1, , , , ,0,0, , , , ,0,0, , , , ,0,0,12:53:11,12/10/2020,1,9,2,2,1,2,21,3021999,8,0,1,1,1,1,13:11,004C0140,NINGUNO,37,13:30:27,12/10/2020,1, ,2,21,2,.074,12/4/2020 0:00:00,12/18/2020 17:43:23,1,32613.6184578742,3,33420.4463188927,2
01001016,3,01001016_03,3,4,13,0100108010001,01,01 AGUASCALIENTES,001,001 AGUASCALIENTES,MQ004,13:30:30,12/10/2020,13:31:42,12/10/2020,1,1, , , , ,0,0, , , , ,0,0, , , , ,0,0,13:30:30,12/10/2020,1,9, ,2,1,1,6,11042014,6,0,1,1,1,1,13:18,004C0141,NINGUNO,1,13:31:42,12/10/2020,1, ,1,6,2,.08,12/15/2020 0:00:00,12/18/2020 17:43:23,1,36760.2568442773,3,37113.0665691225,2
01001016,4,01001016_04,3,4,13,0100108010001,01,01 AGUASCALIENTES,001,001 AGUASCALIENTES,MQ004,13:47:05,12/10/2020,14:19:02,12/10/2020,32,1, , , , ,0,0, , , , ,0,0, , , , ,0,0,13:47:05,12/10/2020,1,9, ,2,1,2,4,12112015,11,0,1,1,1,1,13:46,004C0142,NINGUNO,32,14:19:02,12/10/2020,1, ,2,4,2,.076,12/15/2020 0:00:00,12/18/2020 17:43:23,1,105300.352443714,3,96325.4045107293,2
01001018,1,01001018_01,3,4,13,0100108010001,01,01 AGUASCALIENTES,001,001 AGUASCALIENTES,MQ009,08:22:14,15/10/2020,08:41:49,15/10/2020,19,1, , , , ,0,0, , , , ,0,0, , , , ,0,0,08:22:14,15/10/2020,1,3,2,2,1,1,62,4051958,5,1,0,1,1,1,08:39,009C0172, ,19,08:41:49,15/10/2020,1, ,1,62,2,.087,12/8/2020 0:00:00,12/18/2020 17:43:23,1,18091.1965144728,3,18264.828328076,2
01001019,2,01001019_02,3,4,13,0100108010001,01,01 AGUASCALIENTES,001,001 AGUASCALIENTES,MQ009,20:32:51,12/10/2020,20:59:13,12/10/2020,27,1, , , , ,0,0, , , , ,0,0, , , , ,0,0,20:32:51,12/10/2020,1,9,2,2,1,2,48,23051972,4,0,1,1,1,1,20:56,009C0153, ,27,20:59:13,12/10/2020,1, ,2,48,2,.073,11/26/2020 0:00:00,12/18/2020 17:43:23,1,24963.9873501036,3,25581.5710917603,2
01001019,4,01001019_04,3,4,13,0100108010001,01,01 AGUASCALIENTES,001,001 AGUASCALIENTES,MQ009,16:28:52,12/10/2020,16:39:19,12/10/2020,11,1, , , , ,0,0, , , , ,0,0, , , , ,0,0,16:28:52,12/10/2020,1,9,2,2,1,1,22,13101997,11,0,1,1,1,1,16:36,009C0149, ,11,16:39:19,12/10/2020,1, ,1,22,2,.071,12/7/2020 0:00:00,12/18/2020 17:43:23,1,75226.2541107848,3,75948.244550797,2
01001021,1,01001021_01,3,4,13,0100108010001,01,01 AGUASCALIENTES,001,001 AGUASCALIENTES,MQ009,12:49:59,13/10/2020,13:21:03,13/10/2020,32,1, , , , ,0,0, , , , ,0,0, , , , ,0,0,12:49:59,13/10/2020,1,9,2,2,1,2,42,7011978,9,0,1,1,1,1,13:16,009C0157, ,32,13:21:03,13/10/2020,1, ,2,42,2,.077,11/26/2020 0:00:00,12/18/2020 17:43:23,1,24963.9873501036,3,25581.5710917603,2
01001021,3,01001021_03,3,4,13,0100108010001,01,01 AGUASCALIENTES,001,001 AGUASCALIENTES,MQ009,13:21:04,13/10/2020,13:38:02,13/10/2020,17,1, , , , ,0,0, , , , ,0,0, , , , ,0,0,13:21:04,13/10/2020,1,9,2,2,1,2,29,27081991,1,0,1,1,1,1,13:24,009C0158, ,17,13:38:02,13/10/2020,1, ,2,29,2,.073,12/4/2020 0:00:00,12/18/2020 17:43:23,1,15905.8221167501,3,16299.3160325747,2
01001022,1,01001022_01,3,4,13,0100108010001,01,01 AGUASCALIENTES,001,001 AGUASCALIENTES,MQ009,18:01:50,12/10/2020,18:17:30,12/10/2020,16,1, , , , ,0,0, , , , ,0,0, , , , ,0,0,18:01:50,12/10/2020,1,5,2,1,1,2,47,1101973,0,0,1,1,1,1,18:15,009C0151, ,16,18:17:30,12/10/2020,1, ,2,47,2,.824,11/26/2020 0:00:00,12/18/2020 17:43:23,1,12481.9936750518,3,12790.7855458801,2
01001022,2,01001022_02,3,4,13,0100108010001,01,01 AGUASCALIENTES,001,001 AGUASCALIENTES,MQ009,18:17:32,12/10/2020,18:22:03,12/10/2020,5,1, , , , ,0,0, , , , ,0,0, , , , ,0,0,18:17:32,12/10/2020,1,9,2,2,1,2,24,26111995,10,0,1,1,1,1,18:18,009C0152, ,5,18:22:03,12/10/2020,1, ,2,24,2,.966,12/4/2020 0:00:00,12/18/2020 17:43:23,1,15905.8221167501,3,16299.3160325747,2
01001022,3,01001022_03,3,4,13,0100108010001,01,01 AGUASCALIENTES,001,001 AGUASCALIENTES,MQ009,12:27:41,13/10/2020,12:40:54,13/10/2020,13,1, , , , ,0,0, , , , ,0,0, , , , ,0,0,12:27:41,13/10/2020,1,9, ,1,1,1,3,23022017,7,0,1,1,1,1,12:38,009C0156, ,13,12:40:54,13/10/2020,1, ,1,3,1,2.69,12/14/2020 0:00:00,12/18/2020 17:43:23,1,66805.3806975164,3,63526.9782284593,2
01001023,1,01001023_01,3,4,13,0100108010001,01,01 AGUASCALIENTES,001,001 AGUASCALIENTES,MQ009,11:24:53,14/10/2020,11:44:08,14/10/2020,20,1, , , , ,0,0, , , , ,0,0, , , , ,0,0,11:24:53,14/10/2020,1,3,2,2,1,2,80,3061940,4,0,1,1,1,1,11:41,009C0162, ,20,11:44:08,14/10/2020,1, ,2,80,2,.076,12/15/2020 0:00:00,12/18/2020 17:43:23,1,9823.2841247189,3,10066.302216341,2
01009001,1,01009001_01,1,4,11,0100900340000,01,01 AGUASCALIENTES,009,009 TEPEZALÁ,MQ009,15:08:28,14/10/2020,15:09:06,14/10/2020,1,1, , , , ,0,0, , , , ,0,0, , , , ,0,0,15:08:28,14/10/2020,1,9,2,2,1,1,54,13021966,8,0,1,1,1,1,15:03,009C0164, ,1,15:09:06,14/10/2020,1, ,1,54,1,17.44,12/8/2020 0:00:00,12/18/2020 17:43:23,1,2880.32286828075,1,2642.65364043233,1
01009001,2,01009001_02,1,4,11,0100900340000,01,01 AGUASCALIENTES,009,009 TEPEZALÁ,MQ009,15:07:06,14/10/2020,15:08:26,14/10/2020,1,1, , , , ,0,0, , , , ,0,0, , , , ,0,0,15:07:06,14/10/2020,1,3,2,2,1,2,49,16121970,9,0,1,1,1,1,15:01,009C0163, ,1,15:08:26,14/10/2020,1, ,2,49,1,106.5,11/26/2020 0:00:00,12/18/2020 17:43:23,1,3974.54881386381,1,3778.66154183279,1
01009001,3,01009001_03,1,4,11,0100900340000,01,01 AGUASCALIENTES,009,009 TEPEZALÁ,MQ009,15:09:08,14/10/2020,15:10:03,14/10/2020,1,1, , , , ,0,0, , , , ,0,0, , , , ,0,0,15:09:08,14/10/2020,1,9,2,2,1,1,20,28022000,7,0,1,1,1,1,15:05,009C0165, ,1,15:10:03,14/10/2020,1, ,1,20,1,3.74,12/7/2020 0:00:00,12/18/2020 17:43:23,1,8849.01274035596,1,8118.83833929078,1
01009002,1,01009002_01,1,4,11,0100900340000,01,01 AGUASCALIENTES,009,009 TEPEZALÁ,MQ009,11:43:20,15/10/2020,11:50:05,15/10/2020,7,1, , , , ,0,0, , , , ,0,0, , , , ,0,0,11:43:20,15/10/2020,1,3,1,1,1,1,59,17081961,1,0,1,1,1,1,11:47,009C0173, ,7,11:50:05,15/10/2020,1, ,1,59,2,.08,12/8/2020 0:00:00,12/18/2020 17:43:23,1,5760.6457365615,1,5285.30728086466,1
01009002,3,01009002_03,1,4,11,0100900340000,01,01 AGUASCALIENTES,009,009 TEPEZALÁ,MQ009,11:50:07,15/10/2020,11:52:04,15/10/2020,2,1, , , , ,0,0, , , , ,0,0, , , , ,0,0,11:50:07,15/10/2020,1,5,2,2,1,1,17,30122002,9,0,1,1,1,1,11:49,009C0174, ,2,11:52:04,15/10/2020,1, ,1,17,2,.077,12/2/2020 0:00:00,12/18/2020 17:43:23,1,24202.5955405914,1,22205.5235257122,1
01009004,2,01009004_02,1,4,11,0100900340000,01,01 AGUASCALIENTES,009,009 TEPEZALÁ,MQ004,08:27:06,15/10/2020,08:28:26,15/10/2020,1,1, , , , ,0,0, , , , ,0,0, , , , ,0,0,08:27:06,15/10/2020,1,9,2,2,1,2,39,18071981,2,1,0,1,1,1,08:27,004C0155,NINGUNO,1,08:28:26,15/10/2020,1, ,2,39,2,.086,11/26/2020 0:00:00,12/18/2020 17:43:23,1,7949.09762772761,1,7557.32308366558,1
01009005,2,01009005_02,1,4,11,0100900340000,01,01 AGUASCALIENTES,009,009 TEPEZALÁ,MQ004,21:13:43,14/10/2020,22:01:50,14/10/2020,48,1, , , , ,0,0, , , , ,0,0, , , , ,0,0,21:13:43,14/10/2020,1,1,2,2,1,2,74,10121945,10,0,1,1,1,1,21:43,004C0154,NINGUNO,48,22:01:50,14/10/2020,1, ,2,74,2,.075,12/15/2020 0:00:00,12/18/2020 17:43:23,1,6255.91124023488,1,5947.58608326531,1
01009007,1,01009007_01,1,4,11,0100900340000,01,01 AGUASCALIENTES,009,009 TEPEZALÁ,MQ009,21:11:50,14/10/2020,21:12:31,14/10/2020,1,1, , , , ,0,0, , , , ,0,0, , , , ,0,0,21:11:50,14/10/2020,1,9,2,2,1,2,35,28091985,0,0,1,1,1,1,21:02,009C0169, ,1,21:12:31,14/10/2020,1, ,2,35,2,.071,11/26/2020 0:00:00,12/18/2020 17:43:23,1,3974.54881386381,1,3778.66154183279,1
01009007,2,01009007_02,1,4,11,0100900340000,01,01 AGUASCALIENTES,009,009 TEPEZALÁ,MQ009,21:12:33,14/10/2020,21:13:23,14/10/2020,1,1, , , , ,0,0, , , , ,0,0, , , , ,0,0,21:12:33,14/10/2020,1,9,2,2,1,2,12,20092008,0,0,1,1,1,1,21:06,009C0170, ,1,21:13:23,14/10/2020,1, ,2,12,1,140.7,12/15/2020 0:00:00,12/18/2020 17:43:23,1,6462.27840235377,1,6143.78235497188,1
01009007,4,01009007_04,1,4,11,0100900340000,01,01 AGUASCALIENTES,009,009 TEPEZALÁ,MQ009,21:13:25,14/10/2020,21:14:28,14/10/2020,1,1, , , , ,0,0, , , , ,0,0, , , , ,0,0,21:13:25,14/10/2020,1,9, ,2,1,1,8,15052012,4,0,1,1,1,1,21:50,009C0171, ,1,21:14:28,14/10/2020,1, ,1,8,2,.088,12/12/2020 0:00:00,12/18/2020 17:43:23,1,22834.9224240338,1,20950.7036649965,1
01009007,5,01009007_05,1,4,11,0100900340000,01,01 AGUASCALIENTES,009,009 TEPEZALÁ,MQ009,20:30:10,14/10/2020,21:11:48,14/10/2020,41,1, , , , ,0,0, , , , ,0,0, , , , ,0,0,20:30:10,14/10/2020,1,3,2,2,1,2,77,9071943,3,0,1,1,1,1,20:58,009C0168, ,41,21:11:48,14/10/2020,1, ,2,77,2,.08,12/8/2020 0:00:00,12/18/2020 17:43:23,1,3127.95562011744,1,2973.79304163266,1
01009009,1,01009009_01,1,4,11,0100900340000,01,01 AGUASCALIENTES,009,009 TEPEZALÁ,MQ009,19:13:35,14/10/2020,19:29:39,14/10/2020,16,1, , , , ,0,0, , , , ,0,0, , , , ,0,0,19:13:35,14/10/2020,1,9,2,2,1,1,32,8121987,10,0,1,1,1,1,19:27,009C0166, ,16,19:29:39,14/10/2020,1, ,1,32,2,.078,12/14/2020 0:00:00,12/18/2020 17:43:23,1,17698.0254807119,1,16237.6766785816,1
01009009,3,01009009_03,1,4,11,0100900340000,01,01 AGUASCALIENTES,009,009 TEPEZALÁ,MQ009,19:55:24,14/10/2020,19:56:50,14/10/2020,1,1, , , , ,0,0, , , , ,0,0, , , , ,0,0,19:55:24,14/10/2020,1,9,2,2,1,1,12,27042008,5,0,1,1,1,1,19:53,009C0167, ,1,19:56:50,14/10/2020,1, ,1,12,2,.093,12/7/2020 0:00:00,12/18/2020 17:43:23,1,12101.2977702957,1,11102.7617628561,1
01009010,1,01009010_01,1,4,11,0100900340000,01,01 AGUASCALIENTES,009,009 TEPEZALÁ,MQ004,18:36:14,14/10/2020,19:02:01,14/10/2020,26,1, , , , ,0,0, , , , ,0,0, , , , ,0,0,18:36:14,14/10/2020,1,9,2,2,1,1,48,10051972,5,0,1,1,1,1,19:00,004C0150,NINGUNO,26,19:02:01,14/10/2020,1, ,1,48,2,.095,12/17/2020 0:00:00,12/18/2020 17:43:23,1,12694.5427647911,1,11647.0552730165,1
01009010,3,01009010_03,1,4,11,0100900340000,01,01 AGUASCALIENTES,009,009 TEPEZALÁ,MQ004,19:18:09,14/10/2020,19:27:52,14/10/2020,9,1, , , , ,0,0, , , , ,0,0, , , , ,0,0,19:18:09,14/10/2020,1,9,2,2,1,2,65,30101954,11,0,1,1,1,1,19:26,004C0152,2,9,19:27:52,14/10/2020,1, ,2,65,2,.086,12/8/2020 0:00:00,12/18/2020 17:43:23,1,3127.95562011744,1,2973.79304163266,1
01009010,4,01009010_04,1,4,11,0100900340000,01,01 AGUASCALIENTES,009,009 TEPEZALÁ,MQ004,19:33:31,14/10/2020,21:13:08,14/10/2020,100,1, , , , ,0,0, , , , ,0,0, , , , ,0,0,19:33:31,14/10/2020,1,9,2,2,1,2,20,18111999,10,0,1,1,1,1,19:30,004C0153,NINGUNO,100,21:13:08,14/10/2020,1, ,2,20,2,.08,12/4/2020 0:00:00,12/18/2020 17:43:23,1,5064.77315030329,1,4815.15372371374,1
01009010,5,01009010_05,1,4,11,0100900340000,01,01 AGUASCALIENTES,009,009 TEPEZALÁ,MQ004,19:04:59,14/10/2020,19:18:07,14/10/2020,14,1, , , , ,0,0, , , , ,0,0, , , , ,0,0,19:04:59,14/10/2020,1,9,2,2,1,2,16,5022004,8,0,1,1,1,1,19:04,004C0151,NINGUNO,14,19:18:07,14/10/2020,1, ,2,16,2,.25,12/3/2020 0:00:00,12/18/2020 17:43:23,1,6462.27840235377,1,6143.78235497188,1
01009012,2,01009012_02,1,4,11,0100900340000,01,01 AGUASCALIENTES,009,009 TEPEZALÁ,MQ009,13:05:44,15/10/2020,13:35:42,15/10/2020,30,1, , , , ,0,0, , , , ,0,0, , , , ,0,0,13:05:44,15/10/2020,1,1,2,1,1,2,74,24061946,3,0,1,1,1,1,13:32,009C0175, ,30,13:35:42,15/10/2020,1, ,2,74,2,.083,12/8/2020 0:00:00,12/18/2020 17:43:23,1,6255.25607298949,1,5946.96320620692,1
01009013,1,01009013_01,1,4,11,0100900340000,01,01 AGUASCALIENTES,009,009 TEPEZALÁ,MQ009,11:19:11,16/10/2020,11:37:30,16/10/2020,18,1, , , , ,0,0, , , , ,0,0, , , , ,0,0,11:19:11,16/10/2020,1,3,2,1,1,2,46,18031974,6,1,0,1,1,1,11:28,009C0180, ,18,11:37:30,16/10/2020,1, ,2,46,1,163,11/26/2020 0:00:00,12/18/2020 17:43:23,1,3974.13256847636,1,3778.26581127036,1
01009013,2,01009013_02,1,4,11,0100900340000,01,01 AGUASCALIENTES,009,009 TEPEZALÁ,MQ009,11:37:33,16/10/2020,11:51:05,16/10/2020,14,1, , , , ,0,0, , , , ,0,0, , , , ,0,0,11:37:33,16/10/2020,1,3,2,1,1,2,25,14011995,9,1,0,1,1,1,11:48,009C0181, ,14,11:51:05,16/10/2020,1, ,2,25,1,149.4,12/4/2020 0:00:00,12/18/2020 17:43:23,1,5064.24272821992,1,4814.64944370078,1
01009014,1,01009014_01,1,4,11,0100900340000,01,01 AGUASCALIENTES,009,009 TEPEZALÁ,MQ009,15:45:52,15/10/2020,15:51:27,15/10/2020,6,1, , , , ,0,0, , , , ,0,0, , , , ,0,0,15:45:52,15/10/2020,1,3,2,2,1,2,53,15071967,3,0,1,1,1,1,15:39,009C0176, ,6,15:51:27,15/10/2020,1, ,2,53,2,.09,12/17/2020 0:00:00,12/18/2020 17:43:23,1,3127.62803649475,1,2973.48160310346,1
01009014,2,01009014_02,1,4,11,0100900340000,01,01 AGUASCALIENTES,009,009 TEPEZALÁ,MQ009,15:51:30,15/10/2020,15:55:10,15/10/2020,4,1, , , , ,0,0, , , , ,0,0, , , , ,0,0,15:51:30,15/10/2020,1,9,2,2,1,2,12,17082008,1,0,1,1,1,1,15:53,009C0177, ,4,15:55:10,15/10/2020,1, ,2,12,2,.078,12/3/2020 0:00:00,12/18/2020 17:43:23,1,6461.6016227485,1,6143.13893072764,1
01009020,1,01009020_01,1,4,11,0100900340000,01,01 AGUASCALIENTES,009,009 TEPEZALÁ,MQ004,07:39:25,16/10/2020,07:54:40,16/10/2020,15,1, , , , ,0,0, , , , ,0,0, , , , ,0,0,07:39:25,16/10/2020,1,3,2,1,1,1,61,26081959,1,1,0,1,1,1,07:47,004C0159, ,15,07:54:40,16/10/2020,1, ,1,61,2,.171,12/8/2020 0:00:00,12/18/2020 17:43:23,1,2880.02121866857,1,2642.37688137364,1
01009020,2,01009020_02,1,4,11,0100900340000,01,01 AGUASCALIENTES,009,009 TEPEZALÁ,MQ004,07:54:42,16/10/2020,07:55:46,16/10/2020,1,1, , , , ,0,0, , , , ,0,0, , , , ,0,0,07:54:42,16/10/2020,1,1,2,1,1,2,36,21051984,4,1,0,1,1,1,07:55,004C0160, ,1,07:55:46,16/10/2020,1, ,2,36,1,149.2,11/26/2020 0:00:00,12/18/2020 17:43:23,1,3974.13256847636,1,3778.26581127036,1
01009021,3,01009021_03,1,4,11,0100900340000,01,01 AGUASCALIENTES,009,009 TEPEZALÁ,MQ004,19:24:50,15/10/2020,19:45:45,15/10/2020,21,1, , , , ,0,0, , , , ,0,0, , , , ,0,0,19:24:50,15/10/2020,1,9,2,2,1,2,23,17111996,10,0,1,1,1,1,19:43,004C0156, ,21,19:45:45,15/10/2020,1, ,2,23,2,.076,12/4/2020 0:00:00,12/18/2020 17:43:23,1,15192.7281846598,1,14443.9483311023,1
01009021,4,01009021_04,1,4,11,0100900340000,01,01 AGUASCALIENTES,009,009 TEPEZALÁ,MQ004,19:47:20,15/10/2020,20:11:12,15/10/2020,24,1, , , , ,0,0, , , , ,0,0, , , , ,0,0,19:47:20,15/10/2020,1,9, ,2,1,2,9,22012011,8,0,1,1,1,1,19:47,004C0157, ,24,20:11:12,15/10/2020,1, ,2,9,2,.082,12/14/2020 0:00:00,12/18/2020 17:43:23,1,24456.8765652435,1,23251.5093507175,1
01009021,6,01009021_06,1,4,11,0100900340000,01,01 AGUASCALIENTES,009,009 TEPEZALÁ,MQ004,20:11:18,15/10/2020,23:13:37,15/10/2020,182,1, , , , ,0,0, , , , ,0,0, , , , ,0,0,20:11:18,15/10/2020,1,9, ,2,1,2,2,30042018,5,0,1,1,1,1,20:10,004C0158, ,182,23:13:37,15/10/2020,1, ,2,2,2,.07,12/2/2020 0:00:00,12/18/2020 17:43:23,1,32702.0778041465,1,36194.3492354381,1
01009022,1,01009022_01,1,4,11,0100900340000,01,01 AGUASCALIENTES,009,009 TEPEZALÁ,MQ009,05:27:49,17/10/2020,05:44:29,17/10/2020,17,1, , , , ,0,0, , , , ,0,0, , , , ,0,0,05:27:49,17/10/2020,1,9,1,2,1,1,39,21031981,6,1,0,1,1,1,05:41,009C0182, ,17,05:44:29,17/10/2020,1, ,1,39,2,.207,12/17/2020 0:00:00,12/18/2020 17:43:23,1,12693.2132944238,1,11645.8355036132,1
01009023,2,01009023_02,1,4,11,0100900340000,01,01 AGUASCALIENTES,009,009 TEPEZALÁ,MQ009,19:18:13,15/10/2020,19:35:03,15/10/2020,17,1, , , , ,0,0, , , , ,0,0, , , , ,0,0,19:18:13,15/10/2020,1,3,2,2,1,2,50,24071970,2,0,1,1,1,1,19:33,009C0178, ,17,19:35:03,15/10/2020,1, ,2,50,1,172.3,12/8/2020 0:00:00,12/18/2020 17:43:23,1,3127.62803649475,1,2973.48160310346,1
01009023,4,01009023_04,1,4,11,0100900340000,01,01 AGUASCALIENTES,009,009 TEPEZALÁ,MQ009,19:35:15,15/10/2020,19:41:55,15/10/2020,6,1, , , , ,0,0, , , , ,0,0, , , , ,0,0,19:35:15,15/10/2020,1,9,2,2,1,1,20,18072000,2,0,1,1,1,1,19:40,009C0179, ,6,19:41:55,15/10/2020,1, ,1,20,2,.073,12/14/2020 0:00:00,12/18/2020 17:43:23,1,17696.1720070679,1,16235.9761439204,1
01010005,1,01010005_01,2,4,12,0101001580001,01,01 AGUASCALIENTES,010,010 EL LLANO,MQ004,17:51:47,08/10/2020,19:36:10,08/10/2020,105,1, , , , ,0,0, , , , ,0,0, , , , ,0,0,17:51:47,08/10/2020,1,3,1,2,1,1,76,15031944,6,0,1,1,1,1,18:02,004C0125,NINGUNO,105,19:36:10,08/10/2020,1, ,1,76,2,.175,12/15/2020 0:00:00,12/18/2020 17:43:23,1,2178.76605410106,2,2284.15744411758,2
01010006,1,01010006_01,2,4,12,0101001580001,01,01 AGUASCALIENTES,010,010 EL LLANO,MQ004,13:23:24,10/10/2020,13:37:47,10/10/2020,14,1, , , , ,0,0, , , , ,0,0, , , , ,0,0,13:23:24,10/10/2020,1,3,1,1,1,2,79,23031941,6,0,1,1,1,1,13:35,004C0138,NINGUNO,14,13:37:47,10/10/2020,1, ,2,79,2,.08,12/15/2020 0:00:00,12/18/2020 17:43:23,1,2366.08319119252,2,2406.35759751194,2
01010007,1,01010007_01,2,4,12,0101001580001,01,01 AGUASCALIENTES,010,010 EL LLANO,MQ009,20:20:48,09/10/2020,20:21:40,09/10/2020,1,1, , , , ,0,0, , , , ,0,0, , , , ,0,0,20:20:48,09/10/2020,1,9,2,2,1,1,46,16071974,2,0,1,1,1,1,20:01,009C0141, ,1,20:21:40,09/10/2020,1, ,1,46,2,.087,12/4/2020 0:00:00,12/18/2020 17:43:23,1,9602.54808682971,2,10067.0430649236,2
01010007,3,01010007_03,2,4,12,0101001580001,01,01 AGUASCALIENTES,010,010 EL LLANO,MQ009,20:21:46,09/10/2020,20:22:30,09/10/2020,1,1, , , , ,0,0, , , , ,0,0, , , , ,0,0,20:21:46,09/10/2020,1,9,2,2,1,1,10,8062010,4,0,1,1,1,1,20:11,009C0142, ,1,20:22:30,09/10/2020,1, ,1,10,2,.098,12/17/2020 0:00:00,12/18/2020 17:43:23,1,9153.79906983372,2,9596.5871360815,2
01010007,4,01010007_04,2,4,12,0101001580001,01,01 AGUASCALIENTES,010,010 EL LLANO,MQ009,20:22:31,09/10/2020,20:23:22,09/10/2020,1,1, , , , ,0,0, , , , ,0,0, , , , ,0,0,20:22:31,09/10/2020,1,9, ,2,1,1,6,12122013,9,0,1,1,1,1,20:07,009C0143, ,1,20:23:22,09/10/2020,1, ,1,6,2,.086,12/12/2020 0:00:00,12/18/2020 17:43:23,1,8636.52376846429,2,9054.2901657128,2
01010007,5,01010007_05,2,4,12,0101001580001,01,01 AGUASCALIENTES,010,010 EL LLANO,MQ009,20:23:24,09/10/2020,20:24:03,09/10/2020,1,1, , , , ,0,0, , , , ,0,0, , , , ,0,0,20:23:24,09/10/2020,1,9, ,2,1,2,4,8052016,5,0,1,1,1,1,20:17,009C0144, ,1,20:24:03,09/10/2020,1, ,2,4,2,.195,12/2/2020 0:00:00,12/18/2020 17:43:23,1,24739.4625277049,2,23196.9927375327,2
01010008,1,01010008_01,2,4,12,0101001580001,01,01 AGUASCALIENTES,010,010 EL LLANO,MQ009,11:49:20,09/10/2020,11:51:19,09/10/2020,2,1, , , , ,0,0, , , , ,0,0, , , , ,0,0,11:49:20,09/10/2020,1,3,2,1,1,2,73,18081947,1,0,1,1,1,1,11:48,009C0139, ,2,11:51:19,09/10/2020,1, ,2,73,2,.084,12/8/2020 0:00:00,12/18/2020 17:43:23,1,3459.27352636375,2,3518.15572800797,2