﻿FOLIO_I,ID_INT,FOLIO_INT,estrato,region_cv,est_sel,Upm,ENTIDAD,DESC_ENT,municipio,desc_mun,maquina,hora_ini_1,fecha_ini_1,hora_fin_1,fecha_fin_1,tiempo1,resultado_1,hora_ini_2,fecha_ini_2,hora_fin_2,fecha_fin_2,tiempo2,resultado_2,hora_ini_3,fecha_ini_3,hora_fin_3,fecha_fin_3,tiempo3,resultado_3,hora_ini_4,fecha_ini_4,hora_fin_4,fecha_fin_4,tiempo4,resultado_4,hora_ini,fecha_ini,localizado,H0902A,H0302,H0303,H0304,MESES,VIVO,sv,scv,nota1,nota01,san01,san02,san04,Etiqueta,comentario,tiempo,hora_fin,fecha_fin,completa,otroent,Sexo,Edad,valor.AAT,fecdeterm.AAT,valor.AC_URICO,fecdeterm.AC_URICO,valor.ALBUM,fecdeterm.ALBUM,valor.ALT,fecdeterm.ALT,valor.COL_HDL,fecdeterm.COL_HDL,valor.COL_LDL,fecdeterm.COL_LDL,valor.COLEST,fecdeterm.COLEST,valor.CREAT,fecdeterm.CREAT,valor.GGT,fecdeterm.GGT,valor.GLU_SUERO,fecdeterm.GLU_SUERO,valor.INSULINA,fecdeterm.INSULINA,valor.TRIG,fecdeterm.TRIG,timegen,HB1AC.Valor,HB1AC.fecdeterm,con_datos,ponde_g,rural_20,ponde_g20,area_20
01001001,1,01001001_01,3,4,13,0100108010001,01,01 AGUASCALIENTES,001,001 AGUASCALIENTES,MQ009,08:02:33,13/10/2020,08:16:35,13/10/2020,14,1, , , , ,0,0, , , , ,0,0, , , , ,0,0,08:02:33,13/10/2020,1,3,1,71,8091949,1,1,1,0,1,1,1,08:13,9,009S0045, ,14,08:16:35,13/10/2020,1, ,1,71,18,12/6/2020 0:00:00,7,12/6/2020 0:00:00,3.9,12/6/2020 0:00:00,16,12/6/2020 0:00:00,46,12/6/2020 0:00:00,132,12/6/2020 0:00:00,208,12/6/2020 0:00:00,1.2,12/6/2020 0:00:00,26,12/6/2020 0:00:00,86,12/6/2020 0:00:00,13.5,12/6/2020 0:00:00,184,12/6/2020 0:00:00,12/18/2020 17:42:09,6.1,12/6/2020 0:00:00,1,35073.2611392027,3,39480.6508034965,2
01001001,2,01001001_02,3,4,13,0100108010001,01,01 AGUASCALIENTES,001,001 AGUASCALIENTES,MQ009,08:16:37,13/10/2020,08:21:46,13/10/2020,5,1, , , , ,0,0, , , , ,0,0, , , , ,0,0,08:16:37,13/10/2020,1,9,1,33,11121986,10,1,1,0,1,1,1,08:18,9,009S0046, ,5,08:21:46,13/10/2020,1, ,1,33,40,12/4/2020 0:00:00,6.3,12/4/2020 0:00:00,4.6,12/4/2020 0:00:00,85,12/4/2020 0:00:00,37,12/4/2020 0:00:00,109,12/4/2020 0:00:00,205,12/4/2020 0:00:00,.88,12/4/2020 0:00:00,63,12/4/2020 0:00:00,84,12/4/2020 0:00:00,10.8,12/4/2020 0:00:00,496,12/4/2020 0:00:00,12/18/2020 17:42:09,5.4,11/29/2020 0:00:00,1,203516.395655166,3,188923.27436903,2
01001012,1,01001012_01,3,4,13,0100108010001,01,01 AGUASCALIENTES,001,001 AGUASCALIENTES,MQ004,08:29:23,14/10/2020,08:35:57,14/10/2020,6,1, , , , ,0,0, , , , ,0,0, , , , ,0,0,08:29:23,14/10/2020,1,9,2,74,3051946,5,1,1,0,1,1,1,08:33,12,004S0046, ,6,08:35:57,14/10/2020,1, ,2,74,21,12/13/2020 0:00:00,5,12/13/2020 0:00:00,4,12/13/2020 0:00:00,16,12/13/2020 0:00:00,48,12/13/2020 0:00:00,120,12/13/2020 0:00:00,204,12/13/2020 0:00:00,.5,12/13/2020 0:00:00,25,12/13/2020 0:00:00,92,12/13/2020 0:00:00,10.7,12/13/2020 0:00:00,206,12/13/2020 0:00:00,12/18/2020 17:42:09,5.7,11/27/2020 0:00:00,1,80107.9908125947,3,95696.4277791315,2
01001018,1,01001018_01,3,4,13,0100108010001,01,01 AGUASCALIENTES,001,001 AGUASCALIENTES,MQ009,08:22:14,15/10/2020,08:41:49,15/10/2020,19,1, , , , ,0,0, , , , ,0,0, , , , ,0,0,08:22:14,15/10/2020,1,3,1,62,4051958,5,1,1,0,1,1,1,08:39,9,009S0047, ,19,08:41:49,15/10/2020,1, ,1,62,16,12/6/2020 0:00:00,4.5,12/6/2020 0:00:00,4.5,12/6/2020 0:00:00,12,12/6/2020 0:00:00,41,12/6/2020 0:00:00,130,12/6/2020 0:00:00,211,12/6/2020 0:00:00,1,12/6/2020 0:00:00,26,12/6/2020 0:00:00,94,12/6/2020 0:00:00,19.2,12/6/2020 0:00:00,268,12/6/2020 0:00:00,12/18/2020 17:42:09,5.9,12/6/2020 0:00:00,1,69343.7318904372,3,78057.6306637641,2
01009004,2,01009004_02,1,4,11,0100900340000,01,01 AGUASCALIENTES,009,009 TEPEZALÁ,MQ004,08:27:06,15/10/2020,08:28:26,15/10/2020,1,1, , , , ,0,0, , , , ,0,0, , , , ,0,0,08:27:06,15/10/2020,1,9,2,39,18071981,2,1,1,0,1,1,1,08:27,10,004S0047,NINGUNO,1,08:28:26,15/10/2020,1, ,2,39,14,12/11/2020 0:00:00,4.9,12/11/2020 0:00:00,3.9,12/11/2020 0:00:00,12,12/11/2020 0:00:00,37,12/11/2020 0:00:00,73,12/11/2020 0:00:00,129,12/11/2020 0:00:00,.69,12/11/2020 0:00:00,31,12/11/2020 0:00:00,89,12/11/2020 0:00:00,33.6,12/11/2020 0:00:00,183,12/11/2020 0:00:00,12/18/2020 17:42:09,5.3,12/6/2020 0:00:00,1,36628.0996227387,1,40404.6657085761,1
01009013,1,01009013_01,1,4,11,0100900340000,01,01 AGUASCALIENTES,009,009 TEPEZALÁ,MQ009,11:19:11,16/10/2020,11:37:30,16/10/2020,18,1, , , , ,0,0, , , , ,0,0, , , , ,0,0,11:19:11,16/10/2020,1,3,2,46,18031974,6,1,1,0,1,1,1,11:28,15,009S0048, ,18,11:37:30,16/10/2020,1, ,2,46,30,12/5/2020 0:00:00,6.7,12/5/2020 0:00:00,4.8,12/5/2020 0:00:00,29,12/5/2020 0:00:00,30,12/5/2020 0:00:00,117,12/5/2020 0:00:00,170,12/5/2020 0:00:00,.6,12/5/2020 0:00:00,22,12/5/2020 0:00:00,85,12/5/2020 0:00:00,23.3,12/5/2020 0:00:00,206,12/5/2020 0:00:00,12/18/2020 17:42:09,5.2,12/6/2020 0:00:00,1,12085.5840283186,1,13331.6767068629,1
01009013,2,01009013_02,1,4,11,0100900340000,01,01 AGUASCALIENTES,009,009 TEPEZALÁ,MQ009,11:37:33,16/10/2020,11:51:05,16/10/2020,14,1, , , , ,0,0, , , , ,0,0, , , , ,0,0,11:37:33,16/10/2020,1,3,2,25,14011995,9,1,1,0,1,1,1,11:48,16,009S0049, ,14,11:51:05,16/10/2020,1, ,2,25,14,12/6/2020 0:00:00,6.2,12/6/2020 0:00:00,4.3,12/6/2020 0:00:00,14,12/6/2020 0:00:00,50,12/6/2020 0:00:00,121,12/6/2020 0:00:00,198,12/6/2020 0:00:00,.7,12/6/2020 0:00:00,14,12/6/2020 0:00:00,80,12/6/2020 0:00:00,8.7,12/6/2020 0:00:00,181,12/6/2020 0:00:00,12/18/2020 17:42:09,5.3,11/27/2020 0:00:00,1,14568.9866019767,1,12460.5327572869,1
01009020,1,01009020_01,1,4,11,0100900340000,01,01 AGUASCALIENTES,009,009 TEPEZALÁ,MQ004,07:39:25,16/10/2020,07:54:40,16/10/2020,15,1, , , , ,0,0, , , , ,0,0, , , , ,0,0,07:39:25,16/10/2020,1,3,1,61,26081959,1,1,1,0,1,1,1,07:47,10,004S0048, ,15,07:54:40,16/10/2020,1, ,1,61,16,11/30/2020 0:00:00,7.5,11/30/2020 0:00:00,4.1,11/30/2020 0:00:00,13,11/30/2020 0:00:00,37,11/30/2020 0:00:00,119,11/30/2020 0:00:00,190,11/30/2020 0:00:00,.8,11/30/2020 0:00:00,18,11/30/2020 0:00:00,109,11/30/2020 0:00:00,8.8,11/30/2020 0:00:00,237,11/30/2020 0:00:00,12/18/2020 17:42:09,5.4,12/6/2020 0:00:00,1,8742.11418819446,1,8260.02526169725,1
01009020,2,01009020_02,1,4,11,0100900340000,01,01 AGUASCALIENTES,009,009 TEPEZALÁ,MQ004,07:54:42,16/10/2020,07:55:46,16/10/2020,1,1, , , , ,0,0, , , , ,0,0, , , , ,0,0,07:54:42,16/10/2020,1,1,2,36,21051984,4,1,1,0,1,1,1,07:55,10,004S0049, ,1,07:55:46,16/10/2020,1, ,2,36,35,12/5/2020 0:00:00,4.1,12/5/2020 0:00:00,3.9,12/5/2020 0:00:00,48,12/5/2020 0:00:00,46,12/5/2020 0:00:00,157,12/5/2020 0:00:00,233,12/5/2020 0:00:00,.5,12/5/2020 0:00:00,91,12/5/2020 0:00:00,199,12/5/2020 0:00:00,18.3,12/5/2020 0:00:00,217,12/5/2020 0:00:00,12/18/2020 17:42:09,8.1,12/6/2020 0:00:00,1,9160.76114866632,1,10105.2878980976,1
01009022,1,01009022_01,1,4,11,0100900340000,01,01 AGUASCALIENTES,009,009 TEPEZALÁ,MQ009,05:27:49,17/10/2020,05:44:29,17/10/2020,17,1, , , , ,0,0, , , , ,0,0, , , , ,0,0,05:27:49,17/10/2020,1,9,1,39,21031981,6,1,1,0,1,1,1,05:41,9,009S0050, ,17,05:44:29,17/10/2020,1, ,1,39,26,12/10/2020 0:00:00,6.3,12/10/2020 0:00:00,4.1,12/10/2020 0:00:00,32,12/10/2020 0:00:00,41,12/10/2020 0:00:00,145,12/10/2020 0:00:00,208,12/10/2020 0:00:00,.76,12/10/2020 0:00:00,36,12/10/2020 0:00:00,87,12/10/2020 0:00:00,20,12/10/2020 0:00:00,213,12/10/2020 0:00:00,12/18/2020 17:42:09,5.6,12/2/2020 0:00:00,1,54517.5525484144,1,45868.9840965142,1
01010010,2,01010010_02,2,4,12,0101001580001,01,01 AGUASCALIENTES,010,010 EL LLANO,MQ009,08:44:08,09/10/2020,08:46:13,09/10/2020,2,1, , , , ,0,0, , , , ,0,0, , , , ,0,0,08:44:08,09/10/2020,1,9,2,60,5051960,5,1,1,0,1,1,1,08:42,10,009S0038, ,2,08:46:13,09/10/2020,1, ,2,60,14,12/13/2020 0:00:00,4.5,12/13/2020 0:00:00,2.9,12/13/2020 0:00:00,8,12/13/2020 0:00:00,46,12/13/2020 0:00:00,108,12/13/2020 0:00:00,146,12/13/2020 0:00:00,.6,12/13/2020 0:00:00,13,12/13/2020 0:00:00,90,12/13/2020 0:00:00,5.7,12/13/2020 0:00:00,73,12/13/2020 0:00:00,12/18/2020 17:42:09,5.1,12/13/2020 0:00:00,1,26849.698714697,2,29567.5137522304,2
01010010,3,01010010_03,2,4,12,0101001580001,01,01 AGUASCALIENTES,010,010 EL LLANO,MQ009,11:58:57,09/10/2020,12:05:41,09/10/2020,7,1, , , , ,0,0, , , , ,0,0, , , , ,0,0,11:58:57,09/10/2020,1,9,2,30,29051990,4,1,1,0,1,1,1,12:00,11,009S0041, ,7,12:05:41,09/10/2020,1, ,2,30,15,12/6/2020 0:00:00,4.2,12/6/2020 0:00:00,3.9,12/6/2020 0:00:00,10,12/6/2020 0:00:00,39,12/6/2020 0:00:00,74,12/6/2020 0:00:00,128,12/6/2020 0:00:00,.6,12/6/2020 0:00:00,8,12/6/2020 0:00:00,83,12/6/2020 0:00:00,4.4,12/6/2020 0:00:00,129,12/6/2020 0:00:00,12/18/2020 17:42:09,5.5,11/27/2020 0:00:00,1,17497.0150272368,2,18695.9620830177,2
01010015,1,01010015_01,2,4,12,0101001580001,01,01 AGUASCALIENTES,010,010 EL LLANO,MQ009,10:49:30,10/10/2020,11:23:19,10/10/2020,34,1, , , , ,0,0, , , , ,0,0, , , , ,0,0,10:49:30,10/10/2020,1,3,2,62,29071958,2,1,1,0,1,1,1,10:47,12,009S0042, ,34,11:23:19,10/10/2020,1, ,2,62,13,12/13/2020 0:00:00,3.6,12/13/2020 0:00:00,4.2,12/13/2020 0:00:00,8,12/13/2020 0:00:00,59,12/13/2020 0:00:00,94,12/13/2020 0:00:00,184,12/13/2020 0:00:00,.6,12/13/2020 0:00:00,12,12/13/2020 0:00:00,85,12/13/2020 0:00:00,4.4,12/13/2020 0:00:00,139,12/13/2020 0:00:00,12/18/2020 17:42:09,5.5,12/13/2020 0:00:00,1,5710.52452186616,2,6288.56264373289,2
01010024,1,01010024_01,2,4,12,0101001580001,01,01 AGUASCALIENTES,010,010 EL LLANO,MQ009,09:10:34,09/10/2020,09:12:41,09/10/2020,2,1, , , , ,0,0, , , , ,0,0, , , , ,0,0,09:10:34,09/10/2020,1,9,1,48,28021972,7,1,1,0,1,1,1,09:03,11,009S0039, ,2,09:12:41,09/10/2020,1, ,1,48,20,12/15/2020 0:00:00,6.5,12/15/2020 0:00:00,3.9,12/15/2020 0:00:00,22,12/15/2020 0:00:00,33,12/15/2020 0:00:00,103,12/15/2020 0:00:00,162,12/15/2020 0:00:00,1.1,12/15/2020 0:00:00,28,12/15/2020 0:00:00,97,12/15/2020 0:00:00,10.3,12/15/2020 0:00:00,298,12/15/2020 0:00:00,12/18/2020 17:42:09,7.4,12/2/2020 0:00:00,1,37571.113527317,2,40014.5395698434,2
01010024,3,01010024_03,2,4,12,0101001580001,01,01 AGUASCALIENTES,010,010 EL LLANO,MQ009,09:12:43,09/10/2020,09:15:17,09/10/2020,3,1, , , , ,0,0, , , , ,0,0, , , , ,0,0,09:12:43,09/10/2020,1,9,1,21,11091999,0,1,1,0,1,1,1,09:08,11,009S0040, ,3,09:15:17,09/10/2020,1, ,1,21,23,12/4/2020 0:00:00,6.8,12/4/2020 0:00:00,4.3,12/4/2020 0:00:00,29,12/4/2020 0:00:00,27,12/4/2020 0:00:00,90,12/4/2020 0:00:00,130,12/4/2020 0:00:00,.77,12/4/2020 0:00:00,13,12/4/2020 0:00:00,88,12/4/2020 0:00:00,9,12/4/2020 0:00:00,143,12/4/2020 0:00:00,12/18/2020 17:42:09,5.1,11/29/2020 0:00:00,1,34958.874699714,2,33075.9192743609,2
01010026,1,01010026_01,2,4,12,0101001580001,01,01 AGUASCALIENTES,010,010 EL LLANO,MQ009,07:59:05,12/10/2020,08:42:33,12/10/2020,43,1, , , , ,0,0, , , , ,0,0, , , , ,0,0,07:59:05,12/10/2020,1,1,2,76,4011944,9,1,1,0,1,1,1,08:39,11,009S0043, ,43,08:42:33,12/10/2020,1, ,2,76,18,12/4/2020 0:00:00,7.4,12/4/2020 0:00:00,4.1,12/4/2020 0:00:00,12,12/4/2020 0:00:00,58,12/4/2020 0:00:00,122,12/4/2020 0:00:00,212,12/4/2020 0:00:00,.9,12/4/2020 0:00:00,16,12/4/2020 0:00:00,158,12/4/2020 0:00:00,17.4,12/4/2020 0:00:00,171,12/4/2020 0:00:00,12/18/2020 17:42:09,7.2,12/13/2020 0:00:00,1,5839.24145252992,2,6430.30872654693,2
01010026,4,01010026_04,2,4,12,0101001580001,01,01 AGUASCALIENTES,010,010 EL LLANO,MQ009,08:42:36,12/10/2020,08:46:08,12/10/2020,4,1, , , , ,0,0, , , , ,0,0, , , , ,0,0,08:42:36,12/10/2020,1,9,2,22,22111997,10,1,1,0,1,1,1,08:43,10,009S0044, ,4,08:46:08,12/10/2020,1, ,2,22,17,12/15/2020 0:00:00,3.4,12/15/2020 0:00:00,4.4,12/15/2020 0:00:00,10,12/15/2020 0:00:00,44,12/15/2020 0:00:00,64,12/15/2020 0:00:00,112,12/15/2020 0:00:00,.6,12/15/2020 0:00:00,11,12/15/2020 0:00:00,81,12/15/2020 0:00:00,14.9,12/15/2020 0:00:00,92,12/15/2020 0:00:00,12/18/2020 17:42:09,5,11/27/2020 0:00:00,1,15213.1211440866,2,16255.5690574334,2
01010029,1,01010029_01,2,4,12,0101001580001,01,01 AGUASCALIENTES,010,010 EL LLANO,MQ004,09:03:51,10/10/2020,09:46:34,10/10/2020,43,1, , , , ,0,0, , , , ,0,0, , , , ,0,0,09:03:51,10/10/2020,1,1,2,71,1111948,11,1,1,0,1,1,1,09:30,12,004S0043, ,43,09:46:34,10/10/2020,1, ,2,71,15,12/13/2020 0:00:00,5.7,12/13/2020 0:00:00,3.7,12/13/2020 0:00:00,8,12/13/2020 0:00:00,41,12/13/2020 0:00:00,127,12/13/2020 0:00:00,215,12/13/2020 0:00:00,.7,12/13/2020 0:00:00,16,12/13/2020 0:00:00,88,12/13/2020 0:00:00,7.2,12/13/2020 0:00:00,212,12/13/2020 0:00:00,12/18/2020 17:42:09,6.2,12/13/2020 0:00:00,1,5839.24145252992,2,6430.30872654693,2
01010029,2,01010029_02,2,4,12,0101001580001,01,01 AGUASCALIENTES,010,010 EL LLANO,MQ004,09:46:36,10/10/2020,09:52:55,10/10/2020,6,1, , , , ,0,0, , , , ,0,0, , , , ,0,0,09:46:36,10/10/2020,1,1,2,45,20061975,3,1,1,0,1,1,1,09:00,12,004S0044, ,6,09:52:55,10/10/2020,1, ,2,45,19,12/11/2020 0:00:00,5.7,12/11/2020 0:00:00,3.9,12/11/2020 0:00:00,18,12/11/2020 0:00:00,54,12/11/2020 0:00:00,145,12/11/2020 0:00:00,216,12/11/2020 0:00:00,.73,12/11/2020 0:00:00,34,12/11/2020 0:00:00,166,12/11/2020 0:00:00,23.5,12/11/2020 0:00:00,134,12/11/2020 0:00:00,12/18/2020 17:42:09,7,12/6/2020 0:00:00,1,12626.3920893194,2,13224.837460249,2
01010029,4,01010029_04,2,4,12,0101001580001,01,01 AGUASCALIENTES,010,010 EL LLANO,MQ004,10:08:01,10/10/2020,10:10:36,10/10/2020,2,1, , , , ,0,0, , , , ,0,0, , , , ,0,0,10:08:01,10/10/2020,1,9,2,25,5011995,9,1,1,0,1,1,1,10:07,12,004S0045,NINGUNO,2,10:10:36,10/10/2020,1, ,2,25,14,12/11/2020 0:00:00,6.1,12/11/2020 0:00:00,4.7,12/11/2020 0:00:00,12,12/11/2020 0:00:00,56,12/11/2020 0:00:00,90,12/11/2020 0:00:00,157,12/11/2020 0:00:00,.56,12/11/2020 0:00:00,17,12/11/2020 0:00:00,94,12/11/2020 0:00:00,12.5,12/11/2020 0:00:00,89,12/11/2020 0:00:00,12/18/2020 17:42:09,5.3,11/27/2020 0:00:00,1,15213.1211440866,2,16255.5690574334,2
02001005,2,02001005_02,3,1,23,0200195850001,02,02 BAJA CALIFORNIA,001,001 ENSENADA,MQ028,17:02:04,03/11/2020,17:04:57,03/11/2020,2,1, , , , ,0,0, , , , ,0,0, , , , ,0,0,17:02:04,03/11/2020,1,9,2,47,7121972,10,1,1,0,1,1,1,17:00,8,028S0055, ,2,17:04:57,03/11/2020,1, ,2,47,15,12/13/2020 0:00:00,7,12/13/2020 0:00:00,4.2,12/13/2020 0:00:00,15,12/13/2020 0:00:00,50,12/13/2020 0:00:00,192,12/13/2020 0:00:00,279,12/13/2020 0:00:00,.9,12/13/2020 0:00:00,38,12/13/2020 0:00:00,87,12/13/2020 0:00:00,10.3,12/13/2020 0:00:00,323,12/13/2020 0:00:00,12/18/2020 17:42:09,5.5,12/13/2020 0:00:00,1,58326.3168039529,3,55623.9815863404,2
02001011,2,02001011_02,3,1,23,0200195850001,02,02 BAJA CALIFORNIA,001,001 ENSENADA,MQ027,11:14:34,03/11/2020,11:24:31,03/11/2020,10,1, , , , ,0,0, , , , ,0,0, , , , ,0,0,11:14:34,03/11/2020,1,9,2,38,7081982,2,1,1,0,1,1,1,09:22,11,027S0056, ,10,11:24:31,03/11/2020,1, ,2,38,11,12/13/2020 0:00:00,2.1,12/13/2020 0:00:00,4.2,12/13/2020 0:00:00,8,12/13/2020 0:00:00,54,12/13/2020 0:00:00,92,12/13/2020 0:00:00,149,12/13/2020 0:00:00,.6,12/13/2020 0:00:00,8,12/13/2020 0:00:00,90,12/13/2020 0:00:00,7.6,12/13/2020 0:00:00,41,12/13/2020 0:00:00,12/18/2020 17:42:09,5,12/13/2020 0:00:00,1,109717.699264473,3,104634.333487848,2
02002005,2,02002005_02,3,1,23,0200206590001,02,02 BAJA CALIFORNIA,002,002 MEXICALI,MQ027,09:03:04,08/10/2020,09:04:27,08/10/2020,1,1, , , , ,0,0, , , , ,0,0, , , , ,0,0,09:03:04,08/10/2020,1,3,2,45,14051975,4,1,1,0,1,1,1,07:00,8,027S0040, ,1,09:04:27,08/10/2020,1, ,2,45,15,12/6/2020 0:00:00,4.2,12/6/2020 0:00:00,3.7,12/6/2020 0:00:00,16,12/6/2020 0:00:00,46,12/6/2020 0:00:00,115,12/6/2020 0:00:00,172,12/6/2020 0:00:00,.5,12/6/2020 0:00:00,47,12/6/2020 0:00:00,92,12/6/2020 0:00:00,29.5,12/6/2020 0:00:00,159,12/6/2020 0:00:00,12/18/2020 17:42:09,5,12/6/2020 0:00:00,1,32399.8273898222,3,30898.7006361069,2
02002013,2,02002013_02,3,1,23,0200206590001,02,02 BAJA CALIFORNIA,002,002 MEXICALI,MQ028,16:47:43,07/10/2020,16:54:06,07/10/2020,7,1, , , , ,0,0, , , , ,0,0, , , , ,0,0,16:47:43,07/10/2020,1,1,2,69,27051951,4,1,1,0,1,1,1,14:40,8,028S0040, ,7,16:54:06,07/10/2020,1, ,2,69,16,12/6/2020 0:00:00,2.9,12/6/2020 0:00:00,3.8,12/6/2020 0:00:00,23,12/6/2020 0:00:00,49,12/6/2020 0:00:00,144,12/6/2020 0:00:00,260,12/6/2020 0:00:00,.5,12/6/2020 0:00:00,26,12/6/2020 0:00:00,369,12/6/2020 0:00:00,9.9,12/6/2020 0:00:00,360,12/6/2020 0:00:00,12/18/2020 17:42:09,10.8,12/13/2020 0:00:00,1,18880.1692875673,3,21641.3163000171,2
02002020,2,02002020_02,3,1,23,0200206590001,02,02 BAJA CALIFORNIA,002,002 MEXICALI,MQ028,10:05:06,09/10/2020,10:08:55,09/10/2020,3,1, , , , ,0,0, , , , ,0,0, , , , ,0,0,10:05:06,09/10/2020,1,6,2,56,26091964,0,1,1,0,1,1,1,07:00,9,028S0041, ,3,10:08:55,09/10/2020,1, ,2,56,16,12/4/2020 0:00:00,5.3,12/4/2020 0:00:00,3.6,12/4/2020 0:00:00,15,12/4/2020 0:00:00,46,12/4/2020 0:00:00,140,12/4/2020 0:00:00,224,12/4/2020 0:00:00,.76,12/4/2020 0:00:00,16,12/4/2020 0:00:00,84,12/4/2020 0:00:00,10.3,12/4/2020 0:00:00,174,12/4/2020 0:00:00,12/18/2020 17:42:09,5.3,12/6/2020 0:00:00,1,20503.3960588489,3,23501.9333023812,2
02002021,1,02002021_01,3,1,23,0200206590001,02,02 BAJA CALIFORNIA,002,002 MEXICALI,MQ027,09:15:40,10/10/2020,09:17:06,10/10/2020,2,1, , , , ,0,0, , , , ,0,0, , , , ,0,0,09:15:40,10/10/2020,1,9,1,37,1021983,8,1,1,0,1,1,1,07:05,13,027S0043, ,2,09:17:06,10/10/2020,1, ,1,37,37,12/4/2020 0:00:00,8.4,12/4/2020 0:00:00,4.5,12/4/2020 0:00:00,59,12/4/2020 0:00:00,37,12/4/2020 0:00:00,110,12/4/2020 0:00:00,198,12/4/2020 0:00:00,.9,12/4/2020 0:00:00,38,12/4/2020 0:00:00,94,12/4/2020 0:00:00,16.3,12/4/2020 0:00:00,323,12/4/2020 0:00:00,12/18/2020 17:42:09,5.2,12/2/2020 0:00:00,1,18048.6269849361,3,19824.2814664638,2
02002021,2,02002021_02,3,1,23,0200206590001,02,02 BAJA CALIFORNIA,002,002 MEXICALI,MQ027,09:17:08,10/10/2020,09:18:04,10/10/2020,1,1, , , , ,0,0, , , , ,0,0, , , , ,0,0,09:17:08,10/10/2020,1,9,2,34,20031986,6,1,1,0,1,1,1,07:00,13,027S0044, ,1,09:18:04,10/10/2020,1, ,2,34,10,12/8/2020 0:00:00,2.8,12/8/2020 0:00:00,2.9,12/8/2020 0:00:00,8,12/8/2020 0:00:00,25,12/8/2020 0:00:00,65,12/8/2020 0:00:00,106,12/8/2020 0:00:00,.3,12/8/2020 0:00:00,9,12/8/2020 0:00:00,65,12/8/2020 0:00:00,9.9,12/8/2020 0:00:00,118,12/8/2020 0:00:00,12/18/2020 17:42:09,5.3,12/2/2020 0:00:00,1,16704.6569056969,3,14785.3484823111,2
02002024,1,02002024_01,3,1,23,0200206590001,02,02 BAJA CALIFORNIA,002,002 MEXICALI,MQ028,10:08:57,09/10/2020,10:10:40,09/10/2020,2,1, , , , ,0,0, , , , ,0,0, , , , ,0,0,10:08:57,09/10/2020,1,1,2,54,18041966,5,1,1,0,1,1,1,07:15,9,028S0042, ,2,10:10:40,09/10/2020,1, ,2,54,12,12/4/2020 0:00:00,5.2,12/4/2020 0:00:00,4.3,12/4/2020 0:00:00,12,12/4/2020 0:00:00,36,12/4/2020 0:00:00,41,12/4/2020 0:00:00,104,12/4/2020 0:00:00,.45,12/4/2020 0:00:00,16,12/4/2020 0:00:00,161,12/4/2020 0:00:00,35.7,12/4/2020 0:00:00,274,12/4/2020 0:00:00,12/18/2020 17:42:09,5.3,12/6/2020 0:00:00,1,12028.7449648212,3,13787.8993832621,2
02002027,1,02002027_01,3,1,23,0200227630001,02,02 BAJA CALIFORNIA,002,002 MEXICALI,MQ027,10:22:44,02/10/2020,10:24:59,02/10/2020,2,1, , , , ,0,0, , , , ,0,0, , , , ,0,0,10:22:44,02/10/2020,1,3,2,67,24071953,2,1,1,0,1,1,1,08:17,12,027S0030, ,2,10:24:59,02/10/2020,1, ,2,67,19,11/16/2020 0:00:00,7.3,11/13/2020 0:00:00,4,11/16/2020 0:00:00,14,11/17/2020 0:00:00,58,11/13/2020 0:00:00,193,11/13/2020 0:00:00,276,11/14/2020 0:00:00,.79,11/16/2020 0:00:00,12,11/15/2020 0:00:00,93,11/17/2020 0:00:00,6.5,11/12/2020 0:00:00,166,11/15/2020 0:00:00,12/18/2020 17:42:09,5.5,11/27/2020 0:00:00,1,26073.6231131431,3,29886.7831259616,2
02002027,2,02002027_02,3,1,23,0200227630001,02,02 BAJA CALIFORNIA,002,002 MEXICALI,MQ027,11:37:25,03/10/2020,11:54:49,03/10/2020,17,1, , , , ,0,0, , , , ,0,0, , , , ,0,0,11:37:25,03/10/2020,1,9,1,39,26031981,6,1,1,0,1,1,1,09:35,11,027S0031, ,17,11:54:49,03/10/2020,1, ,1,39,17,11/26/2020 0:00:00,6.7,11/26/2020 0:00:00,4.1,11/21/2020 0:00:00,17,11/26/2020 0:00:00,34,11/25/2020 0:00:00,149,11/25/2020 0:00:00,215,11/26/2020 0:00:00,1.12,11/21/2020 0:00:00,33,11/26/2020 0:00:00,96,11/26/2020 0:00:00,23.4,11/26/2020 0:00:00,131,11/26/2020 0:00:00,12/18/2020 17:42:09,5.4,11/24/2020 0:00:00,1,45903.9172207599,3,50420.0223184356,2
02002029,1,02002029_01,3,1,23,0200227630001,02,02 BAJA CALIFORNIA,002,002 MEXICALI,MQ027,11:34:06,05/10/2020,11:35:24,05/10/2020,1,1, , , , ,0,0, , , , ,0,0, , , , ,0,0,11:34:06,05/10/2020,1,9,2,33,31101986,11,1,1,0,1,1,1,09:30,12,027S0032, ,1,11:35:24,05/10/2020,1, ,2,33,13,12/8/2020 0:00:00,2.9,12/8/2020 0:00:00,4.4,12/8/2020 0:00:00,7,12/8/2020 0:00:00,53,12/8/2020 0:00:00,63,12/8/2020 0:00:00,132,12/8/2020 0:00:00,.7,12/8/2020 0:00:00,10,12/8/2020 0:00:00,93,12/8/2020 0:00:00,2.8,12/8/2020 0:00:00,59,12/8/2020 0:00:00,12/18/2020 17:42:09,5.1,12/2/2020 0:00:00,1,42485.7352551143,3,37604.2683678134,2
02002029,2,02002029_02,3,1,23,0200227630001,02,02 BAJA CALIFORNIA,002,002 MEXICALI,MQ027,11:35:33,05/10/2020,11:36:40,05/10/2020,1,1, , , , ,0,0, , , , ,0,0, , , , ,0,0,11:35:33,05/10/2020,1,9,1,35,26091985,0,1,1,0,1,1,1,09:28,12,027S0033, ,1,11:36:40,05/10/2020,1, ,1,35,18,12/4/2020 0:00:00,5.9,12/4/2020 0:00:00,4.3,12/4/2020 0:00:00,25,12/4/2020 0:00:00,46,12/4/2020 0:00:00,156,12/4/2020 0:00:00,216,12/4/2020 0:00:00,.8,12/4/2020 0:00:00,40,12/4/2020 0:00:00,103,12/4/2020 0:00:00,8.7,12/4/2020 0:00:00,119,12/4/2020 0:00:00,12/18/2020 17:42:09,5.2,12/2/2020 0:00:00,1,45903.9172207599,3,50420.0223184356,2
02002047,2,02002047_02,3,1,23,0200243120001,02,02 BAJA CALIFORNIA,002,002 MEXICALI,MQ027,09:44:57,06/10/2020,09:46:34,06/10/2020,2,1, , , , ,0,0, , , , ,0,0, , , , ,0,0,09:44:57,06/10/2020,1,2,2,50,19121969,9,1,1,0,1,1,1,07:40,11,027S0037, ,2,09:46:34,06/10/2020,1, ,2,50,15,12/4/2020 0:00:00,4.9,12/4/2020 0:00:00,4.4,12/4/2020 0:00:00,10,12/4/2020 0:00:00,39,12/4/2020 0:00:00,136,12/4/2020 0:00:00,209,12/4/2020 0:00:00,.62,12/4/2020 0:00:00,24,12/4/2020 0:00:00,93,12/4/2020 0:00:00,16.5,12/4/2020 0:00:00,204,12/4/2020 0:00:00,12/18/2020 17:42:09,5.3,12/5/2020 0:00:00,1,12497.8193050247,3,14325.5739141389,2
02002052,2,02002052_02,3,1,23,0200243120001,02,02 BAJA CALIFORNIA,002,002 MEXICALI,MQ027,20:18:05,06/10/2020,20:23:04,06/10/2020,5,1, , , , ,0,0, , , , ,0,0, , , , ,0,0,20:18:05,06/10/2020,1,9,2,50,11011970,8,1,1,0,1,1,1,18:10,8,027S0038, ,5,20:23:04,06/10/2020,1, ,2,50,18,12/4/2020 0:00:00,4.7,12/4/2020 0:00:00,4,12/4/2020 0:00:00,17,12/4/2020 0:00:00,34,12/4/2020 0:00:00,96,12/4/2020 0:00:00,167,12/4/2020 0:00:00,.51,12/4/2020 0:00:00,27,12/4/2020 0:00:00,86,12/4/2020 0:00:00,20.9,12/4/2020 0:00:00,240,12/4/2020 0:00:00,12/18/2020 17:42:09,5.8,12/5/2020 0:00:00,1,13981.2922602175,3,16025.9986802975,2
02002052,3,02002052_03,3,1,23,0200243120001,02,02 BAJA CALIFORNIA,002,002 MEXICALI,MQ027,11:05:52,07/10/2020,11:07:40,07/10/2020,2,1, , , , ,0,0, , , , ,0,0, , , , ,0,0,11:05:52,07/10/2020,1,9,2,23,4101997,0,1,1,0,1,1,1,09:00,12,027S0039, ,2,11:07:40,07/10/2020,1, ,2,23,14,12/8/2020 0:00:00,4.3,12/8/2020 0:00:00,3.8,12/8/2020 0:00:00,21,12/8/2020 0:00:00,47,12/8/2020 0:00:00,117,12/8/2020 0:00:00,183,12/8/2020 0:00:00,.5,12/8/2020 0:00:00,18,12/8/2020 0:00:00,80,12/8/2020 0:00:00,13.8,12/8/2020 0:00:00,121,12/8/2020 0:00:00,12/18/2020 17:42:09,4.9,12/2/2020 0:00:00,1,20364.6052547213,3,18024.781179018,2
02002053,1,02002053_01,3,1,23,0200243120001,02,02 BAJA CALIFORNIA,002,002 MEXICALI,MQ027,09:04:51,06/10/2020,09:10:05,06/10/2020,6,1, , , , ,0,0, , , , ,0,0, , , , ,0,0,09:04:51,06/10/2020,1,9,1,26,22091994,0,1,1,0,1,1,1,07:05,11,027S0036, ,6,09:10:05,06/10/2020,1, ,1,26,23,12/10/2020 0:00:00,6.4,12/10/2020 0:00:00,4.3,12/10/2020 0:00:00,37,12/10/2020 0:00:00,35,12/10/2020 0:00:00,83,12/10/2020 0:00:00,162,12/10/2020 0:00:00,.8,12/10/2020 0:00:00,58,12/10/2020 0:00:00,90,12/10/2020 0:00:00,23.5,12/10/2020 0:00:00,382,12/10/2020 0:00:00,12/18/2020 17:42:09,5.1,12/2/2020 0:00:00,1,74755.0081360159,3,66586.2038473465,2
02002056,1,02002056_01,3,1,23,0200243120001,02,02 BAJA CALIFORNIA,002,002 MEXICALI,MQ028,09:49:16,06/10/2020,10:30:55,06/10/2020,41,1, , , , ,0,0, , , , ,0,0, , , , ,0,0,09:49:16,06/10/2020,1,2,1,71,10061949,3,1,1,0,1,1,1,08:25,9,028S0037, ,41,10:30:55,06/10/2020,1, ,1,71,15,12/6/2020 0:00:00,4,12/6/2020 0:00:00,4.2,12/6/2020 0:00:00,10,12/6/2020 0:00:00,36,12/6/2020 0:00:00,118,12/6/2020 0:00:00,191,12/6/2020 0:00:00,.9,12/6/2020 0:00:00,18,12/6/2020 0:00:00,75,12/6/2020 0:00:00,5.8,12/6/2020 0:00:00,164,12/6/2020 0:00:00,12/18/2020 17:42:09,5.2,12/6/2020 0:00:00,1,38169.0103160179,3,41226.5463956386,2