﻿FOLIO_I,ID_INT,FOLIO_INT,ENTIDAD,DESC_ENT,VIVO,H0302,H0303,H0303AD,H0303AM,H0304,MESES,H0305,H0305_ES,INT_NUEVO,INTP1,H0306,H0306E,H0306P,H0307,H0307Q,H0308,H0308Q,H0310A,H0310B,H0310C,H0310E,H0311,H0312,H0313,H0314,H0315,H0316,H0316ESP,H0317A,H0317G,H0318,INTP3,H0319,H0320,H0320Q,H0322,H0322A,H0321,H0323,H0323ESP,H0324A,H0324B,H0324C,H0324D,H0324E,H0324F,H0324G,H0324H,H0324I,H0324J,H0324K,INTP4,H0401,H0402,H0402ESP,H0403,H0404,H0405A,H0405B,H0405C,H0405ESP,H0406,H0407A,H0407B,H0407C,H0407ESP,H0408,H0408ESP,H0409A,H0409B,H0409C,H0902A,H0902B,H0902C,H0902D,H0902E,H0902F,H0902G,H0902H,H0904,H0905,H0906,H0910,H0911,H12011,H12011E,H12012,H12012E,H12013,H13000,H13001,H13002,H1302A,H1302B,H1302C,H1302D,H1302E1,H1302F,H1302G,H1302H,H1302I,H1302J,H1302K,H1302L,H1302M,H1302N,H1302O,H1302P,H1302E,H13022,H1303,H1304A,H1304B,H1304C,H1304D,H1304E1,H1304F,H1304G,H1304H,H1304I,H1304J,H1304E,H1305A,H1305B,H1305C,H1305D,H1305E1,H1305F,H1305G,H1305H,H1305E,H1306,H1307A,H1307B,H1307C,H1307D,H1307E1,H1307F,H1307G,H1307H,H1307I,H1307J,H1307K,H1307L,H1307M,H1307N,H1307E,H1308A,H1308B,H1308C,H1308D,H1309,H1309E,H1310,H1311,H1311E,H1312,H1313A,H1313B,H1313C,H1313D,H1313E1,H1313F,H1313G,H1313H,H1313I,H1313J,H1313K,H1313L,H1313M,H1313N,H1313O,H1313P,H1313Q,H1313E,H1314A,H1314B,H1314C,H1314D,H1315,H1315E,H1315A,H1316,H13161,H13161AA,H13161AB,H13161AC,H13161AD,H13161AE,H13161AF,H13161AG,H13161AH,H1317A,H1317B,H1317C,H1317D,H1317E,H1318,H1319,H1319E,H1320A,H1320B,H1320C,H1321,H1322,H1323,H1324,H1325,H1326,H1327,H1328A,H1329A,H1328B,H1329B,H1328C,H1329C,H17A01,H17A02,H17A03,H17A04A,H17A04B,H17A04C,H17A04D,H17A04E1,H17A04F,H17A04G,H17A04E,COMPLETA1,ponde_f,estrato,region_cv,est_sel,Upm,rural_20,ponde_f20,area_20
01001001,1,01001001_01,01,01 AGUASCALIENTES,1,1,71, , ,8091949,1,1, ,1,1,1, , ,3, ,3, ,01, , , ,2, ,2, , , , ,3,3, ,1,5, , , , ,1,6, , , , , , , , , , , , ,1,1,28, ,2,1, , , , ,1, , , , ,1, ,1, , ,3, , , , , , , ,2, ,1,2,1,7, , , ,2,2,3, ,16, , , , , , , , , , , , , , , , , , , , , , , , , , , , , , , , , , , , , , , , , , , , , , , , , , , , , , , , , , , , , , , , , , , , , , , , , , , , , , , , , , , , , , , , , , , , , , , , , , , , , , , , , , , , , , , , , , , , , , , , , , , ,2,3,1,2,3,5, , , , , ,1,7092.69931081463,3,4,13,0100108010001,3,7493.9994790291,2
01001001,2,01001001_02,01,01 AGUASCALIENTES,1,1,33, , ,11121986,10,3, ,2,2,1, , ,3, ,1,1,01, , , ,2, ,2, , , , ,9,3, ,2,7, , , , ,1,1, ,1,2,2,2,2,2,2,2,2,2,2,2,2, , , , , , , , , , , , , , , , , , ,9, , , , , , , ,9, ,2, ,1,1, , , ,3,2,3, ,16, , , , , , , , , , , , , , , , , , , , , , , , , , , , , , , , , , , , , , , , , , , , , , , , , , , , , , , , , , , , , , , , , , , , , , , , , , , , , , , , , , , , , , , , , , , , , , , , , , , , , , , , , , , , , , , , , , , , , , , , , , , , , , , , , , , , , , ,1,12441.9717532986,3,4,13,0100108010001,3,11860.089477248,2
01001002,1,01001002_01,01,01 AGUASCALIENTES,1,2,67, , ,11011953,9,1, ,1,1,2,32, ,3, ,3, ,02, , , ,2, ,2, , , , ,2,6,1,1,5, , ,6,2,2, , , , , , , , , , , , , ,1,1,35, ,2,1, , , , ,1, , , , ,2, ,1, , ,9, , , , , , , ,2, ,1,2,1,9, , , , ,2,3, ,16, , , , , , , , , , , , , , , , , , , , , , , , , , , , , , , , , , , , , , , , , , , , , , , , , , , , , , , , , , , , , , , , , , , , , , , , , , , , , , , , , , , , , , , , , , , , , , , , , , , , , , , , , , , , , , , , , , , , , , , , , , , ,2,3,3,1, , , , , , , ,1,7178.39289355004,3,4,13,0100108010001,3,7550.92798323223,2
01001002,2,01001002_02,01,01 AGUASCALIENTES,1,1,29, , ,22121990,9,3, ,2,2,1, , ,1,1,3, ,01, , , ,2, ,2, , ,9, ,10,5, ,2,7, , , , ,1,1, ,1,3,3,3,1,3,2,2,2,2,2,2,2, , , , , , , , , , , , , , , , , , ,9, , , , , , , ,2, ,2, ,1,2, ,2, ,2,2,3, ,16, , , , , , , , , , , , , , , , , , , , , , , , , , , , , , , , , , , , , , , , , , , , , , , , , , , , , , , , , , , , , , , , , , , , , , , , , , , , , , , , , , , , , , , , , , , , , , , , , , , , , , , , , , , , , , , , , , , , , , , , , , , , , , , , , , , , , , ,1,12441.9717532986,3,4,13,0100108010001,3,11860.089477248,2
01001003,1,01001003_01,01,01 AGUASCALIENTES,1,2,92, , ,16061928,3,1, ,2,1,1, , ,3, ,3, ,01, , , ,2, ,2, , , , ,2,4,1,1,7, , ,6,2,2, , , , , , , , , , , , , ,1,1,28, ,2,1, , , , ,1, , , , ,1, ,1, , ,9, , , , , , , ,2, ,2, ,1,9, , , , ,2,3, ,16, , , , , , , , , , , , , , , , , , , , , , , , , , , , , , , , , , , , , , , , , , , , , , , , , , , , , , , , , , , , , , , , , , , , , , , , , , , , , , , , , , , , , , , , , , , , , , , , , , , , , , , , , , , , , , , , , , , , , , , , , , , ,3,3,3,1, , , , , , , ,1,7178.39289355004,3,4,13,0100108010001,3,7550.92798323223,2
01001004,1,01001004_01,01,01 AGUASCALIENTES,1,2,71, , ,5091949,1,1, ,1,1,2,11, ,3, ,3, ,01, , , ,2, ,2, , , , ,2,6,1,1,5, , ,6,2,2, , , , , , , , , , , , , ,1,2, , , , , , , , , , , , , , , , , , ,3, , , , , , , ,2, ,2, ,1,9, , , , ,2,3, ,16, , , , , , , , , , , , , , , , , , , , , , , , , , , , , , , , , , , , , , , , , , , , , , , , , , , , , , , , , , , , , , , , , , , , , , , , , , , , , , , , , , , , , , , , , , , , , , , , , , , , , , , , , , , , , , , , , , , , , , , , , , , ,3,3,3,1, , , , , , , ,1,7178.39289355004,3,4,13,0100108010001,3,7550.92798323223,2
01001004,2,01001004_02,01,01 AGUASCALIENTES,1,2,18, , ,12072002,3,4, ,1,2,3, , ,2, ,2, ,01, , , ,2, ,1,2,1, , ,4,2, ,2,7, , ,6,3,2, , , , , , , , , , , , , ,2,2, , , , , , , , , , , , , , , , , , ,9, , , , , , , ,2, ,2, ,1,9, , , , ,2,3, ,16, , , , , , , , , , , , , , , , , , , , , , , , , , , , , , , , , , , , , , , , , , , , , , , , , , , , , , , , , , , , , , , , , , , , , , , , , , , , , , , , , , , , , , , , , , , , , , , , , , , , , , , , , , , , , , , , , , , , , , , , , , , , , , , , , , , , , , ,1,10815.4541568632,3,4,13,0100108010001,3,10874.5013470486,2
01001004,3,01001004_03,01,01 AGUASCALIENTES,1,1,6, , ,21062014,3,4, ,2,3,1, , ,2, ,2, ,01, , , ,2, ,1,1,1, , ,1,3,2,3, , , , , , , , , , , , , , , , , , , ,3,2, , , , , , , , , , , , , , , , , , ,9, , , , , , , , , , , , , , , , , ,2,3, ,16, , , , , , , , , , , , , , , , , , , , , , , , , , , , , , , , , , , , , , , , , , , , , , , , , , , , , , , , , , , , , , , , , , , , , , , , , , , , , , , , , , , , , , , , , , , , , , , , , , , , , , , , , , , , , , , , , , , , , , , , , , , , , , , , , , , , , , ,1,10190.3566260919,3,4,13,0100108010001,3,10274.7717647268,2
01001005,1,01001005_01,01,01 AGUASCALIENTES,1,1,57, , ,20091963,0,1, ,2,1,1, , ,3, ,3, ,11, , , ,2, ,2, , , , ,4,1, ,1,7, , , , ,1,4, ,2,2,2,2,2,2,2,2,2,2,2,1,2, , , , , , , , , , , , , , , , , , ,9, , , , , , , ,2, ,2, ,1,5, , , ,3,2,3, ,16, , , , , , , , , , , , , , , , , , , , , , , , , , , , , , , , , , , , , , , , , , , , , , , , , , , , , , , , , , , , , , , , , , , , , , , , , , , , , , , , , , , , , , , , , , , , , , , , , , , , , , , , , , , , , , , , , , , , , , , , , , , , , , , , , , , , , , ,1,7092.69931081463,3,4,13,0100108010001,3,7493.9994790291,2
01001006,1,01001006_01,01,01 AGUASCALIENTES,1,2,75, , ,18061945,3,1, ,2,1,2,14, ,3, ,3, ,11, , , ,2, ,2, , , , ,0, ,2,1,7, , ,6,2,2, , , , , , , , , , , , , ,1,2, , , , , , , , , , , , , , , , , , ,9, , , , , , , ,2, ,2, ,1,9, , , , ,2,3, ,16, , , , , , , , , , , , , , , , , , , , , , , , , , , , , , , , , , , , , , , , , , , , , , , , , , , , , , , , , , , , , , , , , , , , , , , , , , , , , , , , , , , , , , , , , , , , , , , , , , , , , , , , , , , , , , , , , , , , , , , , , , , ,2,3,3,1, , , , , , , ,1,7178.39289355004,3,4,13,0100108010001,3,7550.92798323223,2
01001007,1,01001007_01,01,01 AGUASCALIENTES,1,1,73, , ,13061947,3,1, ,2,1,2,5, ,3, ,3, ,02, , , ,2, ,2, , , , ,8,3, ,1,5, , , , ,1,4, ,1,1,2,2,2,2,2,2,1,2,2,1,1,15, ,1,1, , , , ,1, , , , ,2, ,1, , ,1,3,4, , , , , ,2, ,1,2,3,9, , , , ,2,3, ,16, , , , , , , , , , , , , , , , , , , , , , , , , , , , , , , , , , , , , , , , , , , , , , , , , , , , , , , , , , , , , , , , , , , , , , , , , , , , , , , , , , , , , , , , , , , , , , , , , , , , , , , , , , , , , , , , , , , , , , , , , , , ,2,3,2,2, , , , , , , ,1,7143.91610062019,3,4,13,0100108010001,3,7548.11408043834,2
01001008,1,01001008_01,01,01 AGUASCALIENTES,1,1,77, , ,31011943,8,1, ,1,1,1, , ,3, ,3, ,01, , , ,2, ,2, , , , ,8,3, ,1,6,1,2, , ,1,4, ,1,1,2,2,2,2,2,2,2,2,2,1,2, , , , , , , , , , , , , , , , , , ,3, , , , , , , ,2, ,2, ,3,5, , , ,2,2,3, ,16, , , , , , , , , , , , , , , , , , , , , , , , , , , , , , , , , , , , , , , , , , , , , , , , , , , , , , , , , , , , , , , , , , , , , , , , , , , , , , , , , , , , , , , , , , , , , , , , , , , , , , , , , , , , , , , , , , , , , , , , , , , ,1,3,2,2,3,4,5, , , , ,1,7143.91610062019,3,4,13,0100108010001,3,7548.11408043834,2
01001008,2,01001008_02,01,01 AGUASCALIENTES,1,2,77, , ,18011943,8,2, ,1,2,1, , ,3, ,3, ,01, , , ,2, ,2, , , , ,8,3, ,2,6,1,1,6,2,2, , , , , , , , , , , , , ,2,1,16, ,2,1, , , , ,1, , , , ,1, ,1, , ,3, , , , , , , ,2, ,1,3,3,9, , , , ,2,3, ,16, , , , , , , , , , , , , , , , , , , , , , , , , , , , , , , , , , , , , , , , , , , , , , , , , , , , , , , , , , , , , , , , , , , , , , , , , , , , , , , , , , , , , , , , , , , , , , , , , , , , , , , , , , , , , , , , , , , , , , , , , , , ,3,3,3,1, , , , , , , ,1,7230.22848164695,3,4,13,0100108010001,3,7605.45366864574,2
01001008,3,01001008_03,01,01 AGUASCALIENTES,1,1,39, , ,14101980,11,3, ,2,3,1, , ,1,2,1,1,01, , , ,2, ,2, , , , ,8,3, ,3,7, , , , ,1,1, ,1,1,1,2,1,1,1,1,1,2,3,3,2, , , , , , , , , , , , , , , , , , ,1,3, , , , , , ,2, ,2, ,3,1, , , ,4,2,3, ,16, , , , , , , , , , , , , , , , , , , , , , , , , , , , , , , , , , , , , , , , , , , , , , , , , , , , , , , , , , , , , , , , , , , , , , , , , , , , , , , , , , , , , , , , , , , , , , , , , , , , , , , , , , , , , , , , , , , , , , , , , , , , , , , , , , , , , , ,1,11013.8823240854,3,4,13,0100108010001,3,11495.2795026431,2
01001009,1,01001009_01,01,01 AGUASCALIENTES,1,1,45, , ,24051975,4,1, ,1,1,2,11, ,2, ,2, ,02, , , ,2, ,2, , , , ,11,2, ,1,6,1,2, , ,1,1, ,1,1,1,2,1,1,1,1,1,2,1,1,2, , , , , , , , , , , , , , , , , , ,9, , , , , , , ,1,3,1,2,1,1, , , ,2,2,3, ,16, , , , , , , , , , , , , , , , , , , , , , , , , , , , , , , , , , , , , , , , , , , , , , , , , , , , , , , , , , , , , , , , , , , , , , , , , , , , , , , , , , , , , , , , , , , , , , , , , , , , , , , , , , , , , , , , , , , , , , , , , , , , , , , , , , , , , , ,1,11013.8823240854,3,4,13,0100108010001,3,11495.2795026431,2
01001009,2,01001009_02,01,01 AGUASCALIENTES,1,2,40, , ,30091980,0,2, ,1,2,1, , ,2, ,3, ,02, , , ,2, ,2, , , , ,10,5, ,2,6,1,1,6,2,2, , , , , , , , , , , , , ,2,2, , , , , , , , , , , , , , , , , , ,9, , , , , , , ,1,3,2, ,3,9, , , , ,2,3, ,16, , , , , , , , , , , , , , , , , , , , , , , , , , , , , , , , , , , , , , , , , , , , , , , , , , , , , , , , , , , , , , , , , , , , , , , , , , , , , , , , , , , , , , , , , , , , , , , , , , , , , , , , , , , , , , , , , , , , , , , , , , , , , , , , , , , , , , ,1,10043.7218791339,3,4,13,0100108010001,3,10103.6892904864,2
01001009,3,01001009_03,01,01 AGUASCALIENTES,1,1,16, , ,28012004,8,3, ,1,3,1, , ,1,2,1,1,02, , , ,2, ,1,1,1, , ,4,2, ,3,7, , ,6,3,2, , , , , , , , , , , , , ,3,2, , , , , , , , , , , , , , , , , , ,9, , , , , , , ,2, ,1,2,1,9, , , , ,2,3, ,16, , , , , , , , , , , , , , , , , , , , , , , , , , , , , , , , , , , , , , , , , , , , , , , , , , , , , , , , , , , , , , , , , , , , , , , , , , , , , , , , , , , , , , , , , , , , , , , , , , , , , , , , , , , , , , , , , , , , , , , , , , , , , , , , , , , , , , ,1,10478.8084471334,3,4,13,0100108010001,3,10389.820690689,2
01001009,4,01001009_04,01,01 AGUASCALIENTES,1,1,13, , ,13102006,11,3, ,2,4,1, , ,1,2,1,1,02, , , ,2, ,1,2,1, , ,3,2, ,4,7, , ,6,3,2, , , , , , , , , , , , , ,4,2, , , , , , , , , , , , , , , , , , ,9, , , , , , , ,2, ,1,2,3,9, , , , ,2,3, ,16, , , , , , , , , , , , , , , , , , , , , , , , , , , , , , , , , , , , , , , , , , , , , , , , , , , , , , , , , , , , , , , , , , , , , , , , , , , , , , , , , , , , , , , , , , , , , , , , , , , , , , , , , , , , , , , , , , , , , , , , , , , , , , , , , , , , , , ,1,10478.8084471334,3,4,13,0100108010001,3,10389.820690689,2
01001010,1,01001010_01,01,01 AGUASCALIENTES,1,1,36, , ,1121983,10,1, ,1,1,1, , ,3, ,3, ,01, , , ,2, ,2, , , , ,3,3, ,1,6,1,2, , ,1,1, ,1,1,2,1,3,1,2,2,1,2,2,1,2, , , , , , , , , , , , , , , , , , ,2, , , , , , , ,1,3,2, ,3,2, ,2, ,3,2,3, ,16, , , , , , , , , , , , , , , , , , , , , , , , , , , , , , , , , , , , , , , , , , , , , , , , , , , , , , , , , , , , , , , , , , , , , , , , , , , , , , , , , , , , , , , , , , , , , , , , , , , , , , , , , , , , , , , , , , , , , , , , , , , , , , , , , , , , , , ,1,12890.9741251584,3,4,13,0100108010001,3,13454.415642882,2
01001010,2,01001010_02,01,01 AGUASCALIENTES,1,2,35, , ,30111984,10,2, ,1,2,1, , ,2, ,2, ,01, , , ,2, ,2, , , , ,3,3, ,2,6,1,1, , ,1,1, ,2,1,2,2,2,2,2,2,2,2,2,2,2, , , , , , , , , , , , , , , , , , ,2, , , , , , , ,1,2,2, ,2,2, ,1, ,3,2,3, ,16, , , , , , , , , , , , , , , , , , , , , , , , , , , , , , , , , , , , , , , , , , , , , , , , , , , , , , , , , , , , , , , , , , , , , , , , , , , , , , , , , , , , , , , , , , , , , , , , , , , , , , , , , , , , , , , , , , , , , , , , , , , , , , , , , , , , , , ,1,11755.4696023097,3,4,13,0100108010001,3,11825.6572369104,2
01001010,3,01001010_03,01,01 AGUASCALIENTES,1,2,9, , ,19092011,0,3, ,2,3,1, , ,1,2,1,1,01, , , ,2, ,1,1,1, , ,2,3,1,3, , , , , , , , , , , , , , , , , , , ,3,1,44,SANGRADO TUBO DIGESTIVO BAJO,2,1, , , , ,1, , , , ,14, ,1, , ,2, , , , , , , , , , , , , , , , , ,2,3, ,16, , , , , , , , , , , , , , , , , , , , , , , , , , , , , , , , , , , , , , , , , , , , , , , , , , , , , , , , , , , , , , , , , , , , , , , , , , , , , , , , , , , , , , , , , , , , , , , , , , , , , , , , , , , , , , , , , , , , , , , , , , , , , , , , , , , , , , ,1,15380.8384123899,3,4,13,0100108010001,3,15626.6888951989,2
01001011,1,01001011_01,01,01 AGUASCALIENTES,1,1,78, , ,1081942,2,1, ,1,1,2,32, ,3, ,3, ,01, , , ,2, ,2, , , , ,2,6,1,1,6,1,2,6,4,2, , , , , , , , , , , , , ,1,2, , , , , , , , , , , , , , , , , , ,3, , , , , , , ,2, ,2, ,3,9, , , , ,2,3, ,16, , , , , , , , , , , , , , , , , , , , , , , , , , , , , , , , , , , , , , , , , , , , , , , , , , , , , , , , , , , , , , , , , , , , , , , , , , , , , , , , , , , , , , , , , , , , , , , , , , , , , , , , , , , , , , , , , , , , , , , , , , , ,1,3,3,1, , , , , , , ,1,8361.45102113616,3,4,13,0100108010001,3,8834.53630986152,2
01001011,2,01001011_02,01,01 AGUASCALIENTES,1,2,78, , ,25111941,10,2, ,2,2,2,32, ,3, ,3, ,01, , , ,2, ,2, , , , ,3,1, ,2,6,1,1,6,2,2, , , , , , , , , , , , , ,2,2, , , , , , , , , , , , , , , , , , ,1,3, , , , , , ,2, ,2, ,3,9, , , , ,2,3, ,16, , , , , , , , , , , , , , , , , , , , , , , , , , , , , , , , , , , , , , , , , , , , , , , , , , , , , , , , , , , , , , , , , , , , , , , , , , , , , , , , , , , , , , , , , , , , , , , , , , , , , , , , , , , , , , , , , , , , , , , , , , , ,3,3,3,1, , , , , , , ,1,8462.47358863387,3,4,13,0100108010001,3,8901.64826241184,2
01001012,1,01001012_01,01,01 AGUASCALIENTES,1,2,74, , ,3051946,5,1, ,1,1,1, , ,3, ,3, ,02,11, , ,2, ,2, , , , ,10,6, ,1,5, , ,6,4,2, , , , , , , , , , , , , ,1,2, , , , , , , , , , , , , , , , , , ,9, , , , , , , ,2, ,2, ,3,9, , , , ,2,3, ,16, , , , , , , , , , , , , , , , , , , , , , , , , , , , , , , , , , , , , , , , , , , , , , , , , , , , , , , , , , , , , , , , , , , , , , , , , , , , , , , , , , , , , , , , , , , , , , , , , , , , , , , , , , , , , , , , , , , , , , , , , , , ,2,3,2,2, , , , , , , ,1,8462.47358863387,3,4,13,0100108010001,3,8901.64826241184,2
01001012,2,01001012_02,01,01 AGUASCALIENTES,1,1,34, , ,7121985,10,3, ,1,2,1, , ,1,1,3, ,01, , , ,2, ,2, , , , ,10,6, ,2,7, , , , ,1,1, ,1,1,1,3,3,3,3,3,3,3,3,2,2, , , , , , , , , , , , , , , , , , ,9, , , , , , , ,2, ,1,2,1,2, ,1, ,3,2,3, ,16, , , , , , , , , , , , , , , , , , , , , , , , , , , , , , , , , , , , , , , , , , , , , , , , , , , , , , , , , , , , , , , , , , , , , , , , , , , , , , , , , , , , , , , , , , , , , , , , , , , , , , , , , , , , , , , , , , , , , , , , , , , , , , , , , , , , , , ,1,14667.6086018396,3,4,13,0100108010001,3,13981.638431943,2
01001012,3,01001012_03,01,01 AGUASCALIENTES,1,2,43, , ,20101976,11,3, ,2,3,1, , ,1,1,3, ,02, , , ,2, ,2, , , , ,10,6, ,3,4, , , , ,1,1, ,1,1,1,2,1,1,1,1,1,1,1,3,2, , , , , , , , , , , , , , , , , , ,9, , , , , , , ,2, ,1,2,3,1, , , ,3,2,3, ,16, , , , , , , , , , , , , , , , , , , , , , , , , , , , , , , , , , , , , , , , , , , , , , , , , , , , , , , , , , , , , , , , , , , , , , , , , , , , , , , , , , , , , , , , , , , , , , , , , , , , , , , , , , , , , , , , , , , , , , , , , , , , , , , , , , , , , , ,1,11755.4696023097,3,4,13,0100108010001,3,11825.6572369104,2
01001013,1,01001013_01,01,01 AGUASCALIENTES,1,1,75, , ,18121944,9,1, ,2,1,1, , ,3, ,3, ,02, , , ,2, ,2, , , , ,4,3, ,1,5, , ,6,4,2, , , , , , , , , , , , , ,1,2, , , , , , , , , , , , , , , , , , ,9, , , , , , , ,1,2,2, ,1,9, , , , ,2,3, ,16, , , , , , , , , , , , , , , , , , , , , , , , , , , , , , , , , , , , , , , , , , , , , , , , , , , , , , , , , , , , , , , , , , , , , , , , , , , , , , , , , , , , , , , , , , , , , , , , , , , , , , , , , , , , , , , , , , , , , , , , , , , ,1,3,3,1, , , , , , , ,1,8361.45102113616,3,4,13,0100108010001,3,8834.53630986152,2
01001014,1,01001014_01,01,01 AGUASCALIENTES,1,1,58, , ,28061962,3,1, ,1,1,1, , ,3, ,3, ,01, , , ,2, ,2, , , , ,4,3, ,1,6,1,2,6,1,2, , , , , , , , , , , , , ,1,1,8, ,1,1, , , , ,1, , , , ,14, ,1, , ,9, , , , , , , ,1,3,1,2,1,2, ,3, ,4,2,3, ,16, , , , , , , , , , , , , , , , , , , , , , , , , , , , , , , , , , , , , , , , , , , , , , , , , , , , , , , , , , , , , , , , , , , , , , , , , , , , , , , , , , , , , , , , , , , , , , , , , , , , , , , , , , , , , , , , , , , , , , , , , , , , , , , , , , , , , , ,1,8361.45102113616,3,4,13,0100108010001,3,8834.53630986152,2
01001014,2,01001014_02,01,01 AGUASCALIENTES,1,2,61, , ,26021959,7,2, ,2,2,1, , ,3, ,3, ,01, , , ,2, ,2, , , , ,7,2, ,2,6,1,1, , ,1,4, ,2,2,2,2,2,2,2,2,2,2,2,2,1,8, ,1,1, , , , ,1, , , , ,14, ,1, , ,9, , , , , , , ,1,3,2, ,3,5, , , ,4,2,3, ,16, , , , , , , , , , , , , , , , , , , , , , , , , , , , , , , , , , , , , , , , , , , , , , , , , , , , , , , , , , , , , , , , , , , , , , , , , , , , , , , , , , , , , , , , , , , , , , , , , , , , , , , , , , , , , , , , , , , , , , , , , , , , , , , , , , , , , , ,1,8462.47358863387,3,4,13,0100108010001,3,8901.64826241184,2
01001015,1,01001015_01,01,01 AGUASCALIENTES,1,1,60, , ,1121959,10,1, ,1,1,1, , ,3, ,3, ,01, , , ,2, ,2, , , , ,10,5, ,1,6,1,2,6,4,2, , , , , , , , , , , , , ,1,1,44,CATETERISMO,2,2,05,13, ,NO ESTAN DANDO  SERVICIO, , , , , , , , , , ,2, , , , , , , ,2, ,1,2,1,9, , , , ,2,3, ,16, , , , , , , , , , , , , , , , , , , , , , , , , , , , , , , , , , , , , , , , , , , , , , , , , , , , , , , , , , , , , , , , , , , , , , , , , , , , , , , , , , , , , , , , , , , , , , , , , , , , , , , , , , , , , , , , , , , , , , , , , , , , , , , , , , , , , , ,1,7188.28825031348,3,4,13,0100108010001,3,7594.99677659014,2
01001015,2,01001015_02,01,01 AGUASCALIENTES,1,2,56, , ,26071964,2,2, ,1,2,2,32, ,2, ,3, ,01, , , ,2, ,2, , , , ,7,3, ,2,6,1,1,6,4,2, , , , , , , , , , , , , ,2,1,15, ,1,1, , , , ,1, , , , ,1, ,1, , ,1,3, , , , , , ,2, ,1,2,1,9, , , , ,1,3, ,04, , , , , , , , , , , , , , , , ,10,2,07, , , , , , , , , , ,2, , , , , , , , ,2,01, , , , , , , , , , , , , , ,1, , , ,3, , , , , , , , , , , , , , , , , , , , , , , , , , , , , , , , , , , , , , , , , , , , , , , , , , , , , , , , , , , , , , , , , , , , , , , , , , , ,1,7275.13673308575,3,4,13,0100108010001,3,7652.69251130814,2
01001015,3,01001015_03,01,01 AGUASCALIENTES,1,2,26, , ,21111993,10,3, ,2,3,1, , ,1,2,1,1,01, , , ,2, ,1,2,4, , ,10,5, ,3,7, , , , ,1,1, ,1,3,1,2,1,3,2,3,2,2,2,3,2, , , , , , , , , , , , , , , , , , ,9, , , , , , , ,2, ,1,2,3,2, ,1, ,2,2,3, ,16, , , , , , , , , , , , , , , , , , , , , , , , , , , , , , , , , , , , , , , , , , , , , , , , , , , , , , , , , , , , , , , , , , , , , , , , , , , , , , , , , , , , , , , , , , , , , , , , , , , , , , , , , , , , , , , , , , , , , , , , , , , , , , , , , , , , , , ,1,11418.7742422938,3,4,13,0100108010001,3,11295.69039898,2
01001016,1,01001016_01,01,01 AGUASCALIENTES,1,1,26, , ,18091994,0,1, ,1,1,1, , ,2, ,2, ,01, , , ,2, ,2, , ,7, ,3,3, ,1,1,1,2, , ,1,1, ,1,1,1,2,1,1,2,1,1,2,1,1,2, , , , , , , , , , , , , , , , , , ,9, , , , , , , ,2, ,2, ,3,2, ,1, ,4,2,3, ,16, , , , , , , , , , , , , , , , , , , , , , , , , , , , , , , , , , , , , , , , , , , , , , , , , , , , , , , , , , , , , , , , , , , , , , , , , , , , , , , , , , , , , , , , , , , , , , , , , , , , , , , , , , , , , , , , , , , , , , , , , , , , , , , , , , , , , , ,1,12609.6533133161,3,4,13,0100108010001,3,12019.9289580735,2
01001016,2,01001016_02,01,01 AGUASCALIENTES,1,2,21, , ,3021999,8,2, ,1,2,1, , ,2, ,2, ,01, , , ,2, ,2, , ,2, ,3,3, ,2,1,1,1,6,2,2, , , , , , , , , , , , , ,2,2, , , , , , , , , , , , , , , , , , ,9, , , , , , , ,2, ,2, ,1,9, , , , ,2,3, ,16, , , , , , , , , , , , , , , , , , , , , , , , , , , , , , , , , , , , , , , , , , , , , , , , , , , , , , , , , , , , , , , , , , , , , , , , , , , , , , , , , , , , , , , , , , , , , , , , , , , , , , , , , , , , , , , , , , , , , , , , , , , , , , , , , , , , , , ,1,11418.7742422938,3,4,13,0100108010001,3,11295.69039898,2
01001016,3,01001016_03,01,01 AGUASCALIENTES,1,1,6, , ,11042014,6,3, ,1,3,1, , ,1,2,1,1,01, , , ,2, ,1,1,1, , ,1,3,2,3, , , , , , , , , , , , , , , , , , , ,3,2, , , , , , , , , , , , , , , , , , ,9, , , , , , , , , , , , , , , , , ,2,3, ,16, , , , , , , , , , , , , , , , , , , , , , , , , , , , , , , , , , , , , , , , , , , , , , , , , , , , , , , , , , , , , , , , , , , , , , , , , , , , , , , , , , , , , , , , , , , , , , , , , , , , , , , , , , , , , , , , , , , , , , , , , , , , , , , , , , , , , , ,1,10327.6929687616,3,4,13,0100108010001,3,10413.2457777286,2
01001016,4,01001016_04,01,01 AGUASCALIENTES,1,2,4, , ,12112015,11,3, ,1,4,1, , ,1,2,1,1,01, , , ,2, ,1,1,1, , ,1,2, ,4, , , , , , , , , , , , , , , , , , , ,4,2, , , , , , , , , , , , , , , , , , ,9, , , , , , , , , , , , , , , , , ,2,3, ,16, , , , , , , , , , , , , , , , , , , , , , , , , , , , , , , , , , , , , , , , , , , , , , , , , , , , , , , , , , , , , , , , , , , , , , , , , , , , , , , , , , , , , , , , , , , , , , , , , , , , , , , , , , , , , , , , , , , , , , , , , , , , , , , , , , , , , , ,1,14567.8377828174,3,4,13,0100108010001,3,14648.1083318886,2
01001016,5,01001016_05,01,01 AGUASCALIENTES,1,1,0, , ,12052020,5,3, ,2,5,1, , ,1,2,1,1,01, , , , , , , , , , , , , ,5, , , , , , , , , , , , , , , , , , , ,5,2, , , , , , , , , , , , , , , , , , ,9, , , , , , , , , , , , , , , , , ,2,3, ,16, , , , , , , , , , , , , , , , , , , , , , , , , , , , , , , , , , , , , , , , , , , , , , , , , , , , , , , , , , , , , , , , , , , , , , , , , , , , , , , , , , , , , , , , , , , , , , , , , , , , , , , , , , , , , , , , , , , , , , , , , , , , , , , , , , , , , , ,1,14306.293296757,3,4,13,0100108010001,3,13981.8601760746,2
01001017,1,01001017_01,01,01 AGUASCALIENTES,1,1,56, , ,6121963,10,1, ,1,1,1, , ,3, ,3, ,01, , , ,2, ,2, , , , ,3,3, ,1,6,1,2,6,5,2, , , , , , , , , , , , , ,1,1,31, ,2,2,05,09,10, , , , , , , , , , , ,1, , , , , , , ,2, ,2, ,1,9, , , , ,2,3, ,16, , , , , , , , , , , , , , , , , , , , , , , , , , , , , , , , , , , , , , , , , , , , , , , , , , , , , , , , , , , , , , , , , , , , , , , , , , , , , , , , , , , , , , , , , , , , , , , , , , , , , , , , , , , , , , , , , , , , , , , , , , , , , , , , , , , , , , ,1,7188.28825031348,3,4,13,0100108010001,3,7594.99677659014,2