Clave,Clave de la entidad,Clave del municipio,Clave del AGEB,Clave de la manzana,Folio,Numero del hogar,Urbano o rural,Numero de vivienda,Dia de la entrevista,Mes de la entrevista,Anio de la entrevista,Numero de personas,"Nombre, sexo y edad",Sexo,Anios del integrante,Meses del integrante,Parentesco,Pais nacimiento,Anios vividos en el estado,Pais anterior,Instituto,Instituto 2,Nivel de estudio,Nivel de estudio 2,Trabajo,No trabajo,Actividad,Tipo,Vacuna polio,triple o DTP,Sarampion,Rubeola,Paperas,Tetanos,Tuberculosis,Muestra senguinea,resul,nh,incovi,escolari,inse,nivelesc,fohoper,rubeol,bruce,chagas,toxop,tetano,saramp,hepat_b,dift,tosfe,cisticer,coleste,tifoidea,amiba01,amiba35,saramp2,shige,polio1,int,polio2,polio3,chagas2,toxop2,cars,nolab,chagas0,tosfev,tetv,cisv,sarv
01001055-3002,1,1,055-3,2,10001,1,U,2,18,2,88,4,1,2,66,0,1,32,53,32,5,0,3,6,2,4,0,0,,,0,0,0,0,0,1,1,1,1,1,1,1, 100011 1,,-,-,,+,,,,,-,180,-,-,-,,,,1,,,-,,2,64149,-,0,16,0,0
01001055-3002,1,1,055-3,2,10001,1,U,2,18,2,88,4,2,2,37,0,5,1,90,1,5,0,6,3,2,2,0,0,,,0,0,0,0,0,1,1,1,1,0,1,2, 100011 2,+,-,-,,+,,,,,+,187,-,-,-,,,,1,,,-,,4,64135,-,0,256,40,0
01001055-3002,1,1,055-3,2,10001,1,U,2,18,2,88,4,3,2,13,0,8,1,90,1,5,0,5,3,2,3,0,0,,,0,0,0,0,0,1,1,1,1,0,1,2, 100011 3,-,-,-,-,+,,,,+,-,155,-,-,-,,,,1,,,-,-,4,64254,-,32,256,0,0
01001055-3002,1,1,055-3,2,10001,1,U,2,18,2,88,4,4,1,1,3,8,1,90,1,5,0,0,0,0,0,0,0,1,1,0,2,2,0,0,3,2,1,1,0,1,0, 100011 4,,,,,,+,,,,,0,,,,+,,,3,,,,,0,0,,0,0,0,0
01001055-3034,1,1,055-3,34,10002,1,U,13,18,2,88,6,1,1,60,0,1,1,90,1,6,4,3,3,2,7,0,0,,,0,0,0,0,0,4,2,1,1,3,2,3, 100021 1,,,,,,,,,,,0,,,,,,,3,,,,,0,0,,0,0,0,0
01001055-3034,1,1,055-3,34,10002,1,U,13,18,2,88,6,2,2,60,0,2,14,8,14,6,4,2,3,2,2,0,0,,,0,0,0,0,0,1,3,1,1,0,2,3, 100021 2,,-,-,,+,,,,,-,189,-,-,-,,,,1,,,-,,2,64098,-,0,256,0,0
01001055-3034,1,1,055-3,34,10002,1,U,13,18,2,88,6,3,2,20,0,5,1,90,1,6,4,3,6,1,0,24,11,,,0,0,0,0,0,2,2,1,1,0,2,1, 100021 3,,,,,,,,,,,0,,,,,,,3,,,,,0,0,,0,0,0,0
01001055-3034,1,1,055-3,34,10002,1,U,13,18,2,88,6,4,2,19,0,5,1,90,1,6,4,3,6,1,0,24,7,,,0,0,0,0,0,4,2,1,1,0,2,1, 100021 4,,,,,,,,,,,0,,,,,,,3,,,,,0,0,,0,0,0,0
01001055-3034,1,1,055-3,34,10002,1,U,13,18,2,88,6,5,1,17,0,5,1,90,1,6,4,3,7,2,3,0,0,,,0,0,0,0,0,1,3,1,1,0,2,1, 100021 5,,-,-,,-,,,,,-,149,-,-,-,,,,1,,,-,,2,64092,-,0,1,0,0
01001055-3034,1,1,055-3,34,10002,1,U,13,18,2,88,6,6,1,14,0,5,1,90,1,6,4,3,5,2,3,0,0,,,0,0,0,0,0,4,2,1,1,0,2,1, 100021 6,,,,,,,,,,,0,,,,,,,3,,,,,0,0,,0,0,0,0
01001055-3035,1,1,055-3,35,10003,1,U,24,18,2,88,6,1,1,56,0,1,6,18,6,4,0,1,9,1,0,23,30,,,0,0,0,0,0,1,3,1,1,1,1,1, 100031 1,,-,-,,-,,,,,-,188,-,-,-,,,,1,,,-,,4,64156,-,0,1,0,0
01001055-3035,1,1,055-3,35,10003,1,U,24,18,2,88,6,2,2,45,0,2,32,18,32,4,0,3,6,2,2,0,0,,,0,0,0,0,0,1,3,1,1,0,1,1, 100031 2,,-,-,,-,,,,,-,255,-,-,-,,,,1,,,-,,4,64161,-,0,1,0,0
01001055-3035,1,1,055-3,35,10003,1,U,24,18,2,88,6,3,2,21,0,5,32,18,32,4,6,2,9,2,3,0,0,,,0,0,0,0,0,1,3,1,1,0,1,1, 100031 3,+,-,-,-,+,,,,,-,171,-,-,-,,,,1,,,-,-,4,64097,-,0,32,0,0
01001055-3035,1,1,055-3,35,10003,1,U,24,18,2,88,6,4,2,19,0,5,14,18,14,4,0,1,9,2,3,0,0,,,0,0,0,0,0,4,2,1,1,0,1,1, 100031 4,,,,,,,,,,,0,,,,,,,3,,,,,0,0,,0,0,0,0
01001055-3035,1,1,055-3,35,10003,1,U,24,18,2,88,6,5,2,18,0,5,14,90,1,4,0,2,7,2,3,0,0,,,0,0,0,0,0,1,3,1,1,0,1,1, 100031 5,-,-,-,,+,,,,,-,166,-,-,-,,,,1,,,-,,6,64241,-,0,256,0,0
01001055-3035,1,1,055-3,35,10003,1,U,24,18,2,88,6,6,2,14,0,5,1,90,1,4,0,1,5,2,3,0,0,,,0,0,0,0,0,1,3,1,1,0,1,1, 100031 6,-,-,-,,+,+,,,+,-,180,-,-,-,+,,,1,,,-,,4,64140,-,32,128,0,0
01001055-3040,1,1,055-3,40,10005,1,U,46,18,2,88,2,1,2,76,0,1,14,20,32,8,0,3,4,2,4,0,0,,,0,0,0,0,0,1,1,1,1,1,1,1, 100051 1,,-,-,,-,,,,,-,214,-,-,-,,,,1,,,-,,6,64242,-,0,1,0,0
01001055-3040,1,1,055-3,40,10005,1,U,46,18,2,88,2,2,1,30,0,5,32,20,32,8,0,0,0,2,6,0,0,,,0,0,0,0,0,1,1,1,1,0,1,3, 100051 2,,-,+,,+,,,,,-,211,+,-,-,,,,1,,,+,,4,64137,+,0,256,0,0
01001026-7076,1,1,026-7,76,10007,1,U,17,15,2,88,3,1,2,60,0,1,32,90,1,8,0,2,3,2,2,0,0,,,0,0,0,0,0,4,2,1,1,3,2,3, 100071 1,,,,,,,,,,,0,,,,,,,3,,,,,0,0,,0,0,0,0
01001026-7076,1,1,026-7,76,10007,1,U,17,15,2,88,3,2,2,23,0,5,1,90,1,8,0,5,9,2,1,0,0,,,0,0,0,0,0,1,3,1,1,0,2,1, 100071 2,+,-,-,,+,,,,,-,191,-,-,-,,,,1,,,-,,4,63055,-,0,32,0,0
01001026-7076,1,1,026-7,76,10007,1,U,17,15,2,88,3,3,1,18,0,5,1,90,1,8,0,2,6,2,3,0,0,,,0,0,0,0,0,4,2,1,1,0,2,1, 100071 3,,,,,,,,,,,0,,,,,,,3,,,,,0,0,,0,0,0,0
01001026-7089,1,1,026-7,89,10008,1,U,29,15,2,88,3,1,1,69,0,1,10,90,1,6,0,5,3,2,4,0,0,,,0,0,0,0,0,1,1,1,1,2,1,2, 100081 1,,-,-,,-,,,,,-,194,-,-,-,,,,1,,,-,,6,63046,-,0,1,0,0
01001026-7089,1,1,026-7,89,10008,1,U,29,15,2,88,3,2,2,64,0,2,33,55,33,6,0,3,3,2,2,0,0,,,0,0,0,0,0,1,1,1,1,0,1,3, 100081 2,,-,-,+,-,,,,,-,273,-,-,-,,,,1,,,-,+,2,63042,-,0,1,0,0
01001026-7089,1,1,026-7,89,10008,1,U,29,15,2,88,3,3,2,36,0,5,1,90,1,6,0,6,3,2,2,0,0,,,0,0,0,0,0,1,1,1,1,0,1,2, 100081 3,+,-,-,,+,,,,,-,180,-,-,-,,,,1,,,-,,2,63039,-,0,32,0,0
01001026-7062,1,1,026-7,62,10009,1,U,42,15,2,88,3,1,1,29,0,1,1,90,1,8,0,3,7,1,0,24,7,,,0,0,0,0,0,2,2,1,1,1,1,1, 100091 1,,,,,,,,,,,0,,,,,,,3,,,,,0,0,,0,0,0,0
01001026-7062,1,1,026-7,62,10009,1,U,42,15,2,88,3,2,2,24,0,2,1,90,1,8,0,3,5,2,2,0,0,,,0,0,0,0,0,1,3,1,1,0,1,1, 100091 2,-,-,-,-,+,,,,,-,248,-,+,+,,,,1,,,-,-,2,63023,-,0,8,0,0
01001026-7062,1,1,026-7,62,10009,1,U,42,15,2,88,3,3,1,2,0,5,1,90,1,8,0,0,0,0,0,0,0,2,1,1,2,2,2,1,1,3,1,1,0,1,0, 100091 3,,-,-,,+,+,,,-,-,203,-,-,-,,,+,1,+,+,-,,6,63037,-,4,256,0,16
01001026-7526,1,1,026-7,526,10011,1,U,15,15,2,88,5,1,1,37,0,1,1,90,1,6,0,3,5,1,0,24,31,,,0,0,0,0,0,1,3,3,1,1,1,1, 100111 1,,-,-,,+,,,,,-,232,-,-,-,,,,1,,,-,,2,63031,-,0,256,0,0
01001026-7526,1,1,026-7,526,10011,1,U,15,15,2,88,5,2,2,30,0,2,8,11,8,6,8,4,9,1,0,24,7,,,0,0,0,0,0,1,3,3,1,0,1,1, 100111 2,+,-,-,,+,+,,,,-,215,-,-,-,+,,,1,,,-,,4,63025,-,0,16,0,0
01001026-7526,1,1,026-7,526,10011,1,U,15,15,2,88,3,3,1,7,0,5,1,90,1,6,8,2,3,0,0,0,0,5,5,1,1,2,1,1,1,3,3,1,0,1,3, 100111 3,,-,-,,+,+,,,-,-,170,-,-,-,+,,,1,,,-,,6,63250,-,8,256,0,0
01001026-7526,1,1,026-7,526,10011,1,U,15,15,2,88,5,4,1,2,0,5,1,90,1,6,8,0,0,0,0,0,0,5,5,1,1,2,0,1,4,2,3,1,0,1,0, 100111 4,,,,,,,,,,,0,,,,,,,3,,,,,0,0,,0,0,0,0
01001026-7526,1,1,026-7,526,10011,1,U,15,15,2,88,5,5,1,1,0,5,1,90,1,6,0,0,0,0,0,0,0,0,0,0,2,2,0,0,5,2,3,1,0,1,0, 100111 5,,,,,,,,,,,0,,,,,,,3,,,,,0,0,,0,0,0,0
01001026-7528,1,1,026-7,528,10012,1,U,9,15,2,87,7,1,1,45,0,1,21,17,21,8,0,6,9,1,0,24,7,,,0,0,0,0,0,2,2,2,1,1,1,1, 100121 1,,,,,,,,,,,0,,,,,,,3,,,,,0,0,,0,0,0,0
01001026-7528,1,1,026-7,528,10012,1,U,9,15,2,87,7,2,2,36,0,2,24,17,24,8,0,6,3,2,2,0,0,,,0,0,0,0,0,3,2,2,1,0,1,2, 100121 2,,,,,,,,,,,0,,,,,,,3,,,,,0,0,,0,0,0,0
01001026-7528,1,1,026-7,528,10012,1,U,9,15,2,87,7,3,2,17,0,5,1,90,1,8,0,2,7,2,3,0,0,,,0,0,0,0,0,3,2,2,1,0,1,1, 100121 3,,,,,,,,,,,0,,,,,,,3,,,,,0,0,,0,0,0,0
01001026-7528,1,1,026-7,528,10012,1,U,9,15,2,87,7,4,2,15,0,5,1,90,1,8,0,1,7,2,3,0,0,,,0,0,0,0,0,1,3,2,1,0,1,1, 100121 4,+,-,-,,+,,,,,-,152,-,-,-,,,,1,,,-,,6,63048,-,0,256,0,0
01001026-7528,1,1,026-7,528,10012,1,U,9,15,2,87,7,5,1,14,0,5,1,90,1,8,0,2,5,2,3,0,0,,,0,0,0,0,0,2,2,2,1,0,1,1, 100121 5,,,,,,,,,,,0,,,,,,,3,,,,,0,0,,0,0,0,0
01001026-7528,1,1,026-7,528,10012,1,U,9,15,2,87,7,6,2,11,0,5,1,90,1,8,0,5,3,0,0,0,0,3,3,1,2,2,0,1,4,2,2,1,0,1,2, 100121 6,,,,,,,,,,,0,,,,,,,3,,,,,0,0,,0,0,0,0
01001026-7528,1,1,026-7,528,10012,1,U,9,15,2,87,7,7,1,6,0,5,1,90,1,8,0,1,3,0,0,0,0,3,3,1,2,2,0,1,4,2,2,1,0,1,3, 100121 7,,,,,,,,,,,0,,,,,,,3,,,,,0,0,,0,0,0,0
01001026-7506,1,1,026-7,506,10016,1,U,14,15,2,88,7,1,1,37,0,1,32,9,32,8,4,6,9,1,0,24,7,,,0,0,0,0,0,2,2,2,1,1,1,1, 100161 1,,,,,,,,,,,0,,,,,,,3,,,,,0,0,,0,0,0,0
01001026-7506,1,1,026-7,506,10016,1,U,14,15,2,88,7,2,2,35,0,2,32,9,32,8,4,6,9,1,0,24,7,,,0,0,0,0,0,2,2,2,1,0,1,1, 100161 2,,,,,,,,,,,0,,,,,,,3,,,,,0,0,,0,0,0,0
01001026-7506,1,1,026-7,506,10016,1,U,14,15,2,88,7,3,2,7,0,5,1,90,1,8,4,2,3,0,0,0,0,8,9,1,2,2,0,1,4,2,2,1,0,1,3, 100161 3,,,,,,,,,,,0,,,,,,,3,,,,,0,0,,0,0,0,0
01001026-7506,1,1,026-7,506,10016,1,U,14,15,2,88,7,4,2,23,0,11,1,90,1,8,4,2,3,2,2,0,0,,,0,0,0,0,0,1,3,2,1,0,1,3, 100161 4,+,-,-,,+,,,,,-,120,-,-,-,,,,1,,,-,,6,63101,-,0,64,0,0
01001026-7506,1,1,026-7,506,10016,1,U,14,15,2,88,7,5,1,22,0,11,32,3,32,6,4,3,5,1,0,0,38,,,0,0,0,0,0,3,2,2,1,0,1,1, 100161 5,,,,,,,,,,,0,,,,,,,3,,,,,0,0,,0,0,0,0
01001026-7506,1,1,026-7,506,10016,1,U,14,15,2,88,7,6,2,3,0,11,32,90,1,6,4,0,0,0,0,0,0,5,9,1,2,2,0,1,4,2,2,1,0,1,0, 100161 6,,,,,,,,,,,0,,,,,,,3,,,,,0,0,,0,0,0,0
01001026-7506,1,1,026-7,506,10016,1,U,14,15,2,88,7,7,2,1,9,11,1,90,1,6,4,0,0,0,0,0,0,3,1,1,2,2,0,1,5,2,2,1,0,1,0, 100161 7,,,,,,,,,,,0,,,,,,,3,,,,,0,0,,0,0,0,0
01001026-7507,1,1,026-7,507,10017,8,U,28,15,2,88,8,1,1,44,0,1,32,5,32,4,5,6,3,1,0,17,32,,,0,0,0,0,0,4,2,2,1,2,1,2, 100178 1,,,,,,,,,,,0,,,,,,,3,,,,,0,0,,0,0,0,0
01001026-7507,1,1,026-7,507,10017,8,U,28,15,2,88,8,2,2,38,0,2,32,5,32,4,5,6,3,2,2,0,0,,,0,0,0,0,0,4,2,2,1,0,1,2, 100178 2,,,,,,,,,,,0,,,,,,,3,,,,,0,0,,0,0,0,0
01001026-7507,1,1,026-7,507,10017,8,U,28,15,2,88,8,3,1,17,0,5,32,5,32,4,5,2,7,2,3,0,0,,,0,0,0,0,0,4,2,2,1,0,1,1, 100178 3,,,,,,,,,,,0,,,,,,,3,,,,,0,0,,0,0,0,0
01001026-7507,1,1,026-7,507,10017,8,U,28,15,2,88,8,4,2,16,0,5,32,5,32,4,5,2,7,2,3,0,0,,,0,0,0,0,0,4,2,2,1,0,1,1, 100178 4,,,,,,,,,,,0,,,,,,,3,,,,,0,0,,0,0,0,0
01001026-7507,1,1,026-7,507,10017,8,U,28,15,2,88,8,5,2,14,0,5,32,5,32,4,5,2,5,2,3,0,0,,,0,0,0,0,0,4,2,2,1,0,1,1, 100178 5,,,,,,,,,,,0,,,,,,,3,,,,,0,0,,0,0,0,0
01001026-7507,1,1,026-7,507,10017,8,U,28,15,2,88,8,6,2,10,0,5,32,5,32,4,5,4,3,0,0,0,0,5,5,1,2,2,2,1,4,2,2,1,0,1,2, 100178 6,,,,,,,,,,,0,,,,,,,3,,,,,0,0,,0,0,0,0
01001026-7507,1,1,026-7,507,10017,8,U,28,15,2,88,8,7,2,7,0,5,1,5,32,4,5,0,1,0,0,0,0,5,5,1,2,2,2,1,4,2,2,1,0,1,3, 100178 7,,,,,,,,,,,0,,,,,,,3,,,,,0,0,,0,0,0,0
01001026-7507,1,1,026-7,507,10017,8,U,28,15,2,88,8,8,2,6,0,5,1,5,32,1,8,0,0,0,0,0,0,5,5,1,2,2,2,1,4,2,2,1,0,1,3, 100178 8,,,,,,,,,,,0,,,,,,,3,,,,,0,0,,0,0,0,0
01001026-7509,1,1,026-7,509,10018,1,U,42,15,2,88,6,1,1,39,0,1,1,14,15,8,0,6,9,1,0,24,7,,,0,0,0,0,0,4,2,1,1,1,1,1, 100181 1,,,,,,,,,,,0,,,,,,,3,,,,,0,0,,0,0,0,0
01001026-7509,1,1,026-7,509,10018,1,U,42,15,2,88,6,2,2,35,0,2,15,14,15,8,0,3,8,1,0,24,7,,,0,0,0,0,0,4,2,1,1,0,1,1, 100181 2,,,,,,,,,,,0,,,,,,,3,,,,,0,0,,0,0,0,0
01001026-7509,1,1,026-7,509,10018,1,U,42,15,2,88,6,3,1,15,0,5,15,14,15,8,0,1,7,2,3,0,0,,,0,0,0,0,0,4,2,1,1,0,1,1, 100181 3,,,,,,,,,,,0,,,,,,,3,,,,,0,0,,0,0,0,0
01001026-7509,1,1,026-7,509,10018,1,U,42,15,2,88,6,4,2,12,0,5,15,90,1,8,0,6,3,2,3,0,0,,,0,0,0,0,0,4,2,1,1,0,1,2, 100181 4,,,,,,,,,,,0,,,,,,,3,,,,,0,0,,0,0,0,0
01001026-7509,1,1,026-7,509,10018,1,U,42,15,2,88,6,5,2,7,0,5,15,90,1,8,0,1,3,0,0,0,0,5,5,1,2,2,0,1,4,2,1,1,0,1,3, 100181 5,,,,,,,,,,,0,,,,,,,3,,,,,0,0,,0,0,0,0
01001026-7509,1,1,026-7,509,10018,1,U,42,15,2,88,6,6,2,1,0,5,15,90,1,8,0,0,0,0,0,0,0,4,3,1,2,2,0,1,4,2,1,1,0,1,0, 100181 6,,,,,,,,,,,0,,,,,,,3,,,,,0,0,,0,0,0,0
01001026-7512,1,1,026-7,512,10019,1,U,56,15,2,88,9,1,1,41,0,1,1,90,1,6,4,2,7,1,0,16,28,,,0,0,0,0,0,2,2,3,1,1,1,1, 100191 1,,,,,,,,,,,0,,,,,,,3,,,,,0,0,,0,0,0,0
01001026-7512,1,1,026-7,512,10019,1,U,56,15,2,88,9,2,2,35,0,2,1,90,1,6,4,6,3,2,2,0,0,,,0,0,0,0,0,1,3,3,1,0,1,2, 100191 2,+,-,-,,+,,,,,-,237,-,-,-,,,,1,,,-,,6,63096,-,0,128,0,0
01001026-7512,1,1,026-7,512,10019,1,U,56,15,2,88,9,3,1,14,0,5,1,90,1,6,4,2,5,2,3,0,0,,,0,0,0,0,0,2,2,3,1,0,1,1, 100191 3,,,,,,,,,,,0,,,,,,,3,,,,,0,0,,0,0,0,0
01001026-7512,1,1,026-7,512,10019,1,U,56,15,2,88,9,4,2,12,0,5,1,90,1,6,4,5,3,2,3,0,0,,,0,0,0,0,0,1,3,3,1,0,1,2, 100191 4,-,-,-,,+,+,,,-,-,186,-,-,-,+,,,1,,,-,,4,63099,-,8,64,0,0
01001026-7512,1,1,026-7,512,10019,1,U,56,15,2,88,9,5,1,9,0,5,1,90,1,6,4,2,3,0,0,0,0,5,5,1,2,2,2,1,1,3,3,1,0,1,3, 100191 5,,-,-,,+,+,,,-,-,185,-,-,-,+,,,1,,,-,,1,63114,-,2,128,0,0
01001026-7512,1,1,026-7,512,10019,1,U,56,15,2,88,9,6,1,8,0,5,1,90,1,6,4,2,3,0,0,0,0,5,5,1,2,2,2,1,1,3,3,1,0,1,3, 100191 6,,-,-,,+,,,,-,-,161,-,-,-,,,,1,,,-,,1,63113,-,2,128,0,0
01001026-7512,1,1,026-7,512,10019,1,U,56,15,2,88,9,7,1,6,0,5,1,90,1,6,4,0,0,0,0,0,0,5,5,1,2,2,2,1,1,3,3,1,0,1,3, 100191 7,,,,,,,,,,,0,,,,,,,2,,,,,3,63900,,0,0,0,0
01001026-7512,1,1,026-7,512,10019,1,U,56,15,2,88,9,8,2,3,0,5,1,90,1,6,4,0,0,0,0,0,0,3,3,1,2,2,2,1,2,2,3,1,0,1,0, 100191 8,,,,,,,,,,,0,,,,,,,3,,,,,0,0,,0,0,0,0
01001026-7512,1,1,026-7,512,10019,1,U,56,15,2,88,9,9,1,1,0,5,1,90,1,6,4,0,0,0,0,0,0,3,1,1,2,2,2,1,3,2,3,1,0,1,0, 100191 9,,,,,,,,,,,0,,,,,,,3,,,,,0,0,,0,0,0,0
01001026-7512,1,1,026-7,512,10020,1,U,70,15,2,87,4,1,2,40,0,1,32,15,26,8,0,2,10,1,0,24,7,,,0,0,0,0,0,1,3,1,1,1,1,1, 100201 1,-,-,-,,+,,,,,-,157,-,-,-,,,,1,,,-,,6,64433,-,0,32,0,0
01001026-7512,1,1,026-7,512,10020,1,U,70,15,2,87,4,2,2,33,0,6,9,0,14,8,0,6,9,1,0,24,7,,,0,0,0,0,0,1,3,1,1,0,1,1, 100201 2,+,-,-,,+,,,,,-,198,-,-,-,,,,1,,,-,,6,64422,-,0,32,0,0
01001026-7512,1,1,026-7,512,10020,1,U,70,15,2,87,4,3,2,16,0,11,14,0,14,8,0,3,5,2,3,0,0,,,0,0,0,0,0,2,2,1,1,0,1,1, 100201 3,,,,,,,,,,,0,,,,,,,3,,,,,0,0,,0,0,0,0
01001026-7512,1,1,026-7,512,10020,1,U,70,15,2,87,4,4,1,14,0,11,14,0,14,8,0,6,3,2,3,0,0,,,0,0,0,0,0,1,3,1,1,0,1,2, 100201 4,,-,-,,+,,,,-,-,146,-,-,-,,,,1,,,-,,6,64265,-,8,256,0,0
01001026-7005,1,1,026-7,5,10021,1,U,8,15,2,88,5,1,1,57,0,1,1,90,1,6,0,6,3,2,4,0,0,,,0,0,0,0,0,2,2,1,1,2,1,2, 100211 1,,,,,,,,,,,0,,,,,,,3,,,,,0,0,,0,0,0,0
01001026-7005,1,1,026-7,5,10021,1,U,8,15,2,88,5,2,2,44,0,2,1,90,1,6,0,6,3,2,2,0,0,,,0,0,0,0,0,1,3,1,1,0,1,2, 100211 2,,,,,,,,,,,0,,,,,,,2,,,,,3,64084,,0,0,0,0
01001026-7005,1,1,026-7,5,10021,1,U,8,15,2,88,5,3,1,12,0,5,1,90,1,6,0,6,3,2,3,0,0,,,0,0,0,0,0,1,3,1,1,0,1,2, 100211 3,,-,-,,+,,,,+,-,201,-,-,-,,,,1,,,-,,6,63105,-,16,256,0,0
01001026-7005,1,1,026-7,5,10021,1,U,8,15,2,88,5,4,1,8,0,5,1,90,1,6,0,2,3,0,0,0,0,5,5,1,2,2,2,1,1,3,1,1,0,1,3, 100211 4,,-,-,,+,+,,,+,+,139,-,-,-,+,,,1,,,-,,6,63093,-,16,32,40,0
01001026-7005,1,1,026-7,5,10021,1,U,8,15,2,88,5,5,2,3,0,5,1,90,1,6,0,0,0,0,0,0,0,3,4,1,2,2,0,1,1,3,1,1,0,1,0, 100211 5,,,,,,,,,,,0,,,,,,,2,,,,,3,63896,,0,0,0,0
01001026-7005,1,1,026-7,5,10022,1,U,22,15,2,88,9,1,1,42,0,1,2,39,2,5,0,6,3,1,0,19,40,,,0,0,0,0,0,1,1,2,2,2,2,2, 100221 1,,-,-,,-,,,,,-,290,-,-,-,,,,1,,,-,,6,63109,-,0,1,0,0
01001026-7005,1,1,026-7,5,10022,1,U,22,15,2,88,9,2,2,35,0,2,1,90,1,5,0,3,3,2,2,0,0,,,0,0,0,0,0,1,1,2,2,0,2,3, 100221 2,+,-,-,-,+,,,,,-,165,-,-,-,,,,1,,,-,-,4,63106,-,0,32,0,0
01001026-7005,1,1,026-7,5,10022,1,U,22,15,2,88,9,3,2,80,0,4,1,90,1,5,0,0,0,2,2,0,0,,,0,0,0,0,0,1,1,2,2,0,2,3, 100221 3,,-,-,,-,,,,,+,198,+,-,-,,,,1,,,-,,1,63118,-,0,1,160,0
01001026-7005,1,1,026-7,5,10022,1,U,22,15,2,88,9,4,2,18,0,5,1,90,1,5,0,3,5,2,2,0,0,,,0,0,0,0,0,1,1,2,2,0,2,1, 100221 4,+,-,-,,+,,,,,-,169,-,-,-,,,,1,,,-,,6,63108,-,0,16,0,0
01001026-7005,1,1,026-7,5,10022,1,U,22,15,2,88,9,5,1,16,0,5,1,90,1,5,0,1,6,2,3,0,0,,,0,0,0,0,0,1,1,2,2,0,2,1, 100221 5,,-,-,,+,,,,,-,215,-,-,-,,,,1,,,-,,4,63107,-,0,128,0,0
01001026-7005,1,1,026-7,5,10022,1,U,22,15,2,88,9,6,1,14,0,5,1,90,1,5,0,3,5,2,2,0,0,,,0,0,0,0,0,1,1,2,2,0,2,1, 100221 6,,-,-,,+,+,,,-,-,167,-,-,-,+,,,1,,,-,,1,63164,-,4,256,0,0
01001026-7005,1,1,026-7,5,10022,1,U,22,15,2,88,9,7,1,13,0,5,1,90,1,5,0,6,3,2,3,0,0,,,0,0,0,0,0,1,1,2,2,0,2,2, 100221 7,,-,-,,+,,,,+,+,160,-,-,-,,,,1,,,-,,6,63102,-,16,256,40,0
01001026-7005,1,1,026-7,5,10022,1,U,22,15,2,88,9,8,1,5,0,5,1,90,1,5,0,0,0,0,0,0,0,5,5,1,2,2,0,1,1,1,2,2,0,2,0, 100221 8,,-,-,,+,,,,-,-,144,-,-,-,,,,1,,,-,,1,63112,-,4,256,0,0
01001026-7005,1,1,026-7,5,10022,1,U,22,15,2,88,9,9,2,3,0,5,1,90,1,5,0,0,0,0,0,0,0,5,5,1,2,2,0,1,1,1,2,2,0,2,0, 100221 9,,,,,,,,,,,0,,,,,,,2,,,,,3,63907,,0,0,0,0
01001026-7005,1,1,026-7,5,10023,1,U,35,15,2,88,7,1,1,44,0,1,1,90,1,6,5,6,3,1,0,1,44,,,0,0,0,0,0,2,2,1,1,2,1,2, 100231 1,,,,,,,,,,,0,,,,,,,3,,,,,0,0,,0,0,0,0
01001026-7005,1,1,026-7,5,10023,1,U,35,15,2,88,7,2,2,38,0,2,1,90,1,6,5,6,3,2,2,0,0,,,0,0,0,0,0,1,3,1,1,0,1,2, 100231 2,-,-,-,-,-,,,,,-,228,-,-,+,,,,1,,,-,-,6,63115,-,0,1,0,0
01001026-7005,1,1,026-7,5,10023,1,U,35,15,2,88,7,3,1,20,0,5,1,90,1,6,5,3,5,1,0,1,44,,,0,0,0,0,0,2,2,1,1,0,1,1, 100231 3,,,,,,,,,,,0,,,,,,,3,,,,,0,0,,0,0,0,0
01001026-7005,1,1,026-7,5,10023,1,U,35,15,2,88,7,4,1,18,0,5,1,90,1,6,5,2,2,2,3,0,0,,,0,0,0,0,0,1,3,1,1,0,1,3, 100231 4,,-,-,,+,,,,,-,226,-,-,-,,,,1,,,-,,7,63116,-,0,256,0,0
01001026-7005,1,1,026-7,5,10023,1,U,35,15,2,88,7,5,2,16,0,5,1,90,1,6,5,3,5,2,3,0,0,,,0,0,0,0,0,1,3,1,1,0,1,1, 100231 5,+,-,-,,+,,,,,-,152,-,-,-,,,,1,,,-,,6,63162,-,0,256,0,0
01001026-7005,1,1,026-7,5,10023,1,U,35,15,2,88,7,6,1,5,0,5,1,90,1,6,5,0,0,0,0,0,0,5,5,1,2,2,0,1,1,3,1,1,0,1,0, 100231 6,,,,,,,,,,,0,,,,,,,2,,,,,3,64072,,0,0,0,0
01001026-7005,1,1,026-7,5,10023,1,U,35,15,2,88,7,7,2,1,0,5,1,90,1,6,5,0,0,0,0,0,0,2,1,1,2,2,0,0,1,3,1,1,0,1,0, 100231 7,,,,,,,,,,,0,,,,,,,2,,,,,3,63901,,0,0,0,0
01001026-7005,1,1,026-7,5,10024,1,U,47,15,2,88,3,1,1,65,0,1,1,90,1,5,0,3,3,1,0,14,69,,,0,0,0,0,0,1,1,2,2,3,3,3, 100241 1,,-,-,,+,,,,,-,232,-,-,-,,,,1,,,-,,2,63111,-,0,64,0,0
01001026-7005,1,1,026-7,5,10024,1,U,47,15,2,88,3,2,2,63,0,2,1,90,1,5,0,3,3,2,2,0,0,,,0,0,0,0,0,1,1,2,2,0,3,3, 100241 2,,-,-,,-,,,,,-,217,-,+,-,,,,1,,,-,,6,63110,-,0,1,0,0
01001026-7005,1,1,026-7,5,10024,1,U,47,15,2,88,3,3,2,33,0,5,1,90,1,6,0,2,3,1,0,6,57,,,0,0,0,0,0,1,1,2,2,0,3,3, 100241 3,+,-,-,,+,,,,,-,143,-,-,-,,,,1,,,-,,6,64258,-,0,32,0,0
01001026-7005,1,1,026-7,5,10025,1,U,59,15,2,88,3,1,1,20,0,1,1,90,1,4,0,6,3,1,0,10,70,,,0,0,0,0,0,2,2,1,1,2,1,2, 100251 1,,,,,,,,,,,0,,,,,,,3,,,,,0,0,,0,0,0,0
01001026-7005,1,1,026-7,5,10025,1,U,59,15,2,88,3,2,2,16,0,2,1,90,1,4,0,3,3,2,2,0,0,,,0,0,0,0,0,4,2,1,1,0,1,3, 100251 2,,,,,,,,,,,0,,,,,,,3,,,,,0,0,,0,0,0,0
01001026-7005,1,1,026-7,5,10025,1,U,59,15,2,88,3,3,2,61,0,4,32,44,32,5,0,0,0,2,2,0,0,,,0,0,0,0,0,1,3,1,1,0,1,3, 100251 3,,-,-,,-,,,,,-,135,-,-,+,,,,1,,,-,,1,63104,-,0,1,0,0
01001026-7001,1,1,026-7,1,10027,1,U,14,15,2,88,4,1,1,31,0,1,1,90,1,4,6,0,0,1,0,14,69,,,0,0,0,0,0,2,2,3,1,3,2,3, 100271 1,,,,,,,,,,,0,,,,,,,3,,,,,0,0,,0,0,0,0
01001026-7001,1,1,026-7,1,10027,1,U,14,15,2,88,4,2,2,30,0,2,1,90,1,4,6,6,3,2,2,0,0,,,0,0,0,0,0,1,3,3,1,0,2,2, 100271 2,-,-,-,,+,,,,,-,183,-,-,-,,,,1,,,-,,4,63260,-,0,256,0,0
01001026-7001,1,1,026-7,1,10027,1,U,14,15,2,88,4,3,1,11,0,5,1,90,1,4,6,4,3,0,0,0,0,3,3,1,2,2,0,1,2,2,3,1,0,2,2, 100271 3,,,,,,,,,,,0,,,,,,,3,,,,,0,0,,0,0,0,0
01001026-7001,1,1,026-7,1,10027,1,U,14,15,2,88,4,4,1,7,0,5,1,90,1,4,6,1,3,0,0,0,0,3,3,1,2,2,0,1,2,2,3,1,0,2,3, 100271 4,,,,,,,,,,,0,,,,,,,3,,,,,0,0,,0,0,0,0
01001026-7002,1,1,026-7,2,10030,1,U,50,15,2,88,7,1,1,36,0,1,1,90,1,4,6,1,5,1,0,19,63,,,0,0,0,0,0,1,3,2,1,1,1,1, 100301 1,,-,-,,+,,,,,-,196,-,-,-,,,,1,,,-,,4,64259,-,0,64,0,0
01001026-7002,1,1,026-7,2,10030,1,U,50,15,2,88,7,2,2,36,0,2,1,90,1,4,6,3,3,2,2,0,0,,,0,0,0,0,0,1,3,2,1,0,1,3, 100301 2,+,-,-,,+,,,,,-,145,-,-,-,,,,1,,,-,,6,63120,-,0,256,0,0
01001026-7002,1,1,026-7,2,10030,1,U,50,15,2,88,7,3,1,14,0,5,1,90,1,6,0,2,5,2,3,0,0,,,0,0,0,0,0,2,2,2,1,0,1,1, 100301 3,,,,,,,,,,,0,,,,,,,3,,,,,0,0,,0,0,0,0
01001026-7002,1,1,026-7,2,10030,1,U,50,15,2,88,7,4,2,12,0,5,1,90,1,6,0,6,3,2,3,0,0,,,0,0,0,0,0,1,3,2,1,0,1,2, 100301 4,,-,,,+,,,,+,-,183,-,-,+,,,,1,,,,,4,64495,,16,256,0,0
01001026-7002,1,1,026-7,2,10030,1,U,50,15,2,88,7,5,1,11,0,5,1,90,1,6,0,5,3,0,0,0,0,9,9,9,9,9,9,9,1,3,2,1,0,1,2, 100301 5,,-,-,,+,,,,+,-,148,-,-,-,,,,1,,,-,,1,64445,-,32,256,0,0
01001026-7002,1,1,026-7,2,10030,1,U,50,15,2,88,7,6,1,3,0,5,1,90,1,6,0,0,0,0,0,0,0,5,3,1,2,2,0,1,1,3,2,1,0,1,0, 100301 6,,,,,,,,,,,0,,,,,,,2,,,,,3,63905,,0,0,0,0
01001026-7002,1,1,026-7,2,10030,1,U,50,15,2,88,7,7,1,86,0,11,1,90,1,6,4,0,0,2,4,0,0,,,0,0,0,0,0,1,3,2,1,0,1,3, 100301 7,,-,-,,+,,,,,-,184,-,-,+,,,,1,,,-,,6,63289,-,0,8,0,0
01001026-7020,1,1,026-7,20,10031,1,U,11,15,2,88,4,1,1,33,0,1,10,25,10,6,0,3,3,1,0,6,60,,,0,0,0,0,0,2,2,3,2,3,3,3, 100311 1,,,,,,,,,,,0,,,,,,,3,,,,,0,0,,0,0,0,0
01001026-7020,1,1,026-7,20,10031,1,U,11,15,2,88,4,2,2,27,0,2,32,20,32,6,0,3,6,2,2,0,0,,,0,0,0,0,0,1,3,3,2,0,3,1, 100311 2,+,-,-,,+,,,,,-,204,-,-,-,,,,1,,,-,,4,63122,-,0,128,0,0
01001026-7020,1,1,026-7,20,10031,1,U,11,15,2,88,4,3,1,5,0,5,1,90,1,6,0,0,0,0,0,0,0,3,3,1,2,2,0,1,1,3,3,2,0,3,0, 100311 3,,-,-,-,+,,,,+,-,147,-,-,-,,,,1,,,-,-,1,63097,-,16,256,0,0
01001026-7020,1,1,026-7,20,10031,1,U,11,15,2,88,4,4,1,3,0,5,1,90,1,6,0,0,0,0,0,0,0,3,3,1,2,2,0,1,1,3,3,2,0,3,0, 100311 4,,-,-,,+,+,,,+,-,174,-,-,-,,,+,1,+,+,-,,4,63117,-,32,256,0,16
01001026-7020,1,1,026-7,20,10032,1,U,24,15,2,88,9,1,1,45,0,1,32,7,32,4,8,6,3,1,0,23,30,,,0,0,0,0,0,4,2,2,2,2,2,2, 100321 1,,,,,,,,,,,0,,,,,,,3,,,,,0,0,,0,0,0,0
01001026-7020,1,1,026-7,20,10032,1,U,24,15,2,88,9,2,2,42,0,2,32,7,32,4,8,6,3,2,2,0,0,,,0,0,0,0,0,4,2,2,2,0,2,2, 100321 2,,,,,,,,,,,0,,,,,,,3,,,,,0,0,,0,0,0,0
01001026-7020,1,1,026-7,20,10032,1,U,24,15,2,88,9,3,2,21,0,5,32,7,32,4,8,3,8,2,2,0,0,,,0,0,0,0,0,4,2,2,2,0,2,1, 100321 3,,,,,,,,,,,0,,,,,,,3,,,,,0,0,,0,0,0,0
01001026-7020,1,1,026-7,20,10032,1,U,24,15,2,88,9,4,2,20,0,5,32,7,32,4,8,3,8,1,0,24,28,,,0,0,0,0,0,4,2,2,2,0,2,1, 100321 4,,,,,,,,,,,0,,,,,,,3,,,,,0,0,,0,0,0,0
01001026-7020,1,1,026-7,20,10032,1,U,24,15,2,88,9,5,1,19,0,5,32,7,32,4,8,1,9,1,0,24,7,,,0,0,0,0,0,4,2,2,2,0,2,1, 100321 5,,,,,,,,,,,0,,,,,,,3,,,,,0,0,,0,0,0,0
01001026-7020,1,1,026-7,20,10032,1,U,24,15,2,88,9,6,1,17,0,5,32,7,32,4,8,1,7,1,0,17,32,,,0,0,0,0,0,4,2,2,2,0,2,1, 100321 6,,,,,,,,,,,0,,,,,,,3,,,,,0,0,,0,0,0,0
01001026-7020,1,1,026-7,20,10032,1,U,24,15,2,88,9,7,1,15,0,5,32,7,32,4,8,2,7,1,0,17,32,,,0,0,0,0,0,4,2,2,2,0,2,1, 100321 7,,,,,,,,,,,0,,,,,,,3,,,,,0,0,,0,0,0,0
01001026-7020,1,1,026-7,20,10032,1,U,24,15,2,88,9,8,1,12,0,5,32,7,32,4,8,4,3,2,3,0,0,,,0,0,0,0,0,4,2,2,2,0,2,2, 100321 8,,,,,,,,,,,0,,,,,,,3,,,,,0,0,,0,0,0,0
01001026-7020,1,1,026-7,20,10032,1,U,24,15,2,88,9,9,2,10,0,5,32,7,32,4,8,4,3,0,0,0,0,0,0,0,2,2,0,1,4,2,2,2,0,2,2, 100321 9,,,,,,,,,,,0,,,,,,,3,,,,,0,0,,0,0,0,0
01001026-7008,1,1,026-7,8,10033,1,U,38,15,2,88,9,1,2,30,0,1,1,90,1,6,0,3,3,1,0,6,57,,,0,0,0,0,0,2,2,3,3,3,3,3, 100331 1,,,,,,,,,,,0,,,,,,,3,,,,,0,0,,0,0,0,0
01001026-7008,1,1,026-7,8,10033,1,U,38,15,2,88,9,2,2,63,0,4,1,90,1,6,0,0,0,2,2,0,0,,,0,0,0,0,0,1,3,3,3,0,3,3, 100331 2,,-,,,-,,,,,,222,-,-,,,,,1,,,,,4,63103,,0,1,0,0
01001026-7008,1,1,026-7,8,10033,1,U,38,15,2,88,9,3,1,70,0,3,14,50,14,6,0,0,0,2,6,0,0,,,0,0,0,0,0,4,2,3,3,0,3,3, 100331 3,,,,,,,,,,,0,,,,,,,3,,,,,0,0,,0,0,0,0
01001026-7008,1,1,026-7,8,10033,1,U,38,15,2,88,9,4,2,13,0,5,1,90,1,6,0,5,3,2,3,0,0,,,0,0,0,0,0,2,2,3,3,0,3,2, 100331 4,,,,,,,,,,,0,,,,,,,3,,,,,0,0,,0,0,0,0
01001026-7008,1,1,026-7,8,10033,1,U,38,15,2,88,9,5,1,12,0,5,1,90,1,6,0,5,3,2,3,0,0,,,0,0,0,0,0,2,2,3,3,0,3,2, 100331 5,,,,,,,,,,,0,,,,,,,3,,,,,0,0,,0,0,0,0
01001026-7008,1,1,026-7,8,10033,1,U,38,15,2,88,9,6,2,10,0,5,1,90,1,6,0,1,3,0,0,0,0,A,A,1,2,2,0,1,1,3,3,3,0,3,3, 100331 6,-,-,-,,+,,,,+,-,135,-,-,-,,,,1,,,-,,6,63091,-,16,128,0,0
01001026-7008,1,1,026-7,8,10033,1,U,38,15,2,88,9,7,1,9,0,5,1,90,1,6,0,1,3,0,0,0,0,A,A,1,2,2,0,1,1,3,3,3,0,3,3, 100331 7,,-,-,,+,,,,+,-,170,-,-,-,,,,1,,,-,,2,63098,-,16,64,0,0
01001026-7008,1,1,026-7,8,10033,1,U,38,15,2,88,9,8,2,5,0,5,1,90,1,6,0,0,0,0,0,0,0,3,3,1,2,2,0,1,1,3,3,3,0,3,0, 100331 8,,-,-,,+,,,,+,-,165,-,-,-,,,,1,,,-,,1,63100,-,16,256,0,0
01001026-7008,1,1,026-7,8,10033,1,U,38,15,2,88,9,9,1,1,4,5,1,90,1,6,0,0,0,0,0,0,0,1,1,0,2,2,0,0,5,2,3,3,0,3,0, 100331 9,,,,,,,,,,,0,,,,,,,3,,,,,0,0,,0,0,0,0
01001026-7008,1,1,026-7,8,10035,1,U,62,15,2,88,6,1,1,34,0,1,1,90,1,7,5,5,3,1,0,14,69,,,0,0,0,0,0,2,2,2,1,2,1,2, 100351 1,,,,,,,,,,,0,,,,,,,3,,,,,0,0,,0,0,0,0
01001026-7008,1,1,026-7,8,10035,1,U,62,15,2,88,6,2,2,32,0,2,1,90,1,7,5,6,3,2,2,0,0,,,0,0,0,0,0,1,3,2,1,0,1,2, 100351 2,+,-,-,-,+,,,,,-,158,-,-,-,,,,1,,,-,-,1,63252,-,0,128,0,0
01001026-7008,1,1,026-7,8,10035,1,U,62,15,2,88,6,3,1,13,0,5,1,90,1,7,5,6,3,2,3,0,0,,,0,0,0,0,0,1,3,2,1,0,1,2, 100351 3,,-,-,,+,,,,-,-,124,-,-,-,,,,1,,,-,,6,63094,-,8,256,0,0
01001026-7008,1,1,026-7,8,10035,1,U,62,15,2,88,6,4,2,12,0,5,1,90,1,7,5,6,3,2,3,0,0,,,0,0,0,0,0,1,3,2,1,0,1,2, 100351 4,+,-,-,,+,+,,,+,+,167,-,-,-,+,,,1,,,-,,1,63095,-,16,256,160,0
01001026-7008,1,1,026-7,8,10035,1,U,62,15,2,88,6,5,1,10,0,5,1,90,1,7,5,3,3,0,0,0,0,3,3,1,2,2,1,1,1,3,2,1,0,1,3, 100351 5,,-,-,,+,+,,,-,-,161,-,-,-,+,,,1,,,-,,6,63081,-,8,128,0,0